##TITLE=$$ Begin of the data block
##JCAMP-DX=5.00 $$ ACD/SpecManager v 10.08
##SPECTROMETER/DATA SYSTEM=16PC
##DATE=Tue Oct 01 09:17:51 2013
##DATA TYPE=INFRARED SPECTRUM
##DATA CLASS=XYDATA
##ORIGIN=
##OWNER=
##NPOINTS=3601
##FIRSTX=400.00000000
##LASTX=4000.00000000
##MAXX=4000.00000000
##MINX=400.00000000
##MAXY=29.80110550
##MINY=3.81124020
##XFACTOR=1.0000000000
##YFACTOR=0.000000100000000
##FIRSTY=16.85011292
##DELTAX=1.00000000
##XUNITS=1/CM
##YUNITS=TRANSMITTANCE
##XYDATA=(X++(Y..Y))
400A68501129J1964092R624482l659249n935917j219501M591465K1019935J5869866
$$ 168501129 180465221 190089703 186430454 180494537 179275036 183866501 204886436 220756302
408B20756302j5239964k2591838j3779393q146286J668453N562306M989376M235764
$$ 220756302 205516338 182924500 169145107 160998821 162667274 168229580 173218956 177454720
416A77454720J391868j91917k516270r30080O418476P467518L632545J312714k377014
$$ 177454720 178846588 178654671 176138401 175208321 181626797 189094315 192726860 194039574 191662560
425A91662560k299080L867626J701107j0858288j1150837L85513K840767j395702r74655
$$ 191662560 189363480 193231106 194932213 184073925 172923088 173308601 176149368 174753666 173779011
434A73779011L734112K858161n317459m060497P138252R506703N687485L880252J344929
$$ 173779011 177513123 180371284 175053825 170993328 178131580 187638283 193325768 197206020 198550949
443A98550949Q40187L221512K307644k756367k369633L700963M920253L573418J054764
$$ 198550949 199391136 202612648 204920292 202163925 199794292 203495255 208415508 211988926 213043690
452B13043690n001068o529808m267693l337383l210297q78830N828629N214920l433686
$$ 213043690 208042622 201512814 197245121 193907738 190697441 189818611 195647240 200862160 197428474
461A97428474n564689l573666k430916k9564J71662k140751k256641l19729m66576
$$ 197428474 191863785 188290119 185859203 185829639 186001301 183860550 181603909 181284180 180817604
470A80817604l375530k197514L778706M858970J738072J329651K136726L232956N990486
$$ 180817604 177442074 175244560 179023266 183882236 185620308 186949959 189086685 192319641 198310127
479A98310127N845566K406120J800766L503571L488998K199421J889935K275238K239227
$$ 198310127 204155693 206561813 208362579 211866150 215355148 217554569 219444504 221719742 223958969
488B23958969K443791J355876j751899k439728j464367k40326K169609L430119M583854
$$ 223958969 226402760 227758636 226006737 223567009 222102642 221862316 224031925 227462044 232045898
497B32045898L795624M41780j150608j844654k516250l128548k954235j953125j015911
$$ 232045898 235841522 236283302 235132694 233288040 230771790 227643242 224689007 222735882 221719971
506B21719971M91638R21955M59671J1196o82335j494903k980938l051758j917591q26130
$$ 221719971 222211609 223133564 223593235 223604431 222922096 221427193 218446255 215394497 213476906 212650776
516B12650776J269340J428357k78225j193753k378463k247811J39466n69344n034924
$$ 212650776 213920116 215348473 215070248 213876495 211498032 209250221 209389687 208820343 203785419
525B03785419n264282j670360n97725j137963n81016J267185R17435k323151k196789
$$ 203785419 198521137 196850777 196253052 195115089 194534073 195801258 196718693 194395542 192198753
534A92198753J614800J580963j684914l105869m589558l583183L63579K896080N800247
$$ 192198753 193813553 195394516 193709602 190603733 186014175 182430992 182794571 185690651 191490898
543A91490898O284714M473190K658615n57174j874695k062798j346359J076698K220650
$$ 191490898 197775612 202248802 204907417 204350243 202475548 200412750 199066391 200143089 202363739
552B02363739K676468L063927L854751K540589j734505l039360k638817j406174K202740
$$ 202363739 205040207 208104134 211958885 214499474 212764969 209725609 207086792 205680618 207883358
561B07883358K884388J107445K98996k33193j149177l034344k890587o42528M09355
$$ 207883358 210767746 211875191 212174187 211940994 210791817 207757473 204866886 204224358 204633713
570B04633713J351127J136284n50270j404762k584457j767388J780987K800693K185593
$$ 204633713 205984840 207121124 206570854 205166092 202581635 200814247 202595234 205395927 207581520
579B07581520J619816L5534J8825J866818J804581r1057l53356M20113J151085L014564
$$ 207581520 209201336 209236870 209255695 211122513 212927094 212836037 212482681 212902794 214053879 217068443
589B17068443K385369j147499k318154j882324k085190k292175k797585m044780l969441
$$ 217068443 219453812 218306313 215988159 214105835 212020645 209728470 206930885 202886105 198916664
598A98916664k526741j961956j630535j866341l491649k884865K37217J118660J87874
$$ 198916664 196389923 194427967 192797432 190931091 187439442 184554577 184791794 185910454 186098328
607A86098328M84466J244793K483616N369415N213013J486073R88006K898216L699055
$$ 186098328 186582794 187827587 190311203 195680618 200893631 202379704 203367710 206265926 209964981
616B09964981M511376M369239L285904K174607M06265m17710n29289o02493o73523
$$ 209964981 214476357 218845596 222131500 224306107 224712372 224294662 223765373 223162880 222489357
625B22489357P5817K179394K682190J834163J590024J764526J141548o65188q95977
$$ 222489357 222565174 224744568 227426758 229260921 230850945 232615471 233757019 233091831 232195854
634B32195854M54903O04858j24435k39620j68553L03498J746177J665840p0114m38442
$$ 232195854 232650757 233255615 233131180 232891560 232723007 233026505 234772682 236438522 236368408 235929966
644B35929966J78814K82764K92530K9107r64890o82831J240254J336803l74298n01881
$$ 235929966 236108780 236391544 236684074 236713181 235748291 235065460 236305714 237642517 237268219 236766338
654B36766338L70026J184940K850304K792358R28154J60447o91414J89552K530823
$$ 236766338 237136364 238321304 241171608 243963966 244892120 245052567 244361153 244550705 247081528
663B47081528N604973J3984680J0105133r174576j3726006q527278l796330O686211
$$ 247081528 252686501 266671181 276776314 267601738 253875732 245348454 241552124 248238335
671B48238335Q260002J077881q14438P7743k73475j458645j088848J265030J495361
$$ 248238335 256498337 257576218 256761780 256839523 256566048 255107403 254018555 255283585 256778946
680B56778946q3923o22750j056900m95186K034417J751670j348495k469063k711296
$$ 256778946 256695023 256072273 255015373 254520187 256554604 258306274 256957779 254488716 251777420
689B51777420k469063j447925m32721J567345J370926j317024k138386j964569j670132
$$ 251777420 249308357 247860432 247427711 248995056 250365982 249048958 246910572 244946003 243275871
698B43275871p70797l29247L39012m41551l453712l894578j600742k028942m265060
$$ 243275871 242505074 242175827 242514839 242073288 238619576 234724998 233124256 231095314 226830254
707B26830254o509076j0818958j0764351p401962k937775M707337R420624J3116607
$$ 226830254 220321178 209502220 198737869 191335907 188398132 193105469 202526093 215642700
715B15642700J4249554J2607822J0580769O573677M573574L979683L208408L244648
$$ 215642700 229892254 242500076 253080845 259654522 264228096 268207779 271416187 274660835
723B74660835J732331k032032k878190j173496o20117o30627J46389J448632K973556
$$ 274660835 276393166 274361134 271482944 270309448 269689331 269058704 269205093 270653725 273627281
732B73627281N718231N995522L789406K849121K458801J730919Q80470o4850j558532
$$ 273627281 279345512 285341034 289130440 291979561 294438362 296169281 297049751 296984901 295426369
741B95426369j816750n65300o85444k133369k205372j114616p14531n74341n64118
$$ 295426369 293609619 293044319 292358875 290225506 288020134 286905518 286190987 285616646 285052528
750B85052528o16531j131306k678165k578488p00244k52953r68933p10964N45749N62668
$$ 285052528 284435997 283304691 280626526 278048038 277347794 277094841 276125908 275414944 275960693 276523361
760B76523361o20384r26476p64389n77201k18621J69258P71294R89189Q36373Q56895
$$ 276523361 275902977 274976501 274212112 273634911 273416290 273585548 274356842 275346031 276182404 277039299
770B77039299J052609Q69274J28269R7523O34193J040688J903057J573562k26021p36484
$$ 277039299 278091908 278961182 279089451 279186974 279821167 280861855 282764912 284338474 284112453 283375969
780B83375969l08743k99930l73612n19256o47545j128445k093792k649536l182907
$$ 283375969 283067226 282767296 282393684 281874428 281226883 280098438 278004646 275355110 272172203
789B72172203l041496k146244j469136n61943k46543o23932m68026k27203O66142K906799
$$ 272172203 269130707 266984463 265515327 264953384 264706841 264082909 263614883 263387680 264053822 266960621
799B66960621L145695J610527P36236p02858k41775L080864K953758o37283j325856
$$ 266960621 270106316 271716843 272453079 271750221 271508446 274589310 277543068 276905785 275579929
808B75579929M1962M83761P64599Q04901N29289L18279j98364P6294J759300J285076
$$ 275579929 275621891 276105652 276870251 277675152 278204441 278522720 278324356 278400650 280159950 281445026
818B81445026j687755k229691n68886p25746k589225k583008o87142n60264k099991
$$ 281445026 279757271 277527580 276958694 276232948 273643723 271060715 270373573 269813309 267713318
827B67713318k060661m04835n30720k352714k814770k315274k318630k707958k487907
$$ 267713318 265652657 265247822 264717102 262364388 259549618 257234344 254915714 252207756 249719849
836B49719849j447907j426220k429008k593994k120724k073288k056122k590675m453411
$$ 249719849 248271942 246845722 244416714 241822720 239701996 237628708 235572586 232981911 228528500
845B28528500m017353j095543o5556J51157l82194k508869k920399j752605j770726
$$ 228528500 224511147 223415604 223350048 223501205 223119011 220610142 217689743 215937138 214166412
854B14166412k634048k941856k968312l017425l006230k963772k774238k875080l211746
$$ 214166412 211532364 208590508 205622196 202604771 199598541 196634769 193860531 190985451 187773705
863A87773705l568421l989677m516373n044212n949021p756481p991552o898165n976200
$$ 187773705 184205284 180215607 175699234 170655022 164706001 156949520 148957968 142059803 136083603
872A36083603n005360l368377j011134J232386M032850N539656O090403O184816N124092
$$ 136083603 131078243 127709866 126698732 127931118 131963968 137503624 143594027 149778843 154902935
881A54902935N203247N848408P056465R951134J0038604P769585N835304K951851J563072
$$ 154902935 160106182 165954590 173011055 182962189 193000793 200770378 206605682 209557533 211120605
890B11120605J537800R55334J64032l11604o17733o96907l29742m52271r73472j322022
$$ 211120605 212658405 213613739 213777771 213466167 212848434 212151527 211821785 211369514 210396042 209074020
900B09074020j590499j983395k772331k667179j374016j361122k484818k852898k879867
$$ 209074020 207483521 205500126 202727795 200060616 198686600 197325478 194840660 191987762 189107895
909A89107895k803574k571335k159118j481285r04579q0109l6945p96795j247177k036553
$$ 189107895 186304321 183732986 181573868 180092583 179188004 179107895 179070950 178274155 177026978 174990425
919A74990425j685867K12669N48363l74317o64959p59583q05855o65206p46727r21708
$$ 174990425 173304558 173517227 174065590 173691273 173026314 172266731 171460876 170795670 170048943 169127235
929A69127235j296291k228489k182731j115075p39593p55062o53973n39074n09500
$$ 169127235 167830944 165602455 163419724 162304649 161565056 160809994 160156021 159616947 159107447
938A59107447p48873m26054O06775R26018P96070N82695l1700j45435J27544L39756
$$ 159107447 158358574 157932520 158539295 159465313 160261383 160844078 160812378 160666943 160794487 161134243
948A61134243P19070P98474P28359L73840m06265r12666j375675j576186j497745j425743
$$ 161134243 161853313 162651787 163380146 163753986 163347721 162435055 161059380 159483194 157985449 156559706
958A56559706j161576j217603j568079j806259k019167k267599k645016k716780k557516
$$ 156559706 155398130 154180527 152612448 150806189 148787022 146519423 143874407 141157627 138600111
967A38600111k306700j693487j663923k194166k435923k544880k749205l150463l117084
$$ 138600111 136293411 134599924 132936001 130741835 128305912 125761032 123011827 119861364 116744280
976A16744280k516270k513170l187895l055811k240181j735449j157999j048088j432895
$$ 116744280 114228010 111714840 108526945 105471134 103230953 101495504 100337505 99289417 97856522
985I7856522j664639k069235j993179j447201j043320m43697l88145r48191j098632
$$ 97856522 96191883 94122648 92129469 90682268 89638948 89195251 88807106 87858915 86760283
994H6760283j034499j003503q31128r71079j463651j695633j872540j787424j387357
$$ 86760283 85725784 84722281 83891153 82920074 81456423 79760790 77888250 76100826 74713469
1003G4713469j092196o61373o37055j084327j203299j205683j047849o03676m24147
$$ 74713469 73621273 72959900 72322845 71238518 70035219 68829536 67781687 67178011 66753864
1012F6753864n32150k88248M27008M94480j33515j47819L52859M53472K70129K52485
$$ 66753864 66221714 65933466 66360474 66854954 66721439 66573620 66926479 67379951 67650080 67902565
1022F7902565L90768K73943j81675k33650O6042J80006L01361J93596l90530k25544
$$ 67902565 68293333 68567276 68385601 68151951 68217993 68397999 68699360 68892956 68502426 68276882
1032F8276882P63178J051188R50336P35998J1444Q6069R86576J293660J318693J232624
$$ 68276882 69040060 70091248 71041584 71777582 71789026 71875095 72861671 74155331 75474024 76706648
1042G6706648R44614O44923R9897N2690L03507R07183K393007K586842J624584J133919
$$ 76706648 77651262 78296185 78396082 78448772 78752279 79659462 82052469 84639311 86263895 87397814
1052H7397814O36577M18187M19855N90324J113176J303673J277685J255751J120091
$$ 87397814 88034391 88452578 88872433 89462757 90575933 91879606 93157291 94413042 95533133
1061I5533133J118421J258135J258850J166821J076459J114369O76155l83377q80957
$$ 95533133 96651554 97909689 99168539 100335360 101411819 102526188 103202343 102818966 101938009
1070A01938009j085043j105547o14881q16107j821518j981497j610279j100540O914
$$ 101938009 100852966 99747419 99132538 98316431 96494913 94513416 92903137 91802597 91809511
1079I1809511K64883k38180m09841o66857m34876M70639P35998N91993M28438K7895
$$ 91809511 92074394 91836214 91426373 90759516 90324640 90795279 91531277 92123270 92551708 92579603
1089I2579603j33037j16110j53065k35796j66655J3114K67505Q65936P66278j49966
$$ 92579603 92446566 92330456 92177391 91941595 91774940 91788054 92055559 92921495 93687773 93537807
1099I3537807l67879j27078J2637K36749L59774M85420L82900K7180k51293q07285
$$ 93537807 93169928 93042850 93055487 93292236 93652010 94137430 94520330 94547510 94296217 93488932
1109I3488932n52893O90222J120805J194954Q86202j63316m98295m63486j36614P85589
$$ 93488932 92936039 93626261 94747066 95942020 96828222 96664906 96166611 95703125 95566511 96352100
1119I6352100J164198J303673J122713M05789R5129j39237P9394R56296J290322J382112
$$ 96352100 97516298 98819971 99942684 100348473 100443602 100304365 100383759 101340055 102630377 104012489
1129A04012489J226664N14269M85658J197815J181364M83752L82185P89404P74383
$$ 104012489 105239153 105753422 106239080 107436895 108618259 109102011 109484196 110273600 111047983
1138A11047983M88997K57015q7023k08378j64032o2704K27928K86580O914K34604J081228
$$ 111047983 111536980 111793995 111706972 111498594 111334562 111271858 111499786 111786366 111793280 112027884 113109112
1149A13109112J251936R23156O80924K48432J44959L44038M30584N72443N13553K17676
$$ 113109112 114361048 115284204 115965128 116213560 116358519 116702557 117133141 117705584 118219137 118436813
1159A18436813Q3924O3896m9353l08752k98023o5804J66178O52313N94616j60217k04086
$$ 118436813 118520737 118584633 118535280 118226528 117928505 117862701 118028879 118681192 119275808 119115591 118911505
1170A18911505L34739N58377O05345Q16822J300573J281500P59125N09977L84331K02894
$$ 118911505 119246244 119804621 120409966 121226788 122527361 123808861 124567986 125077963 125462294 125665188
1180A25665188m2916j41620j22786q2016k4318J62601P73430N16176p64370j156807
$$ 125665188 125622272 125480652 125357866 125275850 125251532 125414133 126187563 126703739 125939369 124782562
1190A24782562r22203r28640j006127r66310o69956q65221j682043j853705j482010
$$ 124782562 123860359 122931719 121925592 120959282 120289326 119424105 117742062 115888357 114406347
1199A14406347j428365j561165j548291j501083j307726q50677p12633p69616r35316
$$ 114406347 112977982 111416817 109868526 108367443 107059717 106209040 105496407 104726791 103791475
1208A03791475j394272j497507j390934j141548n71966l26157k64406l04222n85079
$$ 103791475 102397203 100899696 99508762 98367214 97795248 97469091 97204685 96900463 96315384
1217I6315384o31809m85897m56334m58002n23328p05004p61748p87019o51837l26156
$$ 96315384 95683575 95197678 94741344 94283342 93760014 93055010 92293262 91506243 90854406 90528250
1227I0528250o1751L98875K74896o01768p79629m52518k97785r6798n0068j01805k74658
$$ 90528250 90466499 90865374 91140270 90538502 89758873 89306355 89008570 88911772 88861704 88759899 88485241
1238H8485241q08954p21932O0320K58684P7963k3603k37704k56538j18256J9789L25203
$$ 88485241 87676287 86954355 87014675 87273359 87351322 87327719 87090015 86833477 86715221 86735010 87060213
1249H7060213K83957k03610k25782J51157K79904L01361K99453L13521R8705n03302
$$ 87060213 87344170 87140560 86914778 87065935 87345839 87647200 87946653 88260174 88358879 87855577
1259H7855577o16073l05414j85728j46389j6213K42472L05414J10388K29597P34091
$$ 87855577 87239504 86934090 86748362 86601973 86585760 86828232 87133646 87244034 87473631 88207722
1269H8207722P67231L83138K19107J01566Q4162K39372K21014j1205M6968M33445M88997
$$ 88207722 88974953 89358091 89577198 89678764 89762926 90002298 90223312 90212107 90259075 90692520 91181517
1280I1181517L75747J02997o42538o20365K17199M36545K64167K26498K55346R6798
$$ 91181517 91557264 91660261 91017723 90397358 90614557 91051102 91315269 91541767 91797113 91893911
1290I1893911l89337l89338M2439L08990O55890O97374M58002K24114k01226l19480
$$ 91893911 91504574 91115236 91157675 91466665 92122555 92819929 93277931 93502045 93300819 92981339
1300I2981339j73092r3222O8188M9591j74046k41518k83718j41144K99931M23670L22342
$$ 92981339 92808247 92715025 92783213 92832804 92658758 92417240 92133522 91992378 92292309 92715979 93038321
1311I3038321K42710L2425N2213L67403L54290J13964j34468o37293o29901r3937J29222
$$ 93038321 93281031 93313456 93365669 93733072 94087362 94201326 94066858 93429565 92799664 92705727 92834949
1322I2834949K19584K95877L95298K48194k31981m29154m55856m79221n24044l27111
$$ 92834949 93054533 93350410 93745708 93993902 93761921 93332767 92876911 92397690 91873646 91546535
1332I1546535J88590M51326P65324M84705n33581j072884j684427j381159K31266N86748
$$ 91546535 91735125 92186451 92951775 93436480 92902899 91830015 90145588 88764429 88995695 89582443
1342H9582443m6730j78098J9073k54393j112461j301527q91685q59738j031160j127720
$$ 89582443 89535713 89357615 89376688 89122295 88009834 86708307 85816622 84956884 83925724 82798004
1352H2798004j123667j402378k214908k175093j356840q53300O437l69549k466678
$$ 82798004 81674337 80271959 78057051 75881958 74525118 73671818 73678255 73308706 70842028
1361G0842028k754689j605510j062870m34876m46796j373291j393318o22750m20809
$$ 70842028 68087339 66481829 65418959 64984083 64537287 63163996 61770678 61147928 60727119
1370F0727119m58478o94991j523018j415014l23057L3379k2889o5326k41041l90768
$$ 60727119 60268641 59573650 58050632 56635618 56312561 56345940 56323051 56257725 56016684 55625916
1380E5625916p47681n40257M14133O13451L68357o3181j182318j244783l44038J47820
$$ 55625916 54878235 54337978 54752111 55365562 55733919 55670738 54488420 53243637 52899599 53047419
1390E3047419Q84056O20842j078129j226902J02520K11239o51598p86066m90904k72513
$$ 53047419 53931475 54552317 53474188 52247286 52349806 52561045 51909447 51123381 50632477 50359964
1400E0359964K53201N3167j163959j201868p1049P3671m45127p65562j288414j272679
$$ 50359964 50613165 50666332 49502373 48300505 48229456 48303127 47858000 47092438 45804024 44531345
1410D4531345o44922m42505n60045l83377K79426M6492j277447j532554j142502n74112
$$ 44531345 43886423 43443918 42883873 42500496 42779922 42826414 41548967 40016413 38873911 38299799
1420C8299799Q80718Q54969r88960r34124R34839J237631N18322k2650j107454j049280
$$ 38299799 39180517 40035486 39046526 38112402 39047241 40284872 40803194 40780544 39673090 38623810
1430C8623810J85251P74860J560450R96828j617193j935005l32833L45707Q81195R91583
$$ 38623810 38809061 39583921 41144371 42141199 40524006 38589001 38256168 38601875 39483070 40474653
1440D0474653M58241M34398Q47340Q33511N40018K39611l71694l52860L20673O08206
$$ 40474653 40932894 41367292 42214632 43048143 43588161 43827772 43456078 43103218 43423891 44032097
1450D4032097N76734R96113K501011J779795j668692k529144j789332q14676J348734
$$ 44032097 44608831 45604944 48105955 49885750 48217058 45687914 43898582 43083906 44432640
1459D4432640K247572K645493J940250p67231j280546o5565N41925J152992J656056
$$ 44432640 46680212 49325705 51265955 50498724 49218178 49152613 49694538 50847530 52503586
1468E2503586K659321J841545j721144k012968P05242J457453J135588J146078J117706
$$ 52503586 55162907 57004452 55283308 53270340 53975582 55433035 56568623 57714701 58832407
1477E8832407J128912J240492J127958N45263P99418K154350K245188J256943Q14438
$$ 58832407 59961319 61201811 62329769 62875032 63674450 65828800 68073988 69330931 70145369
1486G0145369O89506J68800j359939p36952K463579L377199L174067K036333j382112
$$ 70145369 70834875 71003675 69643736 68906784 71370363 74747562 77921629 79957962 78575850
1495G8575850j881123K22921R95398J030683J883507L577709M462958O444931L549814
$$ 78575850 76694727 76917648 77913046 78943729 80827236 84404945 88867903 95312834 98862648
1504I8862648o891251q231639j807452J078844L819943M146814Q61407J023530N156756
$$ 98862648 91971397 83739758 81932306 83011150 86831093 90977907 91839314 92862844 98019600
1513I8019600M104614l224134l308535L862381M721403J061201p22170l403186k283335
$$ 98019600 102124214 98900080 95591545 99453926 104175329 105236530 104514360 101111174 98827839
1522I8827839M625082M669428k408028k926111J733780L414631M510879L601313j77384
$$ 98827839 103452921 108122349 105714321 102788210 104521990 107936621 112447500 116048813 115871429
1531A15871429j952886m433870j661540R564639J0483741K996683j741409r283542
$$ 115871429 113918543 109484673 107823133 117387772 127871513 130868196 129126787 119843245
1539A19843245q573294K431869M501820o91891o08682L466844M132271K439260J581908
$$ 119843245 111269951 113701820 118203640 117511749 116903067 120369911 124502182 126941442 128523350
1548A28523350K36273N03301L093958L063440o74247J169681J2589693Q318663j5298843
$$ 128523350 128759623 129262924 132356882 135420322 134746075 135915756 148505449 156824112 141525269
1557A41525269j8374443n152464J455783R404898R788036L17336r52244M651546M383326
$$ 141525269 123150826 117998362 119454145 128859043 138647079 138964415 138012171 142663717 147047043
1566A47047043k20776k561569o069183l624916P371425R399653N688429Q42332j1094331
$$ 147047043 146826267 144264698 138195515 134570599 141942024 151341677 157030106 157872438 146778107
1575A46778107j0906220K256394N776405L558636K599001M42504q8214R32455R76562
$$ 146778107 135871887 138128281 143904686 147463322 150062323 150504827 150416613 151349068 152325630
1584A52325630M19855K84911M06026M21048L52382M70877R94682P79391l90053n12600
$$ 152325630 152745485 153030396 153436422 153857470 154209852 154680729 155675411 156454802 156064749 155552149
1594A55552149K27451N64337R08613Q81910L94822J81675k2889J07289P91549Q25882
$$ 155552149 155779600 156343937 157252550 158134460 158529282 158710957 158688068 158795357 159586906 160412788
1604A60412788L80516k3117o79741r35077j256705m32252J754045L225336O754627
$$ 160412788 160793304 160770187 160090446 159155369 157898664 157466412 159220457 162445793 169200420
1613A69200420L324032j0838508j1629820m19379M167080P915726O304989l408184
$$ 169200420 172524452 161685944 150056124 149636745 153803825 161719551 168024540 164616356
1621A64616356n732546l174305j200199L540516L109693l962993l858567K511979M970550
$$ 164616356 158883810 155709505 154509306 158049822 161159515 157196522 153337955 155849934 160820484
1630A60820484O637097N208740K56767m201164j3011465j0809660N265236Q401870
$$ 160820484 167457581 172666321 172923088 168721924 155710459 144900799 150166035 158567905
1638A58567905Q73328L95536M448662N392780O443501K375374j1187325j1519432m85182
$$ 158567905 159441233 159836769 164285431 169678211 176121712 178497086 167309761 155790329 155305147
1647A55305147O644240K0001659J4324188j6705513k2555113j0133504k340556J0221243
$$ 155305147 161949387 181951046 196275234 179569721 157014608 146881104 144540548 154761791
1655A54761791J2858639N273323L349552N269299K418976p087708p093887J909485
$$ 154761791 167620430 172893753 176243305 181512604 183931580 176843872 169749985 171659470
1663A71659470N729198R088039P285595j529216n254021q642445m785785J2126217
$$ 171659470 177388668 186476707 193762302 192233086 186979065 178336620 173550835 185677052
1671A85677052J1944065n866051r022007k512455J333466P594356Q284817K180805
$$ 185677052 197621117 191755066 182733059 180220604 181554070 189148426 197433243 199614048
1679A99614048K161732J1742363L981590k9385796k8361091Q193016J5728473K913476
$$ 199614048 201775780 213518143 217499733 188113937 159752846 167945862 183674335 186587811
1687A86587811l77656j888980n20955O711483O767273Q39234k803078r080181o582737
$$ 186587811 186210155 184321175 183800220 190511703 197278976 198118210 195315132 186234951 179652214
1696A79652214J0689011P324943k1415710k1161795P357836J2686024K093544k047768
$$ 179652214 190341225 197666168 176250458 155088663 162446499 175132523 177226067 175178299
1704A75178299o636620o453514r53J508941m54426n56945M71820K14825m87079k581368
$$ 175178299 168541679 162088165 162087212 163596153 163141727 162584782 163056602 163271427 162784348 160202980
1714A60202980p027388r040355j1222124p953167L973007O110668j68085j909256k227545
$$ 160202980 153175592 144135237 132913113 124959946 128932953 135043621 134875536 132966280 130738735
1723A30738735j621008J130104J643658O5088J94073J747370K057314L420353o81639
$$ 130738735 129117727 130247831 131891489 131956577 132150650 133898020 135955334 139375687 138694048
1732A38694048j5653372j3359070Q799792J2292146J131773k206087l186226k427816
$$ 138694048 123040676 109681606 118481398 130773544 131905317 129699230 126513004 124085188
1740A24085188K182960K807379l34739k86341K800464K576590n47171j868248k881050
$$ 124085188 126268148 129075527 128740788 128454447 131254911 133831501 133284330 131416082 128535032
1749A28535032k311468J24455K013206N412817M501581k394437k759696L096343L893375
$$ 128535032 126223564 126348019 128361225 133774042 138275623 135881186 133121490 136217833 140111208
1758A40111208J416683j94788l637552k264738N595445O607771J649380N43594J688004
$$ 140111208 141527891 141333103 137695551 135430813 141026258 147634029 149283409 149827003 151515007
1767A51515007J668930K028942J1206o631136o156445J695395M139423L396034L367663
$$ 151515007 153183937 155212879 155224085 148592949 142436504 144131899 148271322 151667356 155035019
1776A55035019L506899K099981k272119k222300K892971L112068j235237j508474J241216
$$ 155035019 158541918 160641899 158369780 156147480 159040451 162152519 160917282 159408808 160650024
1785A60650024K577782M338265L610115N34057k540588q767128p881870J299619L773690
$$ 160650024 163227806 167566071 171176186 171710243 169169655 160402527 152520657 153820276 157593966
1794A57593966J871109J271238N52673k78473j868019j640558M89473J602650K577782
$$ 157593966 159465075 160736313 161288986 161010513 159142494 157501936 157991409 159594059 162171841
1803A62171841K818584K187500J831055J724949Q19454j485596j739731k47497P55310
$$ 162171841 164990425 167177925 169008980 170733929 171553383 170067787 168328056 168080559 168835869
1812A68835869K399444K397309M77314J0242L89824O70204J116028J613388L168106
$$ 168835869 171235313 173632622 174109936 174120178 174510002 175180206 176296234 177909622 181077728
1821A81077728J870156m020691l634949L659019M465332M37031j642227m844417l665219
$$ 181077728 182947884 178927193 175292244 178951263 183416595 183853626 182211399 177366982 173701763
1830A73701763L461132M767647J421928N20230O14643L97453m57306O60668N031814
$$ 173701763 177162895 181930542 183352470 183872700 184487343 184884796 184427490 185088158 190119972
1839A90119972M922409J208535j882554p946491o829967L205299N052319K54879k56081
$$ 190119972 195042381 196250916 194368362 186421871 179591904 182797203 187849522 188104401 187848320
1848A87848320K064953K103805L70274o1531K89211M24137O82602P04994N12619L79792
$$ 187848320 189913273 192017078 192387352 192325821 192615032 193039169 193721771 194426765 194939384 195319176
1858A95319176P4615K49634Q12302J477470K883434K760182J725902m25338n761624
$$ 195319176 195393791 195643425 196455727 197933197 200816631 203576813 205302715 204877377 199115753
1867A99115753n805969o96182J640548L575573L549328Q24471r1553j29948p6542N10712
$$ 199115753 193309784 192613602 194254150 197829723 201379051 202203522 202111969 201982021 201905479 202416191
1877B02416191O46591M52996M26998N53608L95298m80900R3231K984524K554416j463165
$$ 202416191 203062782 203515778 203942776 204496384 204891682 204410782 204504013 207488537 210042953 208579788
1887B08579788k368927j483688k24838L221054L016224j367093j982212L47615R66549
$$ 208579788 206210861 204727173 204502335 207723389 210739613 209372520 207390308 207737923 208704472
1896B08704472Q02288P99179P49817N37147q6536j4553Q18023J044503J104850O04134
$$ 208704472 209506760 210305939 211055756 211592903 211506367 211491814 212309837 213354340 214459190 215063324
1906B15063324r19571j225243o70433o5803J038093J652947K401581J779804n66006
$$ 215063324 214143753 212918510 212248077 212182274 213220367 214873314 217274895 219054699 218488693
1915B18488693j719246l105163j940003L393650L639698j128196j950493j12076N65300
$$ 218488693 216769447 213664284 211724281 215117931 218757629 217629433 215678940 215566864 216132164
1924B16132164J170158J167775K79178J51882O91166O27518K0275r9888J39694K16980
$$ 216132164 217302322 218470097 218749275 218901157 219592323 220219841 220240116 220140228 220279922 220496902
1934B20496902R7275M40827J487960J616726J405240J61399l566494l282795J502285
$$ 220496902 220594177 221035004 222522964 224139690 225544930 225706329 222139835 218857040 220359325
1943B20359325K331028K2641k44389P87506R08375M06017L39051O22253N36690N8174
$$ 220359325 222690353 222712994 222468605 223256111 224164486 224570503 224909554 225531807 226068497 226126671
1953B26126671J430L78361L26653k17438j38054O11782P26452K26517L34968J277924
$$ 226126671 226128101 226506462 226833115 226615677 226477623 227089405 227815857 228042374 228377342 229655266
1963B29655266R25064r66797j296749m67053L0022Q41866Q70475m0779j68800L16849
$$ 229655266 230580330 229613533 228316784 227849731 227879753 228721619 229592094 229551315 229382515 229699364
1973B29699364L70521J30883Q7738J43280J98860L64532K98023j41143m9839O75201
$$ 229699364 230069885 230200768 230288506 230431786 230630646 230995178 231293201 231152058 231102219 231777420
1983B31777420P15256k8839J54972J551628J308918n24044j292706j961708j328468
$$ 231777420 232492676 232463837 232618809 234170437 235479355 234955311 233662605 231700897 230372429
1992B30372429J433372J814843J2874k53925N28107N86032J41850P8201L35694K67524
$$ 230372429 231805801 233620644 233633518 233379593 233907700 234493732 234635582 234713783 235049477 235317001
2002B35317001j55944j70460K35805K51046j15624r1324L10669L68118J11332J41621
$$ 235317001 235161057 234990597 235226402 235477448 235361824 235270500 235581169 235949287 236060619 236202240
2012B36202240O24886K92549j170388j236686m3869M28199P32651O33965j85242k20795
$$ 236202240 236827126 237119675 235949287 234712601 234668732 235096931 235829582 236463547 236278305 236057510
2022B36057510M77333O03905L83854K19345n9604j75248j67846j55201j18733j8120
$$ 236057510 236534843 237138748 237522602 237741947 237682343 237507095 237339249 237184048 237065315 237047195
2032B37047195J75705L03517M24862M59194N04970K47002n21183o60419l21618m2457
$$ 237047195 237222900 237526417 237951279 238410473 238915443 239162445 238641262 237980843 237659225 237616768
2042B37616768N02586N47180J908j1215M34875N06897L29475K36054J29204O1283m9591
$$ 237616768 238119354 238666534 238668442 238657227 239092102 239598999 239928474 240164528 240293732 240355015 240305424
2053B40305424P1048N93911N59311q8692j69506J95026L11623M17938K55108l98388
$$ 240305424 240376472 240970383 241529694 241441002 241271496 241466522 241778145 242196083 242451191 242052803
2063B42052803m01039K40822M09584L10669K40097R5119j0013j73092j18733K03133
$$ 242052803 241651764 241892586 242302170 242612839 242852936 242948055 242938042 242764950 242646217 242849350
2073B42849350L16849L33786K82783O1035N0297K20776L09219M30355L86486J02997
$$ 242849350 243166199 243499985 243782768 243843803 243894100 244114876 244424095 244854450 245240936 245343933
2083B45343933P3433K57950L22342M53491K36263n34534o23932j19457R2983K35786
$$ 245343933 245417366 245675316 245997658 246451149 246687412 246152878 245528946 245409489 245502472 245738258
2093B45738258L01609K05040K92302O23474O10580K58446J32561J65214O0082k01226
$$ 245738258 246039867 246244907 246537209 247160683 247771263 248029709 248162270 248327484 248387566 248186340
2103B48186340k51274j42097l5782J41392K53200L86467L28560P2708j44481n73159
$$ 248186340 247935066 247792969 247757187 247898579 248151779 248538246 248866806 248939514 248795033 248221874
2113B48221874m52041L26404N69573N54561L63827k31972l99132k48413j72157l7651
$$ 248221874 247769833 248096237 248665810 249220371 249584198 249352226 248953094 248704681 248532524 248494873
2123B48494873J6670k6455L8147K49157K44370k2164p629L29475K80629j56651k67487
$$ 248494873 248511543 248485088 248523235 248772392 249016762 248994598 248986969 249316444 249597073 249440422 249172935
2134B49172935j83830r3460J20640J76907J24454M7684j47114j71890l7918J1692K8362
$$ 249172935 248989105 248895645 249016285 249193192 249317646 249365330 249218216 249046326 249008408 249020100 249048462
2145B49048462M6024O5804M6978q9188J0033M48684M57764O2485o9389r0600o0081
$$ 249048462 249094486 249160290 249207268 249118080 249128113 249576797 250034561 250097046 250027657 249937057 249876976
2156B49876976J06812J28021j1673K7885L17345K34127l35445l16391K29835M73976
$$ 249876976 249983788 250111809 250100136 250128021 250445366 250679493 250344048 250027657 250257492 250731468
2166B50731468P66030N33599o03447n53360P09763R87778O89010L74565l29017m89006
$$ 250731468 251497498 252031097 251427650 250874290 251584053 252571831 253260841 253635406 253306389 252817383
2176B52817383j74751m4594Q0356J41621J49727J18484k5253k632J86443K62013K79197
$$ 252817383 252642632 252598038 252678394 252820015 252969742 253088226 253062973 253060341 253246784 253508797 253787994
2187B53787994K95868L03040K79198K12669J68075J32084R2259L1242K7886J21612
$$ 253787994 254083862 254386902 254666100 254878769 255046844 255178928 255271187 255302429 255330315 255451927
2197B55451927P5093j21594j92413l38307l1471J005173J135349N13306J57604l40214
$$ 255451927 255527020 255405426 255213013 254874706 254843235 255848408 256983757 257497063 257654667 257314453
2207B57314453l67660J66893K81581J14918R4414J49727J32084O8187m76j68553j00860
$$ 257314453 256946793 257113686 257395267 257510185 257604599 257754326 257886410 257954597 257954121 257785568 257684708
2218B57684708K72522L36647J28250J15642K26975K79903M23660K42482l90053n52654
$$ 257684708 257957230 258293877 258422127 258537769 258764744 259044647 259468307 259710789 259320736 258768082
2228B58768082m15325k21501J92890M13189O18439N05218p2479k30560j16348k5025
$$ 258768082 258352757 258131256 258324146 258737335 259355774 259860992 259788513 259557953 259441605 259416580
2238B59416580K29836J94778k02885k21252R9430J76888R3231J01318K08397J30158
$$ 259416580 259646416 259841194 259638309 259417057 259516487 259693375 259786606 259887924 260096321 260226479
2248B60226479j84288k47479j33762l4333J83354J78089j06564j05152J41144K30332
$$ 260226479 260042191 259794712 259660950 259626617 259809971 259988060 259881496 259776344 259917488 260147820
2258B60147820K49366K48909K43187J22318k31037k39124J43299J56403j90735j76201
$$ 260147820 260397186 260646095 260889282 261011600 260780563 260541439 260684738 260841141 260650406 260474205
2268B60474205K38647J77155m23431m37012Q9874K15759R0847N3654l0517L7193K69890
$$ 260474205 260712852 260890007 260466576 260029564 260119438 260335197 260426044 260479698 260449181 260486374 260756264
2279B60756264M14600N99861N64823K67735J34716K8610P0801L49522L89576K46524
$$ 260756264 261170864 261770725 262335548 262603283 262737999 262766609 262837410 263186932 263576508 263823032
2289B63823032J70231J22795L567k15053l22819m53701k82059K77042N55745O80923
$$ 263823032 263993263 264116058 264119625 263904572 263581753 263128052 262845993 263123035 263678780 264359703
2299B64359703Q11577R62028R15299O47545M68960L65009Q2264n06153o42548m07696
$$ 264359703 265171280 266133308 267048607 267696152 268165112 268530121 268612385 268106232 267463684 267055988
2309B67055988k36034r8457L19709J080990J620045K357483K174625R99928K35080
$$ 267055988 266819954 266721497 267041206 268122196 269742241 272099724 274274349 275274277 275509357
2318B75509357m04605j182309k502441k485752j241684k13852J766434J465072j364936
$$ 275509357 275104752 273922443 271420002 268934250 267692566 267478714 269245148 270710220 269345284
2327B69345284k503872l335953k547016P53402J689186J205922L96251j892318k144356
$$ 269345284 266841412 263505459 260958443 261711845 263401031 264606953 265003204 263110886 260966530
2336B60966530k27204j86920j106033k610207n299568p149200j1125565p389068M911174
$$ 260966530 260739326 260552406 259446373 256836166 251536598 244387398 233261833 225872765 230783939
2345B30783939J2530804K1545181K0896912R404640K849579m077187n923996j114597
$$ 230783939 243314743 264859924 285756836 295161476 298011055 293933868 288009872 286895275
2353B86895275j407375n567551o778717o608009n604992k527943j794815l142357l206978
$$ 286895275 285487900 279920349 273141632 266533623 260928631 258400688 256605873 253463516 250256538
2362B50256538k690544k149353j034012r85393k128353k324353k162456j425266L84578
$$ 250256538 247565994 245416641 244382629 243397236 241268883 238944530 236782074 235356808 235741386
2371B35741386J056900J002083P87964j91917p9880R32922J752396L046265L235817
$$ 235741386 236798286 237800369 238588333 238396416 238316536 239249458 241001854 244048119 247283936
2380B47283936K269973J930237J842499J720924J776200J451492O63299K99683J80245
$$ 247283936 249553909 251484146 253326645 255047569 256823769 258275261 258938560 259238243 259418488
2389B59418488J36852L12099L03021J95503M7932k35329l32832l22571k16255P4863
$$ 259418488 259555340 259867439 260170460 260365963 260413895 260178566 259845734 259523163 259306908 259381771
2399B59381771K07195K70348K47498R6550K632j13488j22318j0490L6239R0123M6730
$$ 259381771 259588966 259859314 260106812 260203362 260205994 260092506 259970188 259959698 259995937 260086060 260132790
2410B60132790j38512j85261j36852j03474l5991k1706p5111n1957P5798M9591j79748
$$ 260132790 259994278 259809017 259672165 259568691 259532700 259510994 259435883 259383926 259459724 259509315 259329567
2421B59329567j58310J30653J64032J0243q3923j97163k63939l19252k90146j66416
$$ 259329567 259171257 259301910 259465942 259476185 259392262 259195099 258931160 258611908 258321762 258155346
2431B58155346o4602O3171J41144K77043J12285m98047o16073l27111k29358j64986
$$ 258155346 258090744 258153915 258295059 258572102 258684387 258186340 257570267 257243156 257013798 256848812
2441B56848812j69277k82765l11374l26882k38170j3600J27087L31173K28882k28882
$$ 256848812 256679535 256396770 256085396 255758514 255520344 255506744 255633831 255965004 256193886 255965004
2451B55965004m76608p62711o60171l9826J54038J28021j431l93619n29061n28564
$$ 255965004 255488396 254725685 254065514 254025688 254179726 254307747 254306316 253912697 253383636 252855072
2461B52855072m31557j00364m8161k41527l01114l03268l22094l75996l19481r3708
$$ 252855072 252423515 252323151 252274990 252033463 251732349 251429081 251106987 250730991 250411510 250317802
2471B50317802q0814k61059l31878l56923l86238m21276m08897k96822l48816n69572
$$ 250317802 250236988 249975929 249644051 249287128 248900890 248479614 248070717 247773895 247425079 246855507
2481B46855507o76651p74384p27653n10445l65028o8894k72522j236419j271248m36325
$$ 246855507 246178856 245404472 244676819 244166374 243801346 243732452 243459930 242223511 240952263 240515938
2491B40515938j86672j55926l57151r56536j277923j571655j515389r71317q15621
$$ 240515938 240329266 240173340 239816189 238859653 237581730 236010075 234494686 233523369 232707748
2500B32707748r15527r27925r23157r62753j155357j007576m53949k51999k21482l25698
$$ 232707748 231792221 230864296 229941139 228978386 227823029 226815453 226361504 226109505 225888023 225562325
2510B25562325p83921p59125k89917o1035J09673J77154J54725L1242m03633k97547
$$ 225562325 224778404 224019279 223729362 223668327 223778000 223955154 224109879 224141121 223737488 223439941
2520B23439941L98388O36349N99136O02951N01175N63622P96318R03358R72748R48181
$$ 223439941 223838329 224474678 225073814 225676765 226177940 226741562 227537880 228441238 229413986 230362167
2530B30362167P56264P46975R58195Q88366N04494M37737O62555O49205N05218L28293
$$ 230362167 231118431 231865406 232823601 233711967 234216461 234654198 235316753 235965958 236471176 236799469
2540B36799469N722j09177q3465m273K07405L19252M63715L41911k10762k38418K10037
$$ 236799469 236805191 236696014 236612549 236608276 236815681 237134933 237598648 237940559 237729797 237491379 237701416
2551B37701416L71456M38214M04129K14805R3231o0329p0095R9907J28250P7743J7624
$$ 237701416 238072872 238511086 238915215 239130020 239223251 239162922 239092827 239192734 239320984 239398727 239416351
2562B39416351j23253j32331R307J3581j01547j22071n7468q6785k43663k15531j3580
$$ 239416351 239293098 239160767 239170074 239183655 239082108 238960037 238902569 238815784 238572121 238356590 238343010
2573B38343010R1553J64489K15073L03726J75476k56042l94116l65734k62489L6697
$$ 238343010 238434563 238599052 238814125 239117851 239293327 239037285 238643169 238277435 238014946 238051643
2583B38051643J35422M3163J16349L93867L61920p859r1324L8376M6273o0578K1935
$$ 238051643 238187065 238230228 238346577 238740444 239102364 239094505 239003181 239041557 239087830 239027252 239049187
2594B39049187L79562L63598J0967j78108m33674l36170K37694L74794K48451P7705
$$ 239049187 239428749 239792347 239803314 239625206 239191532 238855362 239093056 239467850 239716301 239794006
2604B39794006l89804l63102K02179L35693K17190R5615j91460k46048r9659k7408
$$ 239794006 239404202 239041100 239243279 239578972 239796162 239891777 239700317 239454269 239354610 239327202
2614B39327202M0760R7275J73816J50910K3365o9370j67389k50817m17709k96822K03858
$$ 239327202 239367962 239465237 239639053 239789963 239813328 239743958 239576569 239325752 238908043 238611221 238815079
2625B38815079L43780K61803J43280k28157j74294L65982M69666K73952J53065r060
$$ 238815079 239158859 239420662 239563942 239335785 239161491 239527473 239997139 240271091 240424156 240415096
2635B40415096j24931k60830k42462k0752L0746r1056r54L63350L66916L5038j00841
$$ 240415096 240290165 240029335 239786873 239766121 239796867 239705811 239704857 240068207 240435123 240470161 240369320
2646B40369320j61648j95980j63784j77631k31495k38190j96228k01931k75135k43912
$$ 240369320 240207672 240011692 239847908 239670277 239438782 239200592 239004364 238802433 238527298 238283386
2656B38283386q4877o5079j61399k02427k51065k26726j20869n0545O4126K0504k54632
$$ 238283386 238198509 238133430 237972031 237769604 237518539 237291813 237170944 237120399 237184525 237205029 236950397
2667B36950397k66551j8845O218j42346j80950j77383j45912m9134k3117p0095m6978
$$ 236950397 236683846 236665001 236671219 236528873 236347923 236170540 236024628 235975494 235952377 235882282 235835304
2678B35835304N5084N7450j4305q5106k19345k35787r1095j40648m18434m36058k89688
$$ 235835304 235890388 235947838 235933533 235848427 235629082 235393295 235302200 235161552 234743118 234307060 234017372
2689B34017372q3694L77903M12693O218j03245q5125p06L63102K13623n21889p59601
$$ 234017372 233933678 234311581 234724274 234730492 234627247 234542122 234541416 234904518 235118141 234596252 233836651
2700B33836651p29561n97954k09808j8826J07270Q9645j80702j90735L1929Q3218N7220
$$ 233836651 233107090 232509136 232299328 232280502 232387772 232477417 232296715 232105980 232137909 232221127 232278347
2711B32278347j9321k51522k46048r060Q7738J83105R0828k39601m21295o54450n25245
$$ 232278347 232259026 232007504 231761456 231752396 231840134 232023239 232114067 231874466 231453171 230798721 230273476
2722B30273476J18026K52953L1967j33285m69685m81129j63307l1719N4111M6978p7724
$$ 230273476 230391502 230644455 230676422 230543137 230073452 229592323 229429016 229397297 229451408 229498386 229420662
2733B29420662j78108l76931l26881M4594R7046j23272j62125r4662p7476n1975r9430
$$ 229420662 229242554 228865623 228538742 228583336 228680382 228557110 228394985 228300323 228222847 228170872 228071442
2744B28071442k81792k70138o8664R784L1472M0512K2430r537r0141r4414k613k1934
$$ 228071442 227789650 227519512 227450848 227460632 227492104 227532616 227555046 227545509 227455368 227360954 227358341 227336407
2756B27336407j23978k15282l99590l58353j02520R2030M19617L76472p7743k78473
$$ 227336407 227212429 226997147 226597557 226239204 226136684 226228714 226648331 227024803 226947060 226668587
2766B26668587m13647l97205k33422P172N89123N24044k63443m84467l60985k95143
$$ 226668587 226254940 225857735 225624313 225631485 226220608 226744652 226481209 225996742 225635757 225340614
2776B25340614j69296n4817J17531J41372L4333o7711k84901k73456k0752P6065J09901
$$ 225340614 225171318 225116501 225234032 225375404 225409737 225342026 225057125 224783669 224762917 224838982 224948883
2787B24948883J03951R5596r0103o09646o63052k55089j69048l25203k59151K9068
$$ 224948883 225052834 225148430 225058327 224448681 223785629 223530540 223361492 223036289 222777138 222806206
2797B22806206P1773o7711j78585m28905l58830J79291J35193m71840o70185o81629
$$ 222806206 222877979 222810268 222631683 222202778 221843948 222023239 222158432 221686592 221016407 220334778
2807B20334778n92003l17345j07765K32239J69983m17481n08537j39961j88580o14643
$$ 220334778 219742775 219425430 219317665 219549904 219719887 219302406 218793869 218653908 218465328 217850685
2817B17850685p03335n76267m63486k10514k05288m08878n91984r54170r29108l67889
$$ 217850685 217147350 216571083 216107597 215897083 215691795 215282917 214690933 213736763 212807655 212439766
2827B12439766m34380j184234j232872o97842m95911l47137m54426r14573j138459
$$ 212439766 212005386 210821152 209588280 208890438 208394527 208047390 207592964 206678391 205539932
2836B05539932j308899j284847r11465r49630j363755j536140j560440j681328j936188
$$ 205539932 204231033 202946186 202034721 201085091 199721336 198185196 196624756 194943428 193007240
2845A93007240j933098j750240j467457q40912p66029j196632j425019j730690j703491
$$ 193007240 191074142 189323902 187856445 187015533 186249504 185052872 183627853 181897163 180193672
2854A80193672j325855j078854p55062p06672j023293r97295o96431n58853m32491
$$ 180193672 178867817 177788963 177033901 176327229 175303936 174306641 173610210 173051357 172618866
2863A72618866m89960q96911q20656k16942r8000l93390l73593j72157J5259M18205
$$ 172618866 172128906 171231995 170411339 170194397 170096397 169703007 169329414 169157257 169172516 169590721
2873A69590721L12805m70409n30720J1673K34146L94573L81222J14212K4796M3869
$$ 169590721 169903526 169433117 168902397 168914070 169148216 169542789 169924011 170038223 170063019 170106888
2883A70106888J6689l8395m2419j2169L8376K15778J04427l23772n43594p84169o54926
$$ 170106888 170123577 170085182 170042763 170030594 170068970 170284748 170389175 170065403 169521809 168737640 168082714
2894A68082714N6744J06334l65009o79264j144886j205921p70569p63416j148949j147270
$$ 168082714 168139458 168245792 167880783 167201519 166056633 164850712 164080143 163316727 162167778 161020508
2904A61020508q23021o98319o25610o73771q75473j032829j288891j269341q90970
$$ 161020508 160197487 159499168 158873558 158199787 157324314 156291485 155002594 153733253 152842283
2913A52842283q62121j147032j182079j054764r78947r31024p93696n12838m22955
$$ 152842283 151980162 150833130 149651051 148596287 147617340 146686316 145892620 145379782 144956827
2922A44956827m65870n40495p71284p62224n14984m20570m09365l69549l90530k26259
$$ 144956827 144490957 143950462 143179178 142416954 141901970 141481400 141072035 140702486 140311956 140085697
2932A40085697K48432K86103j04189k12193k46048q5830L82423N82457O27994O40631
$$ 140085697 140334129 140620232 140516043 140303850 140057802 139971972 140354395 140936852 141564846 142205477
2942A42205477M94480N68151Q98838R55820Q14677P00235M75884M60386O61611P26462
$$ 142205477 142699957 143268108 144166946 145122766 145937443 146637678 147113562 147573948 148235559 148962021
2952A48962021P19547P34806P45774P64131Q55684P42913L85522K18869Q6069J79052
$$ 148962021 149681568 150416374 151162148 151926279 152781963 153524876 153910398 154129267 154215336 154394388
2962A54394388O07252P37667O69957O36100N08547N64099Q21590R26018R29117R77039
$$ 154394388 155001640 155739307 156409264 157045364 157553911 158118010 158939600 159865618 160794735 161771774
2972A61771774J141320R89418M36325K53181K57492M05083Q27064J043091J240254
$$ 161771774 162913094 163902512 164338837 164592018 164849510 165254593 166081657 167124748 168365002
2981A68365002J147518O24885N01156O46591P51019R61781R96589Q51879Q20618Q13255
$$ 168365002 169512520 170137405 170638561 171285152 172036171 172997952 173994541 174846420 175667038 176480293
2991A76480293Q93822J167068J149655Q16822P49359R02882Q74042P25022O09169M55856
$$ 176480293 177374115 178541183 179690838 180507660 181257019 182159901 183033943 183758965 184368134 184823990
3001A84823990L91960M78020L43818j5506k11468m37508l09219L36151M60873J85260
$$ 184823990 185215950 185693970 186037788 186022282 185810814 185373306 185064087 185400238 185861111 186046371
3011A86046371O2943o0082j24225j17550j48525k17438k16007j92642o4621K98042
$$ 186046371 186109314 186049232 185925007 185807457 185658932 185441494 185225487 185032845 184968224 185266266
3021A85266266K90623j65463j51405L42617L55015p401k13394n17845m35829J59988
$$ 185266266 185556889 185391426 185240021 185582638 185937653 185930252 185716858 185199013 184763184 184923172
3031A84923172K72026k2163l6240J78566J38779j90277j87874J44729J91212N9376
$$ 184923172 185195198 185173035 185136795 185315361 185454140 185263863 185075989 185220718 185411930 185471306
3041A85471306o8436k92778l93867m47502l72658o7482k0485j98860k47956k35557
$$ 185471306 185402870 185110092 184716225 184268723 183896065 183828583 183808098 183609238 183361282 183125725
3051A83125725k48413k48204l04699m63485m74453l56426k86351k15530j64986j19686
$$ 183125725 182877312 182629108 182324409 181860924 181386471 181030045 180743694 180528164 180363178 180243492
3061A80243492j19438j21613k57244o56604o69957l25908j62373n016j4057k20776
$$ 180243492 180124054 180002441 179745197 179088593 178418636 178092728 177930355 177925339 177911282 177690506
3071A77690506l40939n33104m49428R6321Q354p88460q99543m98543k86331L7670l0518
$$ 177690506 177349567 176816463 176367035 176463356 176471710 175683250 174783707 174285164 173998833 174036503 174005985
3082A74005985o20365p12395l91483l39985m95910m27247j24206o1531j91441k32944
$$ 174005985 173385620 172673225 172281742 171941757 171445847 171018600 170894394 170832863 170641422 170408478
3092A70408478k26021k93484m80404m83513k83241k64664l64761m51336o19182o24409
$$ 170408478 170182457 169888973 169408569 168925056 168641815 168377151 168012390 167561054 166941872 166317463
3102A66317463m70409l88146l04928k82287l68824l12100m6253q9645m25816o04153
$$ 166317463 165847054 165458908 165153980 164871693 164502869 164190769 164144516 164054871 163629055 163024902
3112A63024902q33740p30286k18620J5259K24342P9384n70755p94182p84635p01905
$$ 163024902 162191162 161460876 161242256 161257515 161481857 161561241 160990486 160196304 159411669 158709764
3122A58709764m26530k76804j42813j46866l04699m32730o24895o92129o70671o07968
$$ 158709764 158283234 158006430 157863617 157716751 157412052 156979322 156354427 155662298 154991627 154383659
3132A54383659m60147l55959k45333k02418k60353k12431K2889q7023o67334o87599
$$ 154383659 153923512 153567553 153322220 153119802 152859449 152647018 152669907 152582884 151915550 151227951
3142A51227951j42097q5116m12226m87566m61816l70980q5354q7976l69549m85420
$$ 151227951 151085854 151000738 150588512 150100946 149639130 149268150 149182796 149094820 148725271 148239851
3152A48239851n59568n43833m03404l27588k17676k79188o26325n99623k02179q3208
$$ 148239851 147680283 147136450 146733046 146405458 146187782 145908594 145282269 144682646 144480467 144397259
3162A44397259j41144j35899n8174j85966o11067o90699n03063l80516j41859j80960
$$ 144397259 144256115 144120216 144062042 143876076 143265009 142574310 142071247 141690731 141548872 141367912
3172A41367912n35965o63042p13110o29663l88146j46389K95401K94924j50442l88384
$$ 141367912 140831947 140168905 139455795 138826132 138437986 138291597 138586998 138881922 138731480 138343096
3182A38343096o49452o66142l63111l11375m58002m46797l34024k52247r2268j61409
$$ 138343096 137693644 137027502 136664391 136353016 135895014 135448217 135114193 134861946 134769678 134608269
3192A34608269m84228o55413q66890p56741k04801n5075k02894k25782j75000k71082
$$ 134608269 134124041 133468628 132601738 131844997 131640196 131585121 131382227 131156445 130981445 130710363
3202A30710363n97477o00576l31402j40905J67608J58310j66416l81470o83784p13587
$$ 130710363 130112886 129512310 129180908 129040003 129207611 129365921 129199505 128818035 128134251 127420664
3212A27420664m90427k97547J3829J31845J08719M3869o6996l09467q48055r40561
$$ 127420664 126930237 126632690 126646519 126778364 126887083 126930952 126863956 126554489 125706434 124765873
3222A24765873o38008m80652l12328k19584j99079j79291j58072k18153m15086m45128
$$ 124765873 124127865 123647213 123334885 123115301 122916222 122736931 122578859 122360706 121945620 121500492
3232A21500492l26395k91347l44754k36988J26124J15871k62499m04596m58717m38691
$$ 121500492 121174097 120882750 120537996 120301008 120427132 120543003 120280504 119875908 119417191 118978500
3242A18978500l27110j81198J36137J30415k32458l22104k34127k20060k16007k26021
$$ 118978500 118651390 118470192 118606329 118736744 118504286 118182182 117948055 117727995 117511988 117285967
3252A17285967k30551l04937n25475n14269k93016j52826m054Q5831J70708J01566
$$ 117285967 117055416 116750479 116225004 115710735 115417719 115264893 115260839 115346670 115517378 115618944
3262A15618944j80006k93493l17812l20196l07560j87874J66893J49488k84671l53337
$$ 115618944 115438938 115145445 114827633 114507437 114199877 114012003 114178896 114328384 114043713 113690376
3272A13690376j44243r0599o8426j42098l83377m42981l88623l00169p9631m0532k12669
$$ 113690376 113546133 113455534 113387108 113245010 112861633 112418652 112030029 111729860 111650229 111609697 111397028
3283A11397028j64747J06573J55449J28269j15156q40664q48055j59264J11103L21627
$$ 111397028 111232281 111338854 111494303 111622572 111507416 110666752 109818697 109659433 109770536 110092163
3293A10092163J50204o43015p79629m19855k04325R9659K02179J68085K7180l47137
$$ 110092163 110242367 109599352 108819723 108399868 108195543 108295202 108497381 108665466 108692646 108345509
3303A08345509m81368m18424m62294o49214n31911p4387J30892K43425K14338j2397
$$ 108345509 107864141 107445717 106983423 106334209 105802298 105727911 105858803 106102228 106316566 106304169
3313A06304169j66416l53575m23193l79086l57389k98262l06129m21047l79324j82868
$$ 106304169 106137753 105784178 105360985 104981899 104624510 104326248 104020119 103599072 103219748 103036880
3323A03036880q8930j2636l7670k09331k65360k42234k57253k67029l31163n11408
$$ 103036880 102947950 102935314 102897644 102688313 102422953 102180719 101923466 101656437 101325274 100813866
3333A00813866n04732l37601k07901p868K9325p0333j79052l53575m95911p79867o08683
$$ 100813866 100309134 99971533 99763632 99755764 99785089 99714756 99535704 99182129 98686218 97906351 97297668
3344I7297668K43187K74659m77314o59705n53131l89814O1035J05381k40087l49522
$$ 97297668 97540855 97815514 97338200 96678495 96125364 95735550 95796585 95901966 95661879 95312357
3354I5312357l94583l17335L7909j2398n44071n73635j60218n0783m1962k03609p10249
$$ 95312357 94917774 94600439 94638348 94625950 94081879 93508244 93348026 93297243 93255281 93051672 92341423
3365I2341423p95841n84603l46422J45674K52962Q3923j58309p58648p80821j82629
$$ 92341423 91545582 90960979 90614557 90760231 91013193 91097116 90938807 90180159 89399338 89216709
3375H9216709o9857l44038k94685P3910O8426k88248l97921m27484l09706J02282J52111
$$ 89216709 89146852 88802814 88508129 88582039 88650465 88362217 87964296 87536812 87227106 87329388 87481499
3386H7481499j16825k23160k64406l33310m75883m17709j72377L7670L92437L93391
$$ 87481499 87364674 87141514 86877108 86543798 86067915 85650206 85477829 85515499 85907936 86301327
3396H6301327R5129k24114r21726q47816Q3923L77893M03643J77622o08444p40052
$$ 86301327 86396456 86172342 85250616 84402800 84486723 84864616 85268259 85445881 84837437 84097385
3406H4097385l60012j12056K81334L50236J42336o5088n47171m80890K67506L37839
$$ 84097385 83737373 83625317 83906651 84256887 84399223 84334135 83786964 83306074 83573580 83911419
3416H3911419j90258k76566k384q4638n76258n50509k2888J42098R2268R8228Q9407
$$ 83911419 83721161 83444595 83442211 83357573 82781315 82230806 82207918 82350016 82442284 82540512 82629919
3427H2629919P5102P9393n960l03030k17915L51429M00782J5735j43289k63929k58685
$$ 82629919 82705021 82784414 82778454 82475424 82257509 82608938 83009720 83025455 82882166 82618237 82359552
3438H2359552q5115j431J21117K2650l75986m99726n17606l31164J78576M37259O66619
$$ 82359552 82274437 82273006 82394123 82416773 82040787 81541061 81023455 80692291 80870867 81308126 81974745
3449H1974745N53369o7711k25782r6321M8876L88145M76837M38452K23398l62634m93050
$$ 81974745 82528114 82460403 82234621 82138300 82187176 82575321 83052158 83490610 83714008 83351374 82858324
3460H2858324l34263m7684P27416P07387j20639m22955o72102l11613J098156J241922
$$ 82858324 82524061 82476377 83203793 83911180 83790541 83367586 82695484 82383871 83482027 84723949
3470H4723949K05040m1008J36137K32459M87089M46319J06097o3658k54393j72376
$$ 84723949 84928989 84887981 85024118 85256577 85743666 86189985 86296082 86232424 85978031 85805655
3480H5805655K84910M11033L52860K28882j03951j91688j56641L3855N90086O34909
$$ 85805655 86090565 86501598 86854458 87083340 86979389 86787701 86631060 86664915 87255001 87889910
3490H7889910K43425p391m59671l23534M94003Q29220J155615P41720p77960j210212
$$ 87889910 88133335 88125944 87666273 87342739 87836742 88665962 89821577 90563297 89785337 88575125
3500H8575125j008749n53847O50645R98497P32183M86851j52588j61409N60283N86987
$$ 88575125 87566376 87012529 87663174 88661671 89393854 89880705 89728117 89566708 90126991 90713978
3510I0713978j5497q5116L01838K88487j39714o7949M85420O77586P70569N58138j81914
$$ 90713978 90698481 90613365 90915203 91203690 91063976 90996027 91481447 92159033 92929602 93487740 93305826
3521I3305826l55005n9843J907L9101q2493n93424m39882M12226P70092J008749Q18491
$$ 93305826 92950821 92890978 92892885 92931986 92849493 92256069 91816187 92228413 92998505 94007254 94825745
3532I4825745p9155k62738j5020L71695J300811J448870J019955N21183l65496q78334
$$ 94825745 94746590 94483852 94468832 94840527 96141338 97590208 98610163 99131346 98765850 97887516
3542I7887516j438379j123667L68595R02891J024723O87361o24895q06093j38045M00067
$$ 97887516 96449137 95325470 95694065 96596956 97621679 98309040 97684145 96878052 96740007 97140074
3552I7140074J340151J531601J002550P88688M42267P16448J924514K057076J879215
$$ 97140074 98480225 100011826 101014376 101803064 102245331 102961779 104886293 106943369 108822584
3561A08822584L37362l559827m795313m709959k957106K047062L620386K716541K202511
$$ 108822584 109159946 105600119 100804806 96094847 93137741 95184803 98805189 101521730 103724241
3570A03724241J053095N01394L50237J53780q5115O6757N50985J167775K255201K658129
$$ 103724241 104777336 105278730 105628967 105782747 105697632 105764389 106315374 107483149 109738350 112396479
3580A12396479L128528J811981j931428l688813n258798l862143J792908L758192L771067
$$ 112396479 115525007 117336988 115405560 111716747 106457949 102595806 104388714 108146906 111917973
3589A11917973K827644n34296j465082o47545k00987P24554Q48532Q7976N5075K54154
$$ 111917973 114745617 114211321 112746239 112098694 111897707 112622261 113470793 113558769 113613844 113867998
3599A13867998J053572L215790L321886J872539K82526k956152l226280m96864M88043
$$ 113867998 114921570 118137360 121459246 123331785 123614311 120658159 117431879 116935015 117423058
3608A17423058R08851P87497o36101l45945K426624J589298l153801m526615m571915
$$ 117423058 118331909 119119406 118483305 118137360 120563984 122153282 118999481 114472866 109900951
3617A09900951k397298L462076O253719Q064509P299423L837347k43426p718563r565115
$$ 109900951 107503653 110965729 117219448 125283957 132583380 136420727 136177301 128458738 118893623
3626A18893623p559538l619670O280899P951021J813412L66687J342535J313448J037836
$$ 118893623 111334085 107714415 113995314 121946335 123759747 124126434 125468969 126782417 127820253
3635A27820253R07183N77211J033545K254009L338099N365133M917860L005743r92298
$$ 127820253 128727436 129304647 130338192 132592201 135930300 141295433 146213293 149219036 148226738
3644A48226738r854317j1848688q920908n024195L126145O342411P001400M782677
$$ 148226738 138372421 126523733 117602825 112578630 115704775 122047186 129048586 133831263
3652A33831263l399134m882813j077652R91583L948450M323006J555204J355172K940178
$$ 133831263 130432129 125549316 124471664 125463247 129411697 133734703 135289907 136645079 139585257
3661A39585257L730774N338668L895760j089096l785372p102728n236387M450321N602837
$$ 139585257 143316031 148654699 152550459 151461363 147675991 140573263 135336876 139787197 145390034
3670A45390034N83648l705978j2936354j1329889K912998O814480L503561L440857
$$ 145390034 145973682 142267704 129331350 118001461 120914459 127728939 131232500 134673357
3678A34673357M464626M760743M964828M346609L807306M71831p355929j0018348r807587
$$ 134673357 139137983 143898726 148863554 153210163 157017469 157489300 150133371 140115023 130307436
3687A30307436p214785K05756L161668L214836L408671K636194K279043K320052J446008
$$ 130307436 123092651 123298407 126460075 129674911 133083582 135719776 137998819 140318871 141764879
3696A41764879m84466j594544l242492j874686L297329N565167O923198O102562K909661
$$ 141764879 141280413 139685869 136443377 134568691 137866020 143431187 150354385 156456947 159366608
3705A59366608o13213o683826q474350p577658m453182L276348O560564P488966O750822
$$ 159366608 158753395 152069569 143595219 136017561 131564379 134840727 141401291 148890257 155641079
3714A55641079K873182J057625L24011o11067j599550j953602j778126j342058p15017
$$ 155641079 158514261 159571886 159895897 159284830 157685280 155731678 153953552 152611494 151896477
3723A51896477O50167L043413M755249P786751N841980k170791n589486o480226p241726
$$ 151896477 152546644 155590057 160345306 168132057 173974037 171803246 166213760 159733534 152491808
3732A52491808q477211n375147L321171P771969J1324882J0428658M669685p48634
$$ 152491808 144014597 138639450 141960621 149732590 161057472 171486130 176155815 175407181
3740A75407181j0644207j0950327j638651L109217R925604O462326j1667481j4569282
$$ 175407181 164762974 153812647 152173996 155283213 165208817 171671143 160003662 145434380
3748A45434380n851031r77993N227089P520437O968260M547129k357483m266272k838134
$$ 145434380 139583349 138605356 143832445 151352882 158321142 162868271 160510788 156244516 153406382
3757A53406382r18866L882409M844903K751122J188507j565208k208710l41663q67596
$$ 153406382 152487516 156369925 161214828 163965950 165154457 163589249 161380539 161038876 160171280
3766A60171280m234800l748656K17438K459764M876853N076656L065338J208305j700401
$$ 160171280 155936480 152187824 152405262 154865026 159741879 164818535 167883873 169092178 167391777
3775A67391777l202209m431477l312826J539945K503395L34740l71933r62019o49929
$$ 167391777 164189568 159758091 156445265 157985210 160488605 160823345 160451412 159489393 158839464
3784A58839464Q77142J581421J843948K176514K670517K447376J544953O89258r21707
$$ 158839464 159716606 161298027 163141975 165318489 167989006 170436382 171981335 172670593 171748886
3793A71748886q08964J907101J229057k362251m795799r266606p066011M392624O051302
$$ 171748886 170939922 172847023 174076080 171713829 166918030 157651424 150585413 154978037 161029339
3802A61029339m13895k652168n005598k458573P464409R843111P034302M531136P877
$$ 161029339 160615444 157963276 152957678 150499105 157963514 167806625 174840927 179372063 179379940
3811A79379940k727032n578518m735698K031326J991024m253635o383648q031130m986763
$$ 179379940 176652908 171074390 166338692 168370018 170361042 166107407 159723759 151692629 146705866
3820A46705866N757332P956991K943268J635074J536370J712551L238449K745857k08855
$$ 146705866 152463198 160420189 163363457 164998531 166534901 168247452 171485901 174231758 174022903
3829A74022903m85649K271653J498222k298355m584542p575035o945381j935959Q7500
$$ 174022903 173537254 175808907 177307129 175008774 170424232 162849197 155903816 153967857 154055357
3838A54055357N01871J161814J125812K301932M451751O617547J0614395J0138759
$$ 154055357 154557228 155719042 156844854 159146786 163598537 170216084 180830479 190969238
3846A90969238O873589L90549j2974282j8139114j9957543j4096975M489660J1279345
$$ 190969238 197842827 198233376 185259094 167119980 147162437 133065462 137555122 148834467
3854A48834467J0647535R613762N339623K158394j764069l424149l586540k198944
$$ 148834467 159482002 169095764 174435387 176593781 174829712 171405563 167819023 165620079
3862A65620079K574921L334999J494407j199474p892609p751464n12123J934766J619339
$$ 165620079 168195000 171529999 173024406 171824932 163932323 156180859 155668736 157603502 159222841
3871A59222841K310992L212680L742218N064736L098488l818283m958382j040459Q2493
$$ 159222841 161533833 164746513 168488731 173553467 176651955 172833672 167875290 166834831 166917324
3880A66917324M87328k81582m167557k944221M707107N284061k1457k474785n749931
$$ 166917324 167404652 167123070 162955513 160011292 164718399 170002460 169981003 167506218 161756287
3889A61756287l889094M838000P551651P055778N012970n38101l417244n227814n738029
$$ 161756287 157867193 162705193 170256844 177312622 182325592 181787491 178370247 173142433 167404404
3898A67404404m182568l854751m860640l482342L76702K609968M675150M844904K498874
$$ 167404404 163221836 159367085 154506445 151024103 151400805 154010773 158685923 163530827 166029701
3907A66029701J846066K291431K005577J612911M44890k027283l020744l481408k410164
$$ 166029701 167875767 170167198 172172775 173785686 174230576 172203293 169182549 165701141 163290977
3916A63290977J290799K229442J190434M25339j275540j328239J32560J059781K682209
$$ 163290977 164581776 166811218 168001652 168426991 167151451 165823212 165955772 167015553 169697762
3925A69697762K128829r05494k330075l507862l078460o45390Q43296K470722K851963
$$ 169697762 171826591 170921097 168591022 165083160 162004700 161359310 162202606 164673328 167525291
3934A67525291J958847J288891L81947m21047j522065j656532r55334j60942J680146
$$ 167525291 169484138 170773029 171154976 170733929 169211864 167555332 166599998 166439056 168119202
3943A68119202J495819r62487j628646j353264q02994O48270J162052J075744Q76904
$$ 168119202 169615021 168652534 167023888 165670624 164867630 165515900 166677952 167753696 168630600
3952A68630600K65598m8160j51406m06723r58690q69751l8147J89075p1068N9853O20117
$$ 168630600 168896198 168848038 168696632 168289909 167331219 166461468 166423321 166612396 166541328 166601181 167221298
3963A67221298N76515o9160k92778l63102k29359L57628L49770k21253m36325o11057
$$ 167221298 167797813 167728653 167435875 167072773 166843414 167201042 167550812 167329559 166893234 166282177
3973A66282177m04110M14124N83419K42691R5139q8921r6321P1984K05764M51813M32472
$$ 166282177 165878067 166292191 166875610 167118301 167213440 167124519 167028198 167100182 167305946 167757759 168190231
3984A68190231J93844p1277o95725n41439N27134Q29697P02152M78039l8395m00791
$$ 168190231 168384075 168312798 167617073 167075634 167602768 168432465 169134617 169612656 169574261 169173470
3994A69173470r71299p47928N73635P74154R5826k13852
$$ 169173470 168202171 167454243 168027878 168802032 168897858 168684006
4000A68684006
$$ 168684006
##END=$$ End of the data block
