##TITLE=DM2 - ATR $$ Begin of the data block
##JCAMP-DX=5.00 $$ ACD/SpecManager v 10.08
##SPECTROMETER/DATA SYSTEM=Alpha
##DATE=09 Oct 2013 10:45:04
##DATA TYPE=INFRARED SPECTRUM
##DATA CLASS=XYDATA
##ORIGIN=
##OWNER=
##NPOINTS=1667
##FIRSTX=599.57470703
##LASTX=3997.16503906
##MAXX=3997.16503906
##MINX=599.57470703
##MAXY=0.99231511
##MINY=0.91193396
##XFACTOR=1.0000000000
##YFACTOR=1.000000000000000e-9
##FIRSTY=0.94029546
##DELTAX=2.03937006
##XUNITS=1/CM
##YUNITS=ARBITRARY UNITS
##XYDATA=(X++(Y..Y))
599.6 940295458 940006256 939801335 940412760 941669703 943445504 945615590 947371006 948285699 948819637
617.9 948819637 949395478 950164258 950506151 949944079 949404478 949482262 949924946 950494349 950963795 951293349
638.3 951293349 951431990 951302648 951375127 951735079 951947451 952347279 953043878 953353524 953232348 953177989
658.7 953177989 953294337 953306913 953382134 954226017 954947054 954109251 953274608 953017414 953067601 953047037
679.1 953047037 952854216 952688575 952559412 952353537 952169180 952067912 951799691 951112747 950406492 950087786
699.5 950087786 949873447 949646056 949106812 947040021 943054020 940529406 943637550 950489044 956141114
717.9 956141114 959124804 960331380 960577726 960279286 959991038 960456133 961597562 962495983 962704182
736.2 962704182 962530553 962266505 962041080 961851358 961533606 961020887 960488200 960046649 959585369 959180713
756.6 959180713 959032297 959228694 959810615 960453391 960758924 960951924 961341381 961939633 962719023 963320851
777 963320851 963529646 963662446 963819802 963953733 964132786 964138329 963896036 963910282 964253008 964538395 964723289
799.4 964723289 964868665 965004265 965130389 965306461 965557098 965738058 965758979 965592861 965278089 964822233
819.8 964822233 964368224 964095652 963861048 963716209 963627458 963157475 962449074 961894453 961332679 960657179
840.2 960657179 959984183 959126472 958070755 957330823 956965983 956560731 955797195 954307079 952113330
858.6 952113330 949683309 947055876 943629801 938743412 932387352 925988913 922067344 922102273 925626159
876.9 925626159 931332469 937779188 944400311 951532423 958038986 961914361 963193536 963285089 962942541
895.3 962942541 962289691 961481512 960514188 959201574 957576931 955791473 954106212 952855349 952161729
913.6 952161729 951992452 952142358 952324271 952547550 952874124 953157067 953382969 953564107 953579307 953483582
934 953483582 953392684 953402758 953679740 954259813 955009401 955745399 956404150 956921756 957086623 956796467
954.4 956796467 956166148 955488682 954904199 954160094 953103900 951935709 950752318 949388564 947834551
972.8 947834551 946131468 944135010 941893578 939520717 936906993 934119165 931416810 928878903
989.1 928878903 926447988 924092412 921767056 919382334 917048633 915004730 913366556 912278831
1005.4 912278831 911933959 912437558 913614511 915095389 916575372 917853236 918966234 919948339 920598447
1023.8 920598447 920912683 921275616 922139227 923639655 925487518 927435875 929463267 931475341 933293283
1042.1 933293283 934860289 936398208 938220620 940434635 942877531 945308387 947610080 949699759
1058.4 949699759 951456487 952817261 953677952 953840375 953177929 951641381 949616194 947924316 947066605
1076.8 947066605 947074294 947745562 948796928 949901998 950847149 951687515 952404559 952928543 953246772 953251481
1097.2 953251481 953131497 953234076 953657687 954390943 955277741 956157029 956890821 957488239 958328664 959576130
1117.6 959576130 960927010 962133646 963140309 963916898 964473188 964895844 965272486 965525329 965512991
1135.9 965512991 965198755 964654565 964026570 963438213 963003457 962777197 962735355 962927043 963437736 964186549
1156.3 964186549 965051353 965987802 966979623 968092442 969200730 969985127 970380068 970579326 970739543
1174.7 970739543 970894814 971001446 970974207 970799744 970488071 970048428 969523966 968919992 968283653 967679501
1195.1 967679501 967046261 966372907 965700805 964981019 964290738 963687718 962987363 962167263 961454272 960906506
1215.5 960906506 960361183 959704697 959010601 958422840 957991123 957722127 957563758 957460940 957504630 957720459
1235.9 957720459 958049297 958492696 959026337 959591746 960154772 960663974 961092770 961556315 962136686 962773979
1256.3 962773979 963420272 964010060 964477897 964915752 965394914 965827346 966158748 966375411 966439545 966374576
1276.7 966374576 966219246 965999126 965790749 965618610 965387821 965031266 964569867 964049995 963520944 963009119
1297 963009119 962518632 962067783 961669743 961219013 960703492 960254133 959762275 959153712 958562732 958013296
1317.4 958013296 957521260 957133293 956699908 956100285 955435395 954796553 954215288 953584492 952756703 951826990
1337.8 951826990 951159954 950929463 950716972 950185895 949418724 948570371 947651803 946613729 945535421
1356.2 945535421 944464743 943288445 942153096 941439092 940871775 940121233 939397097 938805342 938525677
1374.5 938525677 938673377 938829064 938695788 938246608 937456608 936545372 935826540 935024381 933785856
1392.9 933785856 932440579 931645870 931408167 931226730 930650353 929817557 929131866 928564548 928114712
1411.3 928114712 927802503 927326500 926765919 926987529 927832246 928427875 928930759 929444551 929977536 930669725
1431.6 930669725 931274772 931881845 933057666 934415281 935567141 936499059 937107742 937735498 938685954
1450 938685954 939624965 940221786 940767467 942260921 944210410 945653319 946892500 948282003 949342012
1468.4 949342012 949797273 950298131 951527178 953185916 954736173 955993652 957125187 958031714 958624184
1486.7 958624184 959298730 960588217 962013841 963043213 964104354 965456784 966654241 967330456 967394829
1505.1 967394829 967628956 968979299 970568061 971736610 972392499 972996771 973686039 974472702 975516498
1523.4 975516498 976450741 977406263 978351593 978946865 979565680 980389714 980755627 980788410 981446981 982660532
1543.8 982660532 984022915 985058129 985753536 986365616 986715734 986605227 986377060 987203419 988371909
1562.2 988371909 988931000 989093900 989190817 989487231 989779592 989706695 989579082 989858508 990203440 990369856
1582.6 990369856 990433872 990443945 990421116 990380108 990326703 990378499 990557730 990671277 990619779 990532398 990447283
1605 990447283 990297258 990153015 990067005 989915073 989670455 989633799 989729106 989592850 989484489 989647746
1625.4 989647746 989791870 989781439 989625156 989242613 988848805 989037454 989451289 989572823 989277899 988714099
1645.8 988714099 988611341 988826811 988525808 988384485 989130139 989643157 989614248 989465714 989610970 989660203
1666.2 989660203 989332557 989153326 989294052 989355862 989493728 989571214 989183784 988461792 988262951 988791823
1686.6 988791823 989114285 989272654 989240110 988729060 988093495 987770438 987771392 987871528 987852156 987904608 987908542
1709 987908542 987555802 986812115 985855758 985254586 985440910 985746622 985788643 985754848 985661328 985479414
1729.4 985479414 985359848 985714376 986810863 987769067 988424063 988974571 989375174 989686847 989918351
1747.8 989918351 990281284 991037667 991677642 991779327 991698444 991661251 991641641 991688788 991533399 991184115
1768.2 991184115 990883887 990746260 990914345 991108656 991078496 991009772 991003692 990919411 990750313 990309715
1788.5 990309715 989536524 989064276 989190459 989423156 989519536 989658475 990149438 990710497 990942419 990939617
1808.9 990939617 990920603 991004050 991101205 991102219 991105676 991052449 990808964 990619600 990578532 990528762 990676105
1831.4 990676105 990969837 991088033 991051257 990981698 990763843 990449846 990439653 990690231 990922511 991023481
1851.8 991023481 990971029 990872383 990836322 990887165 990920067 990796387 990445316 990091026 990186930 990547776 990719378
1874.2 990719378 990704954 990696609 990795612 990899384 990900993 990795672 990596533 990549088 990674257 990683794 990649104
1896.6 990649104 990724444 990811169 990778148 990623832 990416110 990283489 990381658 990571558 990522146 990281463
1917 990281463 990220666 990269363 990306556 990483284 990625560 990590632 990487635 990399420 990356624 990368307 990365803
1939.5 990365803 990278184 990224838 990282238 990383148 990453184 990449250 990388691 990346253 990404129 990486264 990508854
1961.9 990508854 990460336 990336955 990288258 990347505 990375698 990383029 990402639 990412951 990398169 990325153 990193069
1984.3 990193069 990107238 990118206 990098238 990088582 990216851 990361392 990371764 990274429 990191102 990186214 990230620
2006.8 990230620 990245879 990185440 990060866 989924252 989904821 990068793 990230322 990239859 990172923 990128100 990165174
2029.2 990165174 990251243 990266263 990186632 990089417 990005672 989977658 990029991 990050673 990012705 989989102 989992023 990016460
2053.7 990016460 990077734 990155876 990140319 990014076 989947975 990024567 990119040 990141988 990106344 990025282 989963830
2076.1 989963830 989951313 989943683 989945948 989964306 989967346 989946604 989953041 989992619 989980459 989922881 989911497 989934802
2100.6 989934802 989957511 989986479 989949286 989866376 989882231 989952505 989938796 989860475 989826322 989867210 989893973
2123 989893973 989855945 989815056 989779949 989710033 989654899 989656746 989652336 989618182 989631593 989683568 989719450 989740789
2147.5 989740789 989724517 989720285 989790082 989856005 989868283 989828289 989768624 989754796 989757538 989742935 989723444 989720702
2172 989720702 989747226 989757895 989743054 989720345 989687741 989721537 989821434 989851654 989850819 989887238 989851296 989783168
2196.4 989783168 989808321 989826620 989751756 989689469 989684939 989680290 989676297 989677012 989701629 989791512 989869177 989833415
2220.9 989833415 989734232 989673495 989665687 989685416 989708662 989681423 989632130 989640772 989672303 989684284 989684165 989659429
2245.4 989659429 989650548 989680648 989662290 989601970 989618003 989694655 989724815 989664316 989540398 989468932 989511907
2267.8 989511907 989575148 989597738 989575684 989524543 989529848 989583790 989593267 989572883 989529967 989461958 989451766 989481449
2292.3 989481449 989482939 989475965 989483654 989462376 989327788 989209473 989251912 989273608 989169538 989115000 989219546
2314.7 989219546 989348352 989330411 989278853 989436448 989728332 990004301 990249515 990363598 990431488 990640342
2335.1 990640342 990773022 990609407 990435779 990366578 990125418 989887297 989900708 990127206 990571499 991011739
2355.5 991011739 991008222 990897477 991058946 991156697 990875602 990342677 989972889 989809632 989596188 989275098
2375.9 989275098 989005268 988928437 989031494 989202619 989339590 989344835 989269257 989278138 989358723 989411056 989377558
2398.3 989377558 989279687 989211321 989205360 989251971 989305079 989275277 989177048 989136875 989187181 989278078 989342034 989302933
2422.8 989302933 989244401 989265800 989254892 989180386 989167809 989190519 989157677 989105463 989098430 989151180 989219725 989244044
2447.3 989244044 989215314 989155650 989113510 989092410 989075124 989070415 989052594 989046335 989033937 988968074 988917708 988945007
2471.7 988945007 989013731 989040911 989015758 988936067 988823831 988800108 988810599 988741636 988699555 988696158 988638699
2494.2 988638699 988568366 988532007 988515139 988496602 988492906 988471806 988376200 988268912 988240898 988285720 988328815
2516.6 988328815 988392532 988518953 988597512 988617063 988685727 988759041 988785028 988816798 988867223 988887846 988887548 988916755
2541.1 988916755 988961399 988968551 988946080 988975346 989037097 989006579 988890886 988829672 988843918 988865674 988890111
2563.5 988890111 988888860 988852739 988852859 988853455 988815010 988849699 988915026 988907456 988887846 988849938 988805532 988844335 988886535
2590 988886535 988830328 988794208 988832951 988822162 988778472 988791645 988821864 988821268 988818765 988882482 989007056 989088953
2614.5 989088953 989075720 989007175 988951623 988913655 988895953 988937259 988978148 988931477 988850474 988832712 988848150
2636.9 988848150 988840520 988817930 988750935 988658249 988684237 988783479 988795996 988786459 988775015 988713264 988700747 988756895
2661.4 988756895 988769054 988731980 988694251 988653123 988674641 988745213 988710642 988645017 988701284 988734901 988656759
2683.8 988656759 988608122 988635898 988685787 988722622 988703310 988654375 988624573 988615513 988618612 988608420 988650680 988745153
2708.3 988745153 988757312 988739550 988793671 988847613 988847315 988809764 988764405 988719702 988666713 988668025 988699734 988660336
2732.8 988660336 988584816 988570154 988598108 988557339 988464892 988394737 988339365 988336563 988417923 988545835 988688171
2755.2 988688171 988739073 988628983 988500059 988449216 988434970 988460660 988452971 988339961 988309085 988420844 988500774
2777.6 988500774 988506556 988454044 988366365 988287628 988231778 988256156 988360703 988440037 988430202 988356769 988308668 988331854
2802.1 988331854 988335967 988261759 988187134 988139510 988095164 988124430 988201082 988224566 988227069 988241434 988278866 988326311
2826.6 988326311 988297820 988209665 988190413 988275886 988397419 988518775 988601506 988684297 988956630 989389539 989806890
2849 989806890 990201294 990468264 990503192 990401030 990197301 989854395 989469111 989199102 989041328 988952518
2869.4 988952518 988894224 988802433 988749504 988753617 988709748 988641679 988648295 988732398 988830626 988911331 988978267 989034832
2893.9 989034832 989099205 989189506 989303946 989449978 989604950 989763796 989963412 990189254 990432560 990685523
2914.3 990685523 990970194 991345465 991762877 992107332 992294669 992315114 992228389 992075920 991825461 991462231
2934.7 991462231 991098702 990817964 990601838 990472376 990444899 990441680 990476727 990664065 990898192 990995288
2955 990995288 990995646 990964770 990903914 990851402 990807652 990673423 990354180 989960074 989734232 989690900 989589989
2977.5 989589989 989377856 989222586 989167631 989166081 989170074 989145517 989100397 989067435 989087045 989129663 989101708
2999.9 989101708 988988757 988945544 988998592 988960922 988824487 988719225 988667965 988645732 988641918 988640666 988604486
3022.3 988604486 988511920 988465369 988442302 988361657 988367021 988460720 988440633 988258541 988119483 988145828 988168895
3044.8 988168895 988067091 987984657 988041580 988061726 987962306 987934828 988005280 988022268 987957478 987848639 987756193
3067.2 987756193 987728953 987739682 987771749 987745404 987608194 987510860 987563968 987623632 987582326 987523913 987492681
3089.6 987492681 987510204 987523139 987407088 987233460 987176836 987247586 987312078 987294257 987217546 987146497 987102389
3112.1 987102389 987075448 987079680 987073183 987057507 986995876 986843884 986742496 986742675 986736715 986677945 986691296 986846387
3136.5 986846387 986929357 986882687 986864328 986820519 986717641 986688077 986703753 986651063 986550331 986462712 986391842
3159 986391842 986363232 986409068 986450613 986428738 986396968 986373305 986345828 986319244 986297727 986265600 986185968 986122310
3183.5 986122310 986115396 986084580 986050725 986060858 986083508 986086488 986059010 986050487 986097693 986165464 986182153 986091197
3207.9 986091197 985964775 985913515 985944390 985991776 985944748 985738039 985488474 985406637 985519648 985650361
3228.3 985650361 985692561 985729337 985777020 985789776 985851407 985963821 985988379 985852301 985693574 985725760 985896230
3250.7 985896230 985991955 985979974 985963583 985965908 985960901 985942721 985914409 985881627 985865653 985884726 985871315 985741496
3275.2 985741496 985618234 985721111 985950887 986013651 985946059 985997677 986149430 986200690 986104071 986029685 986105561
3297.7 986105561 986205339 986209810 986160636 986088991 986019850 986030877 986101449 986153126 986252725 986380875 986400902
3320.1 986400902 986338794 986272991 986196697 986120224 986129224 986230731 986312568 986320972 986342609 986441493 986540020 986597955
3344.6 986597955 986578763 986496806 986518919 986575067 986552775 986607254 986746252 986878216 986995578 987042725 987059712
3367 987059712 987156570 987252116 987260520 987255752 987230062 987181962 987185597 987246633 987397790 987515152 987420917 987308443
3391.5 987308443 987363875 987409472 987391710 987506390 987744451 987956524 988146961 988257110 988145828 987997890
3411.9 987997890 988021851 988086045 988050222 988012075 988112330 988258779 988318026 988336861 988353491 988388002 988494694
3434.3 988494694 988583922 988622606 988726437 988845885 988859773 988822460 988913774 989054263 988996208 988850832 988814056
3456.7 988814056 988820612 988855600 989007831 989235461 989442527 989524722 989416778 989285409 989282846 989368439 989474118
3479.1 989474118 989492297 989470601 989533305 989585876 989597321 989589572 989538372 989571452 989633143 989521205 989398301
3501.6 989398301 989522576 989772618 989814043 989654839 989632308 989800394 989976287 990089715 990053356 989795685
3522 989795685 989596188 989688933 989847362 989976287 990103662 990124583 990118265 990176737 990215242 990114570 989869416
3544.4 989869416 989801705 990068376 990264893 990248799 990313947 990421593 990375936 990302503 990138531 989615738
3564.8 989615738 989258885 989714026 990370810 990737498 990811288 990667641 990616500 990670145 990390837 989682198
3585.2 989682198 989296257 989746034 990161479 990083158 990051091 990309894 990454435 990422904 990392566 990142763
3605.6 990142763 989666402 989320934 989016831 988629460 988195300 987847209 988246500 989235163 989802003 989621401
3626 989621401 989144564 989204586 989615917 989936471 990141571 990095675 989876390 989695728 989277422 988296747
3646.4 988296747 987403929 987740040 988619864 989027023 989227176 989613116 990007043 990276575 990228772 989702225
3666.8 989702225 989021540 988693714 988475800 988233566 988499343 988923371 989053309 988848150 988261461 987386227
3687.2 987386227 986619174 986649334 987340748 988156676 988910735 989491701 989965439 990514040 990903795 990833998
3707.6 990833998 990486324 990437925 990934193 991468668 991572976 991322935 991037846 990844429 990940273 991358757
3727.9 991358757 991480231 990820289 989914179 989859819 990522981 990889788 990674853 990303218 990269959 990230143
3748.3 990230143 990078330 990379333 990849376 990960598 990927875 991103292 991273224 991286874 991290689 991230667
3768.7 991230667 991259456 991556764 991816282 991817951 991702616 991674006 991653383 991569817 991553724 991681993 991842687
3791.2 991842687 991812825 991515279 991127670 990761399 990565300 990776360 991004467 991087019 991265774 991394103
3811.6 991394103 991253257 990904212 990511358 990212262 990432978 990925014 991124034 991156101 991003215 990759373
3831.9 990759373 990702569 990661800 990546107 990530670 990608513 990868807 991228163 991248548 990711629 990041971
3852.3 990041971 990120888 990493357 990604758 990602970 990449786 990203381 989970744 989778638 989937246 990401804
3872.7 990401804 990776479 990862429 990585327 990319252 990319371 990438163 990780711 991033554 990975440 990991294 991069436
3895.2 991069436 990763247 990111589 989646554 989682436 990246654 990948439 991326988 991379857 991200149 990847111
3915.6 990847111 990602612 990586400 990630627 990701735 990789056 990756512 990633547 990731359 991069555 991332412 991327226
3938 991327226 991051614 990814567 990779579 990764678 990819454 991006851 991137326 991184294 991220474 991207302 991061568
3960.4 991061568 990900576 990981281 991079271 990910232 990796983 990996182 991268694 991471231 991566181 991431832
3980.8 991431832 991283953 991304457 991289437 991235793 991271198 991199791 990995347 990998149
3997.1 990998149
##END=$$ End of the data block
