##TITLE=DI_16-0945783-0_Adicao 01 - item3 - Peyote Cross Country $$ Begin of the data block
##JCAMP-DX=5.00 $$ ACD/SpecManager v 10.08
##DATE=07 Jul 2016 17:40:24
##DATA TYPE=INFRARED SPECTRUM
##DATA CLASS=XYDATA
##ORIGIN=Angelo Ruzza
##OWNER=
##NPOINTS=1667
##FIRSTX=599.57470703
##LASTX=3997.16503906
##MAXX=3997.16503906
##MINX=599.57470703
##MAXY=0.93658745
##MINY=0.65789789
##XFACTOR=1.0000000000
##YFACTOR=1.000000000000000e-9
##FIRSTY=0.65790898
##DELTAX=2.03937006
##XUNITS=1/CM
##YUNITS=ARBITRARY UNITS
##XYDATA=(X++(Y..Y))
599.6F57908976j1086O16252J074612P73072L35277Q0525j88529j34111P5520P8737
620F60609245M59671J011551J382470J564085J299382P79450K40802k205p5340k7597
640.4F67241514O5505q8811K28286R44257J124978R46403J319527K153039K483845
658.7F76418543K641559L073632L119111M269064O058752M142106L377557M387200
675G07487524M675388M015922L319741L134668K942860K479195J941026J430690J155019
693.4G32582033R12964M02808M3869j97172p60615j456380j856267j858413j467765
711.7G26345062r87291q59499p60436j76966Q38220K331674M794896Q015930J0667265
730.1G50208855J1473775J0459899Q278490N270302K195358j42455j580000k269387
$$ y = [657908976, 657897890, 658514142, 659588754, 660361826, 660697103, 660777628, 660589099, 660454988, 660530508, 660609245, 661068916, 662080467, 663462937, 665027022, 666326404, 667105854, 667346656, 667344451, 667269111, 667241514, 667307019, 667218208, 667446494, 668390751, 669515729, 670462132, 671781659, 673934698, 676418543, 679060102, 682133734, 685252845, 689521909, 695580661, 699722767, 703100324, 707487524, 712162912, 716178834, 719498575, 722633243, 725576103, 728055298, 729996324, 731427014, 732582033, 733494997, 733897805, 733941674, 733744502, 732983887, 731527507, 729671240, 727812827, 726345062, 725357771, 724498272, 723737836, 723560870, 724399090, 726730764, 731525660, 739541590, 750208855, 761682630, 772142529, 780421019, 785691321, 787886679, 787744224, 786164224, 783894837]
746.4G83894837k453923k412796k286852k375424k573013k478719k355694k455295
762.7G64503121k533555k567052k682686k718091k901793l148079k962231k534152
779G42455482j961410r43958M96268J957238K513349J480400o22570l057659n231619
797.4G37085521o637990p237852p398367p470608p225096o641209o067991n124986
813.7F83281422l648222j528323K514780R022176J6127348K0056188J8720031J4257074
830G58802474R853780O679356M438996L014505K065361J234054P87735N91338J69158
848.4G87636757q90255k522290m138052n919814q152903p728397n26786R861707J4536262
866.7G82156229J1731386O459475J891136j196206k817094l546357l713727l502309
$$ y = [783894837, 781440914, 779028118, 776741266, 774365842, 771792829, 769314110, 766958416, 764503121, 761969566, 759402514, 756719828, 754001737, 751099944, 747951865, 744989634, 742455482, 740494072, 739550114, 740046382, 742003620, 744516969, 745997369, 745374799, 742317140, 737085521, 730447531, 723209679, 715811312, 708340704, 701115608, 694474399, 688406408, 683281422, 679633200, 678104877, 680619657, 689641833, 705769181, 725825369, 744545400, 758802474, 768656254, 775335610, 779774606, 782789111, 784854472, 786088526, 786876261, 787467599, 787636757, 786746502, 784224212, 780086160, 774166346, 766013443, 758285046, 757758260, 767619967, 782156229, 793887615, 800347090, 802238226, 801042020, 798224926, 794678569, 790964842, 787462533]
883G87462533k962113k055943q22008R59576L709614P113576R535074R490371P204354
901.4H19635034M005074J260460m32671j170039j322448j458704j662791j742661j746953
919.8H15364301j738965j826048j902342j717091j442194j397669j507521j453936
936.1H02378535j198232p60615l17096l90471p64727r73582j198292j417160j342178
954.4G94016182j029729q25704q13901n82814j28806k38j91927m12703o41584p35104
974.8G88653672l40402N14567J150667R92000J32740p60555j162291j161218j121103
993.2G86898077j254678j446247j462221j415492j691579k016485k005756j992464
1009.5G73613155j933515q73685K451241P660866J0821044Q345306K491355j892149
$$ y = [787462533, 784500420, 782444477, 781622469, 782582045, 786291659, 793405235, 802940309, 812430680, 819635034, 823640108, 824900568, 824467897, 823297858, 821975410, 820516706, 818853915, 817111254, 815364301, 813625336, 811799288, 809896946, 808179855, 806737661, 805339992, 803832471, 802378535, 801180303, 800419688, 800102592, 799712121, 798947394, 797973812, 796775520, 795358360, 794016182, 792986453, 792160749, 791346848, 790764034, 790635228, 790634990, 790443063, 790030360, 789388776, 788653672, 788313270, 788827837, 789978504, 790970504, 791103244, 790342689, 789180398, 788019180, 786898077, 785643399, 784197152, 782734931, 781319439, 779627860, 777611375, 775605619, 773613155, 771679640, 770805955, 773257196, 780918062, 791739106, 800084412, 802575767, 800683618]
1025.8H00683618l355802l205299k709567k289951j808644j483082j474023j248002
1042.1G83109248p56800n38469o69300p06911m45009k58028l90411o26802p72178r74119
1062.5G76971221j310706j446426j257479j017928q96871p92087n74290l47317k30372
1080.9G69097745k95281n33760q29160j135289j283944j127124r21786r19103q75593
1099.2G61176705o55353l53992L30925J716435L470481M574060M320741L294706K443791
1117.6G80318499J831710J241624R96471J260757J768470K300262K550364K110004
1133.9G94378161Q61288n76795j454472j765072j707852j432002j303315j305819j059174
1152.2G84634948q57175r87768j016974r00865r20176j034856j084805r63807p32302
$$ y = [800683618, 797327816, 794122517, 791412950, 789122999, 787314355, 785831273, 784357250, 783109248, 782352448, 781813979, 781144679, 780437768, 779992759, 779734731, 779344320, 778717518, 777945340, 776971221, 775660515, 774214089, 772956610, 771938682, 771041811, 770249724, 769675434, 769328117, 769097745, 768802464, 768268704, 767439544, 766304255, 765020311, 763893187, 762971401, 762052298, 761176705, 760521352, 760167360, 760498285, 762214720, 765685201, 770259261, 774580002, 777874708, 780318499, 782150209, 783391833, 784388304, 785649061, 787417531, 789717793, 792268157, 794378161, 795239449, 794662654, 793208182, 791443110, 789735258, 788303256, 786999941, 785694122, 784634948, 783777773, 782790005, 781773031, 780872166, 779951990, 778917134, 777832329, 776868522, 776136220]
1170.6G76136220m84288j56224L78907R28759J147747J104772Q44896L95656l1531
1189G80264914n03361q61347p23541k75254q1479k93315o11424q41320r29594r34958
1209.4G74209321p94888m43876k27034j13666L35217Q61942J028777R88662R41574
1227.7G76786029Q82149Q58665Q54015N70416N722k98500j14143K47121N93543R82523
1248.1G81367540J308620J326263J124382J093209J308262J593113J918316K158821
1264.4G93198526K060950J473665N64992k13980o80268j098096j822174k915740l917396
1282.8G86650479m279196m050315l661215l223062k617120k024711j479804n92113
1299.1G64722943P00295K016664L167212M145086M669428M735827M721284M862308
$$ y = [776136220, 775651932, 775495708, 775874615, 776803374, 777951121, 779055893, 779900789, 780296445, 780264914, 779761553, 778900206, 778176665, 777901411, 777819932, 777526617, 776915193, 776073873, 775144279, 774209321, 773414433, 772970557, 772743523, 772629857, 772965074, 773827016, 774855793, 775844455, 776786029, 777668178, 778526843, 779380858, 779951274, 779956996, 779658496, 779544353, 779791474, 780385017, 781367540, 782676160, 784002423, 785126805, 786220014, 787528276, 789121389, 791039705, 793198526, 795259476, 796733141, 797298133, 797084153, 796403885, 795305789, 793483615, 790567875, 786650479, 782371283, 778320968, 774659753, 771436691, 768819571, 766794860, 765315056, 764722943, 765423238, 767439902, 770607114, 774752200, 779421628, 784157455, 788878739, 793741047]
1315.4G93741047N321861O086290O900250P451714P521152O951928N745650L970444
1331.7H43690336J758694l60429k010405l306270m062593m105329l771067l279209
1348H24553728k839148k536833k390743k316415j946807j496255j504004j931906k520859
1366.4H05070758l589273m978001n873978n178034k375305L23176Q21114n68032j957059
1384.7G81695366k415955k006591q82446J129627L879964N768597N987525M734457
1401.1G97890544L743470N244255Q621812J2466847J5413821J4919639J0706782M732013
1417.4H73739183k181053p005155q642078q946657p867515o902576o155908n256712
1433.7H20781529m991949m886210m087746l696263l549635l201187k904832k454400
$$ y = [793741047, 799062908, 805149198, 812049448, 819501162, 827022314, 833974242, 839719892, 843690336, 845449030, 845088601, 843078196, 839771926, 835709333, 831604004, 827832937, 824553728, 821714580, 819177747, 816787004, 814470589, 812523782, 811027527, 809523523, 807591617, 805070758, 801481485, 796503484, 790629506, 785451472, 783076167, 783399343, 784220457, 783652425, 781695366, 779279411, 777272820, 776390374, 777520001, 781399965, 787168562, 793156087, 797890544, 801634014, 806878269, 815500081, 827966928, 843380749, 858300388, 869007170, 873739183, 871558130, 864552975, 855910897, 846964240, 839096725, 832194149, 826038241, 820781529, 815789580, 810903370, 806815624, 803119361, 799569726, 796368539, 793463707, 791009307]
1450G91009307j842678j151323j17779O20783K96175L57926N43594M1485l52144P6950
1470.4G89482296L95715l47674j026988r44197n24283j97232j27792m1485L7551n45621
1490.8G86160290j386940j857221k330959k700985k642691k139091j172543K50042
1507.1G72179902J466155K942264M909277P404089R721756R702146Q595049M650951
1523.4H21571589p33793m217863n457342m698992k719462j02460K446711N998731P291138
1541.8H19378257O453931P113099P566750Q186877Q198440P716537P116854Q489132
1558.1H80219877R316206M668712K955675K781094K384960K014280J141667N86808
1574.4I06069279N6028j172781k184510l252924m339456n188286n746842o196976o627500
$$ y = [791009307, 789166629, 788015306, 787897527, 788518310, 788814485, 789172411, 789716005, 789757490, 789405346, 789482296, 789878011, 789530337, 788503349, 787559152, 787034869, 786837637, 786709845, 786668360, 786705911, 786160290, 784773350, 782916129, 780585170, 777884185, 775241494, 773102403, 771929860, 772179902, 773646057, 776588321, 781497598, 788901687, 798623443, 808325589, 816920638, 821571589, 820837796, 816619933, 811162591, 806463599, 803744137, 803641677, 806088388, 812087119, 819378257, 825832188, 832945287, 840512037, 848698914, 856897354, 864613891, 871730745, 880219877, 889536083, 894204795, 897160470, 899941564, 902326524, 904340804, 905482471, 906069279, 906125307, 904952526, 902768016, 899515092, 895175636, 889987350, 884240508, 878043532, 871416032]
1592.8H71416032o937384o897450o425798n616784m355132k858162j555384o00039
1609.1H36169899j10388k46764p16924j729191k662956l029406l617168l756165l281355
1627.4H17019582k773583k139568j136363N65350K180576K866447L161550L341734
1643.7H23085725M696846N779445M328967N850434J0687351Q460522O555438P375896
1660.1H76820624Q459568Q081555O041169N443335N637586M359067L628969L558218
1676.4I22030091K808690K358795K554714L004134J911998Q21709O11663L99232Q6427
1694.7I36587453m00663n57422o50287p46727p42972q24690p75218o14881o55055p34985
1715.1I29884553n47051l92795l48687k67208j90735m10199r71317j320005j035690
$$ y = [871416032, 864478648, 857581198, 851155400, 845538616, 841183484, 838325322, 836769938, 836169899, 836059511, 835812747, 835095823, 833366632, 830703676, 827674270, 824057102, 820300937, 817019582, 814245999, 812106431, 810970068, 811535418, 813715994, 816582441, 819743991, 823085725, 827782571, 833562016, 837890983, 843741417, 854428768, 862889290, 869444728, 876820624, 885280192, 893361747, 899402916, 904846251, 910483837, 914842904, 918471873, 922030091, 924838781, 927197576, 929752290, 932756424, 934668422, 935490131, 936101794, 936501026, 936587453, 936186790, 935629368, 934979081, 934232354, 933489382, 932664692, 931889474, 931274593, 930619538, 929884553, 929337502, 928944707, 928596020, 928328812, 928138077, 927727878, 926756561, 925436556, 924400866]
1733.5I24400866n16891k84672k89321n64039p90715j003742j111389o60717n9903
1751.8I19119477p0333k35200k48313l18587m02689l43740l09408m13537l91423l02732
1772.2I16083515l79682l97146l23295l59714m27246m43995m63248m74214n06520m96507
1792.6I11811948m90666m49121l18646k83957l83913l95179k85566j67787j16825j54734
1813I08765554j58011j26482j54078k24471k10166j92344k72870l10004l31461k90394
1833.4I06495273j27196n5194k64883m62771l61025j91331j78516j94669k25245l05355
1853.8I04129088l94583l52979k18093j71423k39253l15487k23518j52707k38597k83599
1874.2I01538849k89381k29478k19106k87295k40206k09034k55823j90258k16007m20809
$$ y = [924400866, 923883975, 923599303, 923309982, 922745943, 921955228, 920951486, 919840097, 919179380, 919119477, 919049144, 918813944, 918565631, 918247044, 917844355, 917500615, 917191207, 916777670, 916386247, 916083515, 915703833, 915306687, 914983392, 914623678, 914196432, 913752437, 913289189, 912814975, 912308455, 911811948, 911321282, 910872161, 910553515, 910269558, 909885645, 909490466, 909204900, 909037113, 908920288, 908765554, 908607543, 908481061, 908326983, 908102512, 907892346, 907700002, 907427132, 907117128, 906785667, 906495273, 906368077, 906312883, 906048000, 905585229, 905224204, 905032873, 904854357, 904659688, 904434443, 904129088, 903734505, 903381526, 903163433, 902992010, 902752757, 902437270, 902213752, 902061045, 901822448, 901538849, 901249468, 901019990, 900800884, 900513589, 900273383, 900064349, 899808526, 899618268, 899402261, 898981452]
1894.6H98981452m55916k77698j29402m9770L7730J28687J78158J40846n2810l08931
1915H98192346l03030q3387n0366j58429j74880q6307p5698k25127l53277k27570j9193
1937.4H96435082K5570J60218K96294J57774M8637p152j35005j54257m5836R418o7651
1959.9H96723092j85192k33710j74403k4796J10507J86027J51455k2292k05875k64823
1980.3H96059990j56999n4478j9372j0192j06037j52588p0214j1385m3749r7633j21116
2002.7H95216227j72139r8347M7683J6630j06275j71840j14679l7492l3438p3850j15395
2025.1H94357085j03891j18017j32203k4497J38521R6321j93000k92718o8486L8922
2045.5H93698037k3127P1943J97708O5327j45733j36495o3717j1742J08242P5340j05202
$$ y = [898981452, 898525536, 898247838, 898118436, 898068666, 898106396, 898235083, 898413241, 898554087, 898501277, 898192346, 897889316, 897805929, 897755563, 897597134, 897422254, 897335947, 897260249, 897035122, 896681845, 896454275, 896435082, 896460652, 896620870, 896917164, 897074938, 897123575, 897116423, 896981418, 896827161, 896781325, 896790743, 896723092, 896537900, 896304190, 896129787, 896104991, 896215498, 896401525, 896552980, 896530688, 896324813, 896059990, 895902991, 895848513, 895829141, 895818949, 895712912, 895560324, 895490110, 895478725, 895434976, 895337343, 895216227, 895044088, 894945741, 894993424, 895010054, 894903779, 894731939, 894617260, 894579768, 894546330, 894472480, 894357085, 894253194, 894135177, 894002974, 893978477, 894116998, 894213319, 894020319, 893727601, 893659115, 893698037, 893674910, 893746853, 893944561, 894009888, 893864155, 893727660, 893663943, 893652201, 893760443, 893835783, 893730581]
2067.9H93730581k06471j32441N9664R3818m888K1577Q2374O2883n96r9600j63555
2090.4H93443346j74463j60396n5611J29938K02835R3162j6332O4016J42812k1815
2110.8H93647492k19286k13265k7537O4194k9564p8023j1980K1994l4213Q34J03593
2133.2H93224239Q5891l159o8307p4566L4631R5665J0848l3975n3286m4584p153o5863
2157.7H93100381n1081L3080n8055r2864P0095J40608K2709j29819j55866q5592m4883
2180.1H92748713j1801M0173j907o9082n9902J2457J42097R4772q4222q4638K4497
2202.5H92751157P0691O9023J3470q8095r4772j7464J9789N4955J45197J14203o0320
2225H92977834j00851m6492J3411J58668J99556M4048j02341j30117n6625N1499J21295
$$ y = [893730581, 893524110, 893391669, 893451333, 893545151, 893540263, 893561840, 893644214, 893707097, 893706501, 893606901, 893443346, 893268883, 893108487, 893052876, 893182814, 893385649, 893478811, 893462479, 893526495, 893669307, 893647492, 893428206, 893214941, 893187404, 893251598, 893222034, 893144011, 893132031, 893154025, 893119812, 893120646, 893224239, 893310130, 893306971, 893238664, 893164098, 893198729, 893294394, 893305242, 893271267, 893217981, 893173397, 893166244, 893100381, 893049300, 893082380, 893024325, 892931461, 893001556, 893142164, 893164873, 893035054, 892879188, 892793596, 892748713, 892736912, 892777085, 892775178, 892706096, 892646194, 892658651, 892800748, 892895520, 892811298, 892726660, 892751157, 892821848, 892890871, 892904341, 892816246, 892721474, 892704010, 892723799, 892778754, 892923951, 893038154, 892977834, 892876983, 892830491, 892843902, 893002570, 893202126, 893246174, 893143833, 893013716, 892957091, 893008590, 893129885]
2247.4H93129885J38343M6670j30832j21474Q0466J39654M0590m7743r6619n9426J2100
2269.8H93131614J3172K8491L2366j17898k13683n0485J36673Q4341r5606j50859q3268
2292.3H92714858k682Q1956K08676K77341J70528K0028p5639p1048J2040N6147J28389
2314.7H93520594J65105J2636k9624J26839J07884Q7023J56879R4414Q5116R0599o7771
2337.1H94349694j23739K861J27375K1577l91364l96788J54972N50926K71201o795
2357.5H94559920L51608N68628n126m29153k12253j50740k74181k26379j71005j60516
2377.9H93850803q1598J17540J69337j2040j00434o4373o0320m8459N2512R2268J788
2400.4H93917024k086J9670J0669R5308O7234j10507j47283m2201N8532J14382J03592
$$ y = [893129885, 893268228, 893314898, 893184066, 893062592, 893143058, 893282712, 893323302, 893275559, 893178940, 893119514, 893131614, 893144786, 893173277, 893205643, 893087745, 892874062, 892823577, 892960250, 893044591, 892948985, 892798126, 892714858, 892712176, 892794132, 893002808, 893280149, 893450677, 893470705, 893395066, 893324018, 893336058, 893392205, 893520594, 893685699, 893698335, 893668711, 893795550, 893903434, 893990457, 894147336, 894241750, 894326866, 894417465, 894349694, 894225955, 894228816, 894356191, 894377768, 893986404, 893589616, 893744588, 894295514, 894566715, 894559920, 894911528, 895480156, 895475030, 895045877, 894833624, 894682884, 894408703, 894182324, 894011319, 893850803, 893769205, 893886745, 894056082, 894044042, 893943608, 893879235, 893818915, 893770456, 893822968, 893915236, 893917024, 893914938, 893934608, 893945277, 894040585, 894107819, 893997312, 893850029, 893807828, 893866360, 893980742, 894084334]
2422.8H94084334M0830k2889M709Q0705K0504n9962J1563J40607J88530L7849j10090
2445.2H94416690K2888J81377Q5473j04368j33335N9M6671p3493p2002J10924J34230
2467.7H94615114R53m8339q1837j18673k6345J24812J56760J15097Q9287k5868j65760
2490.1H94635201j07110L457Q523J00554J61111L0815p6174q6725L338P5042l219l1411
2514.6H94713402K5213M5836L9815j2517l7014K9504Q7738N0843p6115r6262J1802
2537H94782245K2173k4378J1503Q2672Q0526j4424j07467p1466J23024J89244L755
2559.4H95077407k8908R8705N1797m9412J549R9480N9486l934K2173l6001j18673k5988
2583.9H95147681P2241k3305q6844M1186J54257J21236p510n2929K5511R1851Q6128
$$ y = [894084334, 894125164, 894102275, 894106984, 894187689, 894208193, 894148231, 894159794, 894300401, 894488931, 894526780, 894416690, 894439578, 894620955, 894706428, 894602060, 894468725, 894468784, 894515455, 894441962, 894369960, 894480884, 894615114, 894616067, 894567728, 894485891, 894367218, 894340873, 894465685, 894622445, 894737542, 894826829, 894800961, 894635201, 894528091, 894531548, 894540071, 894640625, 894801736, 894832551, 894756377, 894669652, 894672990, 894748032, 894744813, 894713402, 894738615, 894784451, 894824266, 894811749, 894774735, 894804239, 894891977, 894942820, 894866705, 894770443, 894782245, 894804418, 894780040, 894791543, 894874215, 894954741, 894940317, 894832850, 894761384, 894884408, 895073652, 895077407, 895048499, 895147204, 895199001, 895149589, 895151138, 895250618, 895310104, 895306170, 895328343, 895292342, 895173669, 895147681, 895219922, 895196617, 895109773, 895150959, 895305216, 895426452, 895418942, 895366013, 895391524, 895483375, 895569503]
2606.3H95569503j7404j06275j63794k01225L457K27868J57536Q1360N3584p9274o6995
2628.8H95458341Q6426P2718m1962p7486q0347j8656J34945J05560r7513m3214J69397
2651.2H95668209J74820O2466l7074p1943l8684J7465R6142O1393n5790p8082o2585
2673.6H95736337m7505n7876j47879q2016J41263J73986R9480N2869j0490j9849l7312
2696.1H95801008n5015K4795J24634Q3506m5896n1916q642j06335k03133j23143j51932
2718.5H95287931l81231m20511j80185Q5056K52604L73066L01599K5332j30474n2035
2738.9H95161152K4915p3433p0811Q7381O2108k2113j0551o1213j21654p5161k2769
2761.3H94877851o8605r2924k5510J24216K30252Q5891k1696M5478j07527l36349k49326
$$ y = [895569503, 895552099, 895445824, 895282030, 895080805, 895084262, 895312130, 895469666, 895551026, 895604610, 895525336, 895458341, 895544767, 895617485, 895575523, 895498037, 895417690, 895399034, 895533979, 895639539, 895542026, 895498812, 895668209, 895843029, 895905495, 895868421, 895796478, 895757794, 895775259, 895871401, 895932794, 895877004, 895798922, 895736337, 895688832, 895630956, 895483077, 895401061, 895542324, 895716310, 895815790, 895868659, 895858169, 895838320, 895801008, 895745993, 895770788, 895895422, 895978928, 895933032, 895881116, 895872474, 895766139, 895563006, 895439863, 895287931, 894906700, 894486189, 894306004, 894391060, 894643664, 895016730, 895318329, 895343661, 895213187, 895161152, 895186067, 895112634, 895041823, 895129204, 895191312, 895169199, 895158648, 895097435, 894975781, 894900620, 894877851, 894809246, 894716322, 894690812, 894815028, 895045280, 895131171, 895109475, 895154953, 895047426, 894711077, 894461751]
2783.7H94461751r7752r5784o8069q166n1379j32441j33038j42455j81794k01404k68042
2806.2H93081427l04819j96993r2268j10626j64211k52068l73602l79741k38955k68221
2826.6H90699923o08742r25660j095713j230478j290917j163304o64651M32252K091051
2844.9H86243761K969801J061142k353251l483773k013743m31776K90931O06298N95629
2863.3H83485019L23832R4831k3782J4722K29121L50356K21550K5273p1943j18256
2883.7H84530723j77741k08616k09272k59578m86613o68406n82397o03616p85828p81715
2904.1H79766941m78804L11911J860142L859520M797637L055394n19157l150701l607333
2922.4H85895550k685427j454354n81979j45138J49608M82559P74682P66873M60088
$$ y = [894461751, 894363999, 894268215, 894200146, 894191980, 894140601, 894008160, 893875122, 893732667, 893550873, 893349469, 893081427, 892776608, 892579615, 892487347, 892376721, 892212510, 891960442, 891586840, 891207099, 890968144, 890699923, 890091181, 889165521, 888069808, 886839330, 885548413, 884385109, 883720458, 884152710, 886243761, 889213562, 890274704, 887921453, 884437680, 882423937, 881992161, 882283092, 882889390, 883485019, 883808851, 883903682, 883879900, 883894622, 884123743, 884474099, 884695649, 884720922, 884648979, 884530723, 884352982, 884144366, 883935094, 883675516, 883188903, 882520497, 881938100, 881334484, 880548656, 879766941, 879288137, 879600048, 881460190, 885319710, 890117347, 893172741, 892653584, 889502883, 885895550, 883210123, 881755769, 881173790, 881028652, 881178260, 881660819, 882435501, 883202374, 883662462]
2940.8H83662462M5240k83658l84450l97742m55678n85258p76708q67367o14225J43766
2961.2H79486382J128972J831531K257526K421558K107382J592934J220524R91047
2977.5H93037856O62922L01302K75016L76522L69430L42309L19481K64406J73510J47700
2997.9H96270454J90914J33156k8491l2723P9453j7702k09332j18434J45972J65224
3018.3H96578491p6294k36631k71022l23057k64824j20878j21414j44423j04486j19567
3038.7H94795895q4281J62780M94957N42283L56972J73629j0312J073J22130J62959
3059.1H96718085K38478L38852K86520N4479J2576J60158J14798m9829j03235l3796
3079.4H97737086N7816L9876l3200J5438M4942j40489k38180J2279L05593L63469K26378
$$ y = [883662462, 883707702, 883424044, 883039594, 882641852, 882186174, 881600916, 880824208, 879956841, 879342616, 879486382, 880615354, 882446885, 884704411, 887125969, 889233351, 890826285, 892046809, 893037856, 893700778, 894002080, 894277096, 894653618, 895023048, 895365357, 895684838, 895949244, 896122754, 896270454, 896461368, 896594524, 896566033, 896533310, 896612763, 896595061, 896385729, 896267295, 896413267, 896578491, 896502197, 896265566, 895994544, 895671487, 895406663, 895285785, 895164371, 895019948, 894915462, 894795895, 894711614, 894874394, 895369351, 895911634, 896268606, 896442235, 896431923, 896432996, 896555126, 896718085, 896956563, 897295415, 897581935, 897636414, 897648990, 897809148, 897923946, 897874117, 897770882, 897737086, 897794902, 897834778, 897801578, 897817016, 897861958, 897721469, 897483289, 897495568, 897801161, 898164630, 898391008]
3101.9H98391008K683k06173j91748K3127n0307l27408l49581j80722k7775o8486j68383
3124.3H96846235j41323j31547j03236q3506j85132k30193j68919r8050P7486J57952
3144.7H95939767r0599k16245r0361j5318q226J19806N33401O17922J06513j90437
3165.1H96706223j29222r2924j11938j50322k05994j93060j49965k79486l19958q5532
3185.5H94987822n2572k59876l11732k00510j05024j50501l28839m18306k99990j31905
3205.9H92728567m9531j29938k05040k40803n12898n43654j46270n305j60277k52604
3226.3H90482247l05653m40240m90605l55304j81317j18196k49326m48644n72622n80490
3246.7H86739850l72827o8426m0949k65598l74615k42591j17004j43826k29776k97308
$$ y = [898391008, 898393691, 898187518, 897995770, 898018897, 897968590, 897641182, 897291601, 897110879, 897083104, 897014618, 896846235, 896704912, 896573365, 896470129, 896386623, 896201491, 895971298, 895802379, 895704329, 895781815, 895939767, 895849168, 895632923, 895542562, 895527244, 895519018, 895638824, 896172225, 896790147, 896896660, 896706223, 896577001, 896484077, 896372139, 896221817, 896015823, 895822763, 895672798, 895393312, 895073354, 894987822, 894935250, 894675374, 894363642, 894163132, 894058108, 893907607, 893578768, 893160462, 892860472, 892728567, 892679036, 892549098, 892344058, 892103255, 891590357, 891046703, 890900433, 890895128, 890734851, 890482247, 890176594, 889736354, 889245749, 888890445, 888709128, 888590932, 888341606, 887892962, 887320340, 886739850, 886367023, 886298597, 886257648, 885992050, 885617435, 885374844, 885257840, 885114014, 884884238, 884586930]
3267.1H84586930k43544k11060k59161l12209k85447j29044K3722K26200K91586K08855
3287.5H83896828L84450O83427P45594M64022n5253l66032k63095k21014m06742m55261
3307.8H84406924l50117j80126K51592P31766Q55028R23098J216888J398206J458823
3326.2H90712082J708925K013087K054692J688242J257538J279295J450121J214445
3342.5I03378427J035571J186788R97007O01113N46873P65562Q64684O42896M59433
3360.9I10478354M80890M76837K90453J84894L06070L18229J42038L5405J79172L40163
3381.3I13232505L54290L04699J38581K7418K1458m6194m0531O7771J39713R2387q1777
3403.7I14210320j09137K0981N0307J40547J50442j01983j19209J10328K10881K15650
$$ y = [884586930, 884343386, 884132326, 883873165, 883560956, 883275509, 883146465, 883170187, 883396387, 883687973, 883896828, 884281278, 884964705, 885710299, 886174321, 886119068, 885753036, 885489941, 885268927, 884862185, 884406924, 884056807, 883876681, 884128273, 884860039, 885715067, 886638165, 887855053, 889253259, 890712082, 892421007, 894434094, 896488786, 898177028, 899434566, 900713861, 902163982, 903378427, 904413998, 905600786, 906597793, 907198906, 907745779, 908511341, 909376025, 910018921, 910478354, 910959244, 911436081, 911726534, 911911428, 912217498, 912535727, 912677765, 912713170, 912892342, 913232505, 913586795, 913891494, 914030075, 914057493, 914078951, 914032757, 913992226, 914059997, 914199710, 914292097, 914210320, 914101183, 914122164, 914172471, 914313018, 914463460, 914361477, 914242268, 914352596, 914563477, 914779127]
3424.1I14779127K08020J93894J51694R0777M2141k742q1122K0206L81351M42028q047
3446.5I16217327m21286k65896J87636K96115J48237J31488J74344J16765k2173j27494
3466.9I16435063p3731M6551J13249J51038R6739k7121p3731J0491R0003P868p0393
3489.3I16706026N0842J43588J41501J77861L2782j13547J3471r716p3432J96635L92020
3511.8I17658031L02970K45631K44200O0082o9738N6744P3373M4167J07885O2644k861
3534.2I18783128N842k5034p332K00272L78787K35737k2412O9738J39236j60455k05100
3556.6I19392407J66237M58122L10242M7803J54257K13325J6510l5286J15097K54035
3577I21092749L5822k94387k12908K03431M87566J79350j83463j31190Q2791K16305
$$ y = [914779127, 914987147, 915181041, 915332735, 915423512, 915465653, 915462911, 915381789, 915401995, 915783346, 916225374, 916217327, 915796041, 915530145, 915717781, 916013896, 916162133, 916293621, 916467965, 916584730, 916562557, 916435063, 916361332, 916407883, 916521132, 916672170, 916768909, 916741788, 916668057, 916678548, 916768551, 916776419, 916706026, 916756868, 916900456, 917041957, 917219818, 917252600, 917139053, 917152524, 917142808, 917069376, 917266011, 917658031, 917961001, 918206632, 918450832, 918510914, 918441176, 918497920, 918571293, 918615460, 918723345, 918785989, 918783128, 918788970, 918763936, 918756604, 918956876, 919335663, 919571400, 919548988, 919618726, 919757962, 919597507, 919392407, 919558644, 920016766, 920327008, 920374811, 920529068, 920742393, 920758903, 920723617, 920838714, 921092749, 921128571, 920834184, 920621276, 920824707, 921312273, 921491623, 921308160, 921176970, 921259761, 921476066]
3597.4I21476066K09093K1696k92480k79605J64270L83854L43561L66271J32382K5809
3617.8I22550917L5762l68595n29527O377P92683M90665k36928j88053k4200N6446
3638.2I22585547J36852J50860J21057L51190P16925J67429n94675k04623N36859L83258
3658.6I24350679j97411l09407n0426J45316K48373P0274P7068M80235k7954m24624
3679I24362123j30653j49906r5308K92778L39806j07527k80916k5869K03014K15709
3699.4I24623251J53840q7142k59221k40624j2398L37899J21474j78694j07170n0902
3719.8I24300313j48118m9114J42813j80602n97894k44975N84840O15180j73748o98506
3740.2I23550189j22071J095832N70654l26395P2003L24309j49787m22060k32518j22666
$$ y = [921476066, 921685159, 921706855, 921414375, 921134770, 921299040, 921682894, 922026455, 922392726, 922525108, 922550917, 922586679, 922218084, 921688557, 921694934, 922487617, 922978282, 922741354, 922553301, 922529101, 922585547, 922722399, 922873259, 922994316, 923345506, 924062431, 924229860, 923635185, 923430562, 923967421, 924350679, 924153268, 923843861, 923793435, 923938751, 924187124, 924257398, 924334466, 924814701, 924786747, 924362123, 924231470, 924081564, 923986256, 924279034, 924618840, 924511313, 924230397, 924204528, 924407542, 924623251, 924777091, 924689949, 924430728, 924190104, 924177706, 924515605, 924637079, 924458385, 924351215, 924300313, 924152195, 924103081, 924245894, 924065292, 923467398, 923222423, 923807263, 924422443, 924248695, 923550189, 923428118, 924523950, 925094604, 924768209, 924840212, 925164521, 925014734, 924592674, 924360156, 924237490]
3760.6I24237490j01447J51813L37660L48806R3997j31965o8486O7413J86563L695
3781I25125539j66058N9128J91867n0306l51489m35531k62857o8068K69592N65827
3801.4I24877644N7280o9976L38614J26302k23577O5267M05192j02520j29818J82628
3821.8I25527036p3135j62184k74718k23160n4955j52767K8193L70682K44319J10149
3842.1I25339460k8908l77059n72562l47853N28097Q12352L8862j29640k9623K28047
3862.5I25461173J37508l05355j37329J47522L1709j10685r6381J15096J16826L3438
3882.9I25393522J66118p5340j88828K25008L24905O1929l9876l9518Q405Q4161o2286
3905.4I25858200k37167p8082J40905J63853J03533J5915N7280J77324J0431k78593
$$ y = [924237490, 924136043, 924287856, 924625516, 924974322, 925068319, 924936354, 924867868, 924935281, 925121844, 925125539, 924959481, 925018609, 925210476, 925160170, 924808681, 924373150, 924110293, 924042225, 924311817, 924877644, 924934924, 924864948, 925203562, 925329864, 925106287, 925171554, 925576746, 925474226, 925344408, 925527036, 925453901, 925291717, 925016999, 924793839, 924738884, 924586117, 924614310, 924984992, 925229311, 925339460, 925310552, 924933493, 924360931, 924013078, 924541175, 925353527, 925392389, 925262749, 925233126, 925461173, 925598681, 925293326, 925155997, 925303519, 925335228, 925224543, 925128162, 925243258, 925360084, 925393522, 925559640, 925484300, 925295472, 925520480, 925845385, 925907314, 925867438, 925827920, 925836325, 925920486, 925858200, 925621033, 925542951, 925683856, 925847709, 925951242, 925967157, 926024437, 926201761, 926212192, 925933599]
3925.8I25933599j63257K34783K78890l4034q0764J1026n6743j18613j69754j47045
3946.2I25688088J22607J65820j76668j13190L64483N31971J10627l72053k39610L1352
3966.5I26113427n8770p8381K20299M28081J23679k19643m8995L19898L10898l3557
3986.9I27076936k06292l13997l61085o1333J25289
3997.1I26259518
$$ y = [925933599, 925770342, 926005125, 926284015, 926249981, 926169217, 926180243, 926123500, 926004887, 925835133, 925688088, 925810695, 925976515, 925799847, 925686657, 926051140, 926583111, 926693738, 926321685, 926082075, 926113427, 926054657, 925976276, 926196575, 926624656, 926748335, 926528692, 926479697, 926799595, 927110493, 927076936, 926870644, 926556647, 926195562, 926134229, 926259518]
##END=$$ End of the data block
