##TITLE=DI_15-0719127-0 Molho - PE $$ Begin of the data block
##JCAMP-DX=5.00 $$ ACD/SpecManager v 10.08
##SPECTROMETER/DATA SYSTEM=Alpha
##DATE=09 Jun 2015 10:33:54
##DATA TYPE=INFRARED SPECTRUM
##DATA CLASS=XYDATA
##ORIGIN=
##OWNER=
##NPOINTS=1667
##FIRSTX=599.64648438
##LASTX=3997.64306641
##MAXX=3997.64306641
##MINX=599.64648438
##MAXY=0.77823144
##MINY=0.00927567
##XFACTOR=1.0000000000
##YFACTOR=1.000000000000000e-9
##FIRSTY=0.77817822
##DELTAX=2.03961372
##XUNITS=1/CM
##YUNITS=ARBITRARY UNITS
##XYDATA=(X++(Y..Y))
599.6G78178215k630234k30729K271950O42240k389491k648115m57346J567006P99417
618G75102913j582682k193331o22154Q26538J044810o15955k234995p65979P44044
636.4G69703209K98858n05268j209915j043677M19795J121819o55770j672626n43356
654.7G65913069L48568K36690j626312k162099R31501K837658j375198l813327n44607
673.1G60745943J14977k261758j801252k94388j325130k268195j896441j801789k223432
691.4G46988535l369927m436315m699587o338478q825898j0918498j3754666j7915070
707.7F76730096k4713218l6077082n7004213q9794517r9605828l8783133M5621991
722C76374096O1641395J3720989l3227146j0214984P1179300J05112493O8646253K9837548
$$ plain form
599.6 778178215 775547981 775317252 777589202 778231442 775841951 773193836 772736490 774303496 775102913
618 775102913 773520231 771326900 770704746 771531284 772576094 771960139 769725144 768959165 769703209
636.4 769703209 770002067 769496799 768286884 767243207 767663002 768784821 768129051 766456425 765913069
654.7 765913069 766261637 766498327 764872015 762709916 763641417 766479075 765103877 761290550 760745943
673.1 760745943 760860920 758599162 756797910 756503522 755178392 752910197 751013756 749211967 746988535
691.4 746988535 743618608 739182293 734482706 728144228 719318330 708399832 694645166 676730096
707.7 676730096 652016878 615939796 558935583 469141066 369535238 330752105 376374096
722 376374096 438015491 451736480 418509334 408294350 479473650 584586143 653232396 683069944
738.3F83069944J3661564P809579N611897M898846M104435L337801K833128K091169
754.7G27418363J655161J534105R60350K46048J87695L81708N71191R04322J018763
773G34877706Q56816O54400N32925N01335M71770L26574J27018P6055J33693Q703j38581
795.4G38428414j6570J55985J16825j66714l99828l00467j28448k43664m09364j43648
815.8G36892521K46585L33071L19778L24905L82543L29494J94669K62320K39492j9193
836.2G39506185j93000j08957n3048k33948l31939k81572k52485j96874k19346k27868
856.6G37407148L0815J95742Q2076L3796J12533Q7679m1187j02878k26498l88205m65035
879.1G36725986o78897r35316j068950j013159l87490M79936P86186O21736L48746
$$ plain form
738.3 683069944 696731508 704541087 710152984 715051830 719156265 722494066 725327194 727418363
754.7 727418363 729073524 730607629 731567979 731814027 732001722 732383430 732954621 733858943 734877706
773 734877706 735734522 736388922 736921847 737423182 737894952 738221526 738348544 738424599 738558292 738566995 738428414
795.4 738428414 738411844 738567829 738684654 738517940 738118112 737817645 737689197 737445533 737036169 736892521
815.8 736892521 737139106 737472177 737791955 738116860 738499403 738828897 739023566 739285886 739525378 739506185
836.2 739506185 739313185 739204228 739151180 738917232 738585293 738303721 738051236 737854362 737635016 737407148
856.6 737407148 737437963 737633705 737715781 737749577 737862110 737949789 737908602 737805724 737579226 737191021 736725986
879.1 736725986 736047089 735111773 734042823 733029664 732642174 733122110 733908296 734530032 734878778
897.4G34878778m947m67360j193523j926780j667559j81735J224161J378476P17581
915.8G32757092K55644J16289L278j60039k67923l43859l27110k35438k87593k08199
936.2G31302142j23381j75179j47700k07841k46227k48790k93910l23177l14116l36528
956.6G28885293n22554n93245n58555m74870j27912J18077J38521J51575O974j31965
977G26891339j87397l90887n96405q33392j012325r13143q35002p16090m54545l66986
997.4G20585167m42624m94480m51743m66586o79016r38356j096189j335203j498282
1015.7G13182688j028955k79129M4704k20657o65128r58025j250744j426101j534343
1034.1G05864310j659333j662851j510203j163721r70602j179933j481057j327335
$$ plain form
897.4 734878778 734873831 734406471 733212948 731286168 729618609 729436874 730661035 732039511 732757092
915.8 732757092 733012736 733129025 733132303 732972264 732704341 732360482 732033372 731797934 731510341 731302142
936.2 731302142 731178761 731003582 730855882 730648041 730401814 730153024 729859114 729535937 729221821 728885293
956.6 728885293 728362739 727769494 727210939 726736069 726608157 726726234 726864755 727016330 727023304 726891339
977 726891339 726703942 726313055 725716650 724883258 723870933 722957790 722122788 721406698 720952153 720585167
997.4 720585167 720142543 719648063 719196320 718729734 718050718 717112362 716016173 714680970 713182688
1015.7 713182688 712153733 711874604 711919308 711698651 711033523 710075498 708824754 707398653 705864310
1034.1 705864310 704204977 702542126 701031923 699868202 698897600 697717667 696236610 694909275
1050.4F94909275p40886o50287j332342k029717k336681k271712j820982j333058j206159
1068.8F81187451j288414j338303j108468m60326L21626R64880J414120J746834J928508
1087.1F83367908J890182J761556J596868J353264J043975O81222L57330J08719j38402
1105.5F92022622l41297n22136o18875o21617o67811o53863n31554m30882m42743m91500
1125.9F86700344n23448m66823k79487j29759l7014J6033O5386K28704M69625O16669
1146.3F86660230O35088O05821N58555M72308L41177K22385O2882j22428k79068m18187
1166.7F88738763m46319l89278n98431j119613j146436l91007K36273K21551m948q2016
1187.1F85018539j30832l78847p34806j003206j185059j260102j197934j025141q28206
$$ plain form
1050.4 694909275 694168389 693518102 692185760 690156043 687819362 685547650 683726668 682393610 681187451
1068.8 681187451 679899037 678560734 677452266 676991940 677313566 678278446 679692566 681439400 683367908
1087.1 683367908 685258090 687019646 688616514 689969778 691013753 691694975 692052305 692161024 692022622
1105.5 692022622 691681325 691159189 690540314 689918697 689250886 688597023 688065469 687634587 687191844 686700344
1125.9 686700344 686176896 685710073 685430586 685300827 685263813 685279846 685345232 685573936 686043561 686660230
1146.3 686660230 687295318 687901139 688459694 688932002 689273179 689495564 689558446 689436018 689156950 688738763
1166.7 688738763 688292444 687903166 687304735 686185122 685038686 684647679 684883952 685105503 685100555 685018539
1187.1 685018539 684887707 684508860 683774054 682770848 681585789 680325687 679127753 678102612 677274406
1205.4F77274406p54297r40561j297355j604199j709104j554012j200974p24018l25918
1223.8F67163968p7367J59085L56376L97802L78906M09425M12702L57211K59638J79588
1244.2F69997334M2260j94371m42862o62029p82549q68678r32753r76086j027048j074850
1264.6F63078368j163245j220822j251161j206458j137673j111865j065076j185834
1280.9F53736234j351774j525879j713872j861393k109528k352595k591074k411246
1297.2F37818873j756191r29237j24097L98219J351893K609134L536701M108012M199445
1315.6F51212752M379332M659414M489959L867864K957702J919806O13153q71539k424360
1333.9F70804083m054248n291879n312920m331887m073381m834771n484700m787863
$$ plain form
1205.4 677274406 676520109 675579548 674282193 672677994 670968890 669414878 668213904 667489886 667163968
1223.8 667163968 667086601 667245686 667602062 667999864 668378770 668788195 669200897 669558108 669817746 669997334
1244.2 669997334 670039594 669845223 669402361 668740332 667957783 667089105 666156352 665180266 664153218 663078368
1264.6 663078368 661915123 660694301 659443140 658236682 657099009 655987144 654922068 653736234
1280.9 653736234 652384460 650858581 649144709 647283316 645173788 642821193 640230119 637818873
1297.2 637818873 636062682 635133445 635009348 635407567 636759460 639368594 642905295 647013307 651212752
1315.6 651212752 655592084 660251498 664741457 668609321 671567023 673486829 674099982 673228443 670804083
1333.9 670804083 666749835 661457956 656145036 651813149 647739768 642904997 637420297 632632434
1350.2F32632434k352178K8551O52015p12216l720522p164418q922518p937371l916204
1368.6E98587573J569986L199339l36051j50561J0108768K0821274K1031201J4017880
1384.9F68849409P707536M157126K331614J082242K92241R716l39747p09831j287520
1403.3F82092786k222002k790808l092170l150106k314508j171231r92060k042174
1419.6F64317727l616273o577254j1018693j5581966k0202934k1882594j9970715j9316733
1435.9E46150565j7749667j3096273j0935307j0857522j2221158j6829341k4358630
1450.2D40102667l2808215l8348228m5238167n9531092o6461638m9438581q671149
1464.5A39605597K1698326J8160700K006591J7281934R6043647J42797440J07262015
$$ plain form
1350.2 632632434 630280256 630308807 630960822 630248606 626528084 619363666 610441148 602503777 598587573
1368.6 598587573 600157559 603356898 603020847 602870286 612979054 633800328 654831529 668849409
1384.9 668849409 676556945 680714071 683045685 684127927 684420168 684429884 684090137 683380306 682092786
1403.3 682092786 679870784 677079976 673987806 670837700 668523192 667351961 666359901 664317727
1419.6 664317727 660701454 654124200 643105507 627523541 607320607 585438013 565467298 546150565
1435.9 546150565 528400898 515304625 504369318 493511796 481290638 464461297 440102667
1450.2 440102667 407294452 368946224 323708057 264176965 197715327 148276746 139605597
1464.5 139605597 161303923 179464623 181471214 198753148 294796795 437594235 544856250
1478.7E44856250N4956913K7039707J4922202R141326O408333N127550M223287L006518
1495.1F69682086J868247J411796J305759O78599j070559k566397o38545J111806J342177
1513.4F73124969J090705P13408Q8931q05021o31273k00390k80798j03056k72274n02289
1533.8F72222912L32594N98371o0677J004994K667248L180742L101111K972066K920687
1552.2F88940048K731025K177418J529336K210021K978682K385795J448691O66559
1568.5G05067575K68340L26455l81530j451611q09670p9214l73066r09805j515150
1586.8G00142324k097547k387405k306461j941979j221657k07543P85947J546323J927316
1605.2F94239318J865805J525461J239538J049698O42657N78046J301348J392126R61900
$$ plain form
1478.7 544856250 599813163 626852870 641775072 650916398 657324731 662452281 666675568 669682086
1495.1 669682086 671550333 672962129 674267888 674946487 673875928 671309531 670670986 671782792 673124969
1513.4 673124969 674215674 674929082 675018013 674212992 673581719 673381329 673100531 672997475 672725201 672222912
1533.8 672222912 672555506 673153877 673093200 674098194 676765442 679946184 683047295 686019361 688940048
1552.2 688940048 691671073 693848491 695377827 697587848 700566530 702952325 704401016 705067575
1568.5 705067575 705335915 705662370 705280840 703829229 703019559 702940345 702567279 701657474 700142324
1586.8 700142324 698044777 695657372 693350911 691408932 690187275 689979732 690765679 692312002 694239318
1605.2 694239318 696105123 697630584 698870122 699919820 700562477 701140523 702441871 703833997 704795897
1623.5G04795897R76086R70304P67350O18815q1181j077712n25117L79682M35412K62975
1643.9G07522511j48832J51097Q02041k92361j015306Q66115J153469J14084o30558
1662.3G08522260m48704q9228o78003j035928m23611n46634q05199l92556m87149j514554
1682.7G02100694k370179j043379k03192o66201j013696k022684k600193k432108k619862
1701.1F87129200j427293j153529j756370j487792j393199j670777k166391k693474
1717.4F73380375j666606j89781O8486P7128J61589L1828k83837j200616p01010O96659
1737.8F70374215Q34167J280784K249837K857387L347874L999770M746794M948855
1754.1F94639683M456818L732025K973140K317130J987696J617491J025677N66065
$$ plain form
1623.5 704795897 705771983 706742287 707509637 708128452 708047271 706969559 706444442 706824124 707259536 707522511
1643.9 707522511 707373679 707524776 708326817 708034456 707019150 707885265 709038734 709152818 708522260
1662.3 708522260 708073556 707984328 707306325 706270397 705846786 705300152 704494953 704102397 703615248 702100694
1682.7 702100694 699730515 698687136 698483944 697817743 696804047 694781363 692181170 689749062 687129200
1701.1 687129200 685701907 684548378 682792008 681304216 679911017 678240240 676073849 673380375
1717.4 673380375 671713769 671523988 671592474 671669602 671831191 671863019 671579182 670378566 669677556 670374215
1737.8 670374215 671208382 672489166 674739003 677596390 680944264 684944034 689690828 694639683
1754.1 694639683 699096501 702828526 705801666 708118796 710106492 711723983 712749660 713315725
1770.4G13315725L83556P76053J067280P23899L86655L54588L17753L22818L45350
1788.8G17993677n0843l21388J86205M60684J72853K981J19566J67788M6074j27554
1809.2G18650043k00331q1659M232j1563J01030K76029L02911L49521M46201K99513
1829.6G20135927L02434M66764K86698Q1718J25587L2187l27826j99318K49207K65003
1850G21418381J13249j4067r1255r8586p9870q7083j31487k74122m90308l06845R2864
1872.4G20050871P2182j58072k71499l44753m86195o96898r35376j294076j472831
1890.7G14463353j190066p87318k84135K79605O22273P47203P51555O03378M53592
1909.1G15659440M55915M58479L30449J32083J53661K99692K54929K18928K30372J73927
$$ plain form
1770.4 713315725 713699281 714475334 715542614 716266513 716653168 717007756 717325509 717648327 717993677
1788.8 717993677 717942834 717621446 717807651 718268335 718441188 718444169 718563735 718731523 718777597 718650043
1809.2 718650043 718449712 718368053 718372285 718360722 718461752 718737781 719040692 719390213 719836414 720135927
1829.6 720135927 720438361 720905125 721191823 721273541 721399128 721431315 721103489 720904171 721153378 721418381
1850 721418381 721531630 721517563 721426308 721327722 721247852 721160769 721029282 720755160 720264852 719958007 720050871
1872.4 720050871 720123053 719964981 719693482 719348729 718862534 718165636 717230260 715936184 714463353
1890.7 714463353 713273287 712485969 712201834 712481439 713103712 713850915 714602470 715205848 715659440
1909.1 715659440 716115355 716573834 716904283 717036366 717190027 717489719 717744648 717963576 718193948 718367875
1929.5G18367875J28865R9420P0334O9439M6313p6592m7564J50144J48058K5451m0829
1951.9G18940914n0843k6763j1980J4245Q9050J64330J54793J58668K12431J67250
1972.3G19812095O8963K0504J5557K6345J8298J0014l4749j17839j84238k01106j66476
1994.8G19267368k12252l51190m89772o27458q10027j133382j608670k107143k443850
2013.1G09483624k311647j524389m47929M00662R04739J091182J040042R14514P79271
2031.5G10330069O70433O01292N59866N34475N01394M70043M58240M45843L85701L24071
2051.9G15281427K81930K61724K60532K05517J53362J66595J63615R5069Q6666J54495
2072.3G17110932J55091J15514Q6129P0750R6083R5069M7088L8505P8201O7771j6451
$$ plain form
1929.5 718367875 718496740 718596160 718666494 718735933 718782246 718705654 718658090 718808234 718956292 718981743 718940914
1951.9 718940914 718890071 718863308 718851328 718865573 718954623 719118953 719273746 719432414 719644845 719812095
1972.3 719812095 719881058 719901562 719917119 719943464 719961762 719971776 719937027 719819188 719634950 719433844 719267368
1994.8 719267368 719055116 718703926 718214154 717586696 716776669 715643287 714034617 711927474 709483624
2013.1 709483624 707171977 705647588 705199659 705600321 706505060 707596242 708636284 709550798 710330069
2031.5 710330069 711000502 711601794 712161660 712696135 713197529 713667572 714125812 714571655 714957356 715281427
2051.9 715281427 715563357 715825081 716085613 716291130 716444492 716611087 716774702 716869771 716956437 717110932
2072.3 717110932 717266023 717381537 717467666 717538416 717634499 717729568 717776656 717815161 717893362 717961133 717944682
2094.7G17944682p0453r4593j40369j67846j94311j94371j13547k1636L1650O7353
2115.1G17046559P8320L3200l5167j00135j77205k53499l23712l77417m22120m58598
2135.5G15010226m70817m44413l75986l17573k59459j63853k98K00152K90334K81155
2155.9G13749468K68460K67505K77341K41816J69515J32680Q6189J549m1365l5167
2176.3G15117991k4080n7996j20103n5075O2168L6418j9788P987K4736L874K146k265
2200.8G14976013j4305J4960J6213q5652j45555j22666j64807k24948k13444j47879
2221.2G13887930n7221K742J9372p570j27494l69370o44029q07702q56698p60555m82738
2243.6G09796667k66671k29359k37822k62916k77162k79367k96175k93732l16084m18424
$$ plain form
2094.7 717944682 717874229 717779636 717639267 717471421 717277110 717082739 716969192 716947556 716979206 717046559
2115.1 717046559 717124879 717158079 717122912 717022777 716845572 716592073 716268361 715890944 715468824 715010226
2135.5 715010226 714539409 714094996 713719010 713401437 713141978 712978125 712977827 713177979 713468313 713749468
2155.9 713749468 714017928 714285433 714562774 714804590 714974105 715106785 715192974 715194523 715153158 715117991
2176.3 715117991 715093911 715035915 714915812 714860737 714922905 714959323 714939535 714947522 714972258 714976132 714978278 714976013
2200.8 714976013 714961708 714976668 714992881 714907229 714761674 714639008 714474201 714249253 714035809 713887930
2221.2 713887930 713830709 713833451 713852823 713845253 713717759 713348389 712704360 711896658 711039960 710279405 709796667
2243.6 709796667 709529996 709300637 709062815 708799899 708522737 708243370 707947195 707653463 707337379 706918955
2264G06918955n54204o22332o36637o24359n07653k93255m4584J76847L00765K95639
2284.4G04409182K55525L15190L34262K11656J37866J08004L2425k2412l4451K5630
2304.8G05772877J50859J83106L3378j55866k37346j70469k8968p4088k97845k38120
2325.2G04937518O6161J68621J22547J68264L54946M71771L16560P7546m12166j052261
2345.6G05219507j31726J999080L399015L475606K846062K002716J091302M02450k27093
2363.9G20076919q62718j155257j246989j268387j226365j317263j283944j054167
2380.2G10661829q40128n58257k40803o8426m0770r1314p9810r776o4551j61469j51039
2402.7G08355486j33335k09034l24726l92616l67105k72870r0897J66118L60072M61400
$$ plain form
2264 706918955 706364751 705742419 705105782 704481423 703973770 703680515 703635931 703812778 704113543 704409182
2284.4 704409182 704664707 704979897 705314159 705525815 705663681 705771685 705804110 705781698 705747247 705772877
2304.8 705772877 705923736 706106842 706140220 705984354 705747008 705576539 705547571 705473483 705175638 704937518
2325.2 704937518 705003679 705172300 705294847 705463111 705818057 706289828 706606388 706683934 706271768 705219507
2345.6 705219507 705087781 707086861 710485876 713961482 716807544 718810260 719901562 720304012 720076919
2363.9 720076919 719214201 718058944 716811955 715543568 714317203 712999940 711715996 710661829
2380.2 710661829 709821701 709263444 709022641 708954215 708913445 708822131 708742321 708732545 708667994 708506525 708355486
2402.7 708355486 708222151 708013117 707688391 707295775 706928670 706655800 706564903 706731021 707091093 707552493
2423.1G07552493M77254M16517L42191K50339J79172J68442J70470J70767J08838J3530
2443.5G09850013K3246K8849m8638r3102j06633j10388j02698j59681k53499l17991
2463.9G08709478m47213p18475r72032q86739m51385p0930K4080m2915j06573j23561
2484.3G04913735j41799j96397k60830l07739l28958l05593k90454l37541l83436m20213
2504.7G01940775m85480n05626n23210o39379p63833q51810j015604j220464j236976
2523F94698393j005470o03080j36435J80423K99573L08454J74999j47998o09160j052141
2543.4F92107558j221239j025737o85215m23133l20911l53635m30465n12003o07253
2561.8F86527967p04407p74622q45671r36329r95517j036942j109242j191319j263797
$$ plain form
2423.1 707552493 708029747 708446264 708788455 709038794 709217966 709386408 709556878 709727645 709836483 709850013
2443.5 709850013 709873259 709902108 709853470 709760368 709653735 709543347 709440649 709280968 709027469 708709478
2463.9 708709478 708262265 707543790 706571758 705685019 705233634 705162704 705186784 705143869 705037296 704913735
2484.3 704913735 704771936 704575539 704314709 704006970 703678012 703372419 703081965 702744424 702360988 701940775
2504.7 701940775 701455295 700949669 700426459 699787080 699023247 698171437 697155833 695935369 694698393
2523 694698393 693692923 693089843 692953408 693133831 693433404 693741858 693916857 693768859 693159699 692107558
2543.4 692107558 690886319 689860582 689175367 688752234 688431323 688077688 687647223 687135220 686527967
2561.8 686527967 685823560 685048938 684203267 683266938 682271421 681234479 680125237 678933918 677670121
2580.1F77670121j319229j363814j432538j483560j520038j582920j545787j388073
2596.4F66034162j274109j240790j271248j411557j582503j701474j800299j904190
2612.8F53847992k030015k133667k181292k201497k266586k405345k502025k466857
2629.1F35660708k269447j823842j111627l60727J59263L86656L63826J47164j84119
2647.4F30967855n22792p57575q40485q28981p63894o42001m63844k36451l278K70664
2667.8F26179218N89133Q06629Q93057R34243R27269Q84533R08494R82225J009405
2686.2F34114206J057267J152098J129449R07659M86314l9875m41253o85632q61228
2704.5F36819005r58383j023769j106918j132310j063645j050293j183450j356364
$$ plain form
2580.1 677670121 676350892 674987078 673554540 672070980 670550942 668968022 667422235 666034162
2596.4 666034162 664760053 663519263 662248015 660836458 659253955 657552481 655752182 653847992
2612.8 653847992 651817977 649684310 647503018 645301521 643034935 640629590 638127565 635660708
2629.1 635660708 633391261 631567419 630455792 630095065 630254328 630640984 631004810 631151974 630967855
2647.4 630967855 630445063 629687488 628847003 628018022 627254128 626612127 626148283 625911832 625908554 626179218
2667.8 626179218 626768351 627574980 628468037 629402280 630329549 631214082 632122576 633104801 634114206
2686.2 634114206 635171473 636323571 637453020 638360679 638846993 638807118 638365865 637680233 636819005
2704.5 636819005 635860622 634836853 633729935 632597625 631533980 630483687 629300237 627943873
2720.9F27943873j531779j738191j795709j541495j175941r41693p85709n94616l66866
2739.2F17471874j26183P8916J70648O7652k40326o18160r81271j362443j688958j883804
2759.6F10887945k026499k164721k306700k544641k895356l306686l746391m191875
2775.9E87705076m694999n229532n710542o192565o717325p166981p460714p663607
2792.2E36868811p830561p969081q093893q269668q543909q911848r349763r865612
2808.6D68034476j0499805j1232913j2112975j3224155j4549374j6075462j7853737
2822.8C72486055j9971252k2474020k5385380k8890938l3273443l8269565m2569563
2837.1A61651894m4281259m1415453l2877974k0686604r395023k125416J429617L275453
$$ plain form
2720.9 627943873 626412094 624673903 622878194 621336699 620160758 619219065 618433356 617838740 617471874
2739.2 617471874 617345691 617424607 617595255 617662907 617422581 616804421 615823150 614460707 612771749 610887945
2759.6 610887945 608861446 606696725 604390025 601845384 598950028 595643342 591896951 587705076
2775.9 587705076 583010077 577780545 572070003 565877438 559160113 551993132 544532418 536868811
2792.2 536868811 529038250 521069169 512975276 504705608 496161699 487249851 477900088 468034476
2808.6 468034476 457534671 446301758 434188783 420964628 406415254 390339792 372486055
2822.8 372486055 352514803 330040783 304655403 275764465 242491022 204221457 161651894
2837.1 161651894 117370635 75955182 43077208 22390604 12995581 10870165 12299782 15575235
2853.4A5575235N103620P940241J2059647J6571608J9498698J9058079J5285916J0104925
2869.7A21197969N419120J270294l258243p860951j1221610j2680374j2587451j1552773
2886.1F8725981j0081094q477874o844930n396080m319142l548708l003662k713567
2902.4B4340924k679249k805025k886597k700474k163677j346913m83322K28672P47776
2920.7A0252115J089977J371110J737532K209554K815619L757631N213811P371802
2937C5819151J0555054J4657513J8785614K1528319K1577604J8899098J5280470J3109565
2953.4A70212388J3439953J5722826J9101188K3050234K7105704L0527830L2453358
2967.6C31613481L2501191L0941278K8286278K5084972K1837414J8857240J6269863
$$ plain form
2853.4 15575235 20678855 28619096 40678743 57250351 76749049 95807128 111093044 121197969
2869.7 121197969 126617089 127887383 124629140 116768189 105546579 92866205 80278754 68725981
2886.1 68725981 58644887 50167013 43322083 37926003 33606861 30058153 27054491 24340924
2902.4 24340924 21661675 18856650 15970053 13269579 11105902 9758989 9275667 9504339 10252115
2920.7 10252115 11342092 12713202 14450734 16660288 19475907 23233538 28447349 35819151
2937 35819151 46374205 61031718 79817332 101345651 122923255 141822353 157102823 170212388
2953.4 170212388 183652341 199375167 218476355 241526589 268632293 299160123 331613481
2967.6 331613481 364114672 395055950 423342228 448427200 470264614 489121854 505391717
2981.9E05391717J4057040J2186408J0625601R254098Q032620P033050O195009N468070
2998.2E78243613M946411M571259M247665M001677L752530L435552L152907K957880
3014.5F09309494K772868K589643K445221K336621K298057K331973K386212K417624
3030.9F28887713K521813K768159K951145K953827K899766K848268K735376K532840
3047.2F51098907K306283K119481J958668J797796J671075J559258J436293J369774
3063.5F65317535J285673J162469J162529J166820J063586R91225R78351J053810J211464
3081.9F75393462J332760J479030J763940K106845K380133K535998K577663K484321
3098.2F92054152K197207J791715J470387J267552J121104J029909R30250P58171N95212
$$ plain form
2981.9 505391717 519448757 531635165 542260766 551514864 559547484 566580534 572775543 578243613
2998.2 578243613 583190024 587761283 592008948 596010625 599763155 603198707 606351614 609309494
3014.5 609309494 612082362 614672005 617117226 619453847 621751904 624083877 626470089 628887713
3030.9 628887713 631409526 634177685 637128830 640082657 642982423 645830691 648566067 651098907
3047.2 651098907 653405190 655524671 657483339 659281135 660952210 662511468 663947761 665317535
3063.5 665317535 666603208 667765677 668928206 670095026 671158612 672149837 673128188 674181998 675393462
3081.9 675393462 676726222 678205252 679969192 682076037 684456170 686992168 689569831 692054152
3098.2 692054152 694251359 696043074 697513461 698781013 699902117 700932026 701862276 702620447 703215659
3116.5G03215659N67317O29484O31273N66542M94123M18365L90291M08411M19796L89635
3136.9G08130896L22580L36171L45945K69353K52605K14517J20878J30356J91271J91867
3157.3G10506439J61827J44481J08362N1200L1293O0915R9481J08301M2200n2511n0128
3179.8G11211860j8239n6326n7996J8180M3988j0192K5153J31726J56760K04146L05653
3202.2G11954713L10719J74641O3658J28925J83404J43706J41085J09911L5882J4781
3222.6G13261425J8955J3947J6153l3736r2208n0784k5689o7950q3267j04547j73032
3245G12679267k05696j63078j33991j65224j65105q0049o6459j79172k53797k56478
3265.4G11010218k46108j98185j72139k20060k47121k35379j97708j67430k33411l13223
$$ plain form
3116.5 703215659 703782976 704412460 705043733 705610275 706104398 706522763 706913054 707321465 707741261 708130896
3136.9 708130896 708453476 708789647 709135592 709404945 709657550 709872067 709992945 710123301 710314572 710506439
3157.3 710506439 710668266 710812747 710921109 710972309 711003602 711064517 711163998 711272299 711314499 711261988 711211860
3179.8 711211860 711193621 711137295 711079299 711097479 711141467 711131275 711156428 711288154 711444914 711649060 711954713
3202.2 711954713 712265432 712440073 712503731 712632656 712816060 712959766 713100851 713210762 713246644 713261425
3222.6 713261425 713280380 713294327 713310480 713276744 713184536 713133752 713108063 713040113 712956846 712852299 712679267
3245 712679267 712473571 712310493 712176502 712011278 711846173 711766124 711699665 711520493 711266696 711010218
3265.4 711010218 710764110 710565925 710393786 710173726 709926605 709691226 709493518 709326088 709092677 708779454
3285.8G08779454l01242k47061k05755j33991j00553j82927k34962k57015k74002k25366
3306.2G06616580k02536j86503j28686j25707j48773j10805q5771j45256k56539k51412
3326.6G04974592r5070j1801l4929o5446j15394j65463j11580j3887n246r775M4525
3349G04390526O3062j1504p3791k7477K9206K3782K3484J7286O9260K09570L52800
3371.5G05066204M56870M40478M02272M29868M53353M57526M11093L27647K91049K82765
3391.9G09019125K76684K98620K88724K90573L60131L89696L01659K13861K50101K79725
3412.3G11968899J77443O5863O3479R4294J21594J32441M7446n5015l9339P0512J28746
3434.7G12776363R3877J03951J77920J73449R8407M7922Q3864J60098K07186K53379
$$ plain form
3285.8 708779454 708478212 708231151 708025396 707891405 707790852 707607925 707372963 707115948 706841946 706616580
3306.2 706616580 706414044 706227541 706098855 705973148 705824375 705713570 705627799 705482543 705226004 704974592
3326.6 704974592 704879522 704867721 704832792 704767346 704651952 704486489 704374909 704361022 704355776 704346001 704390526
3349 704390526 704453588 704442084 704368293 704340816 704370022 704393804 704417288 704434574 704503834 704713404 705066204
3371.5 705066204 705523074 705963552 706365824 706795692 707249045 707706571 708117664 708445311 708736360 709019125
3391.9 709019125 709295809 709594429 709883153 710173726 710533857 710923553 711225212 711439073 711689174 711968899
3412.3 711968899 712146342 712212205 712275684 712369978 712491572 712624013 712671459 712616444 712577105 712647617 712776363
3434.7 712776363 712870240 712974191 713152111 713325560 713423967 713471889 713555753 713715851 713923037 714176416
3455.1G14176416K30968J91152J99199K03431K18451J76966J38044J47045J14560J09971
3475.5G15906203J66833J62721P9870J09553K11418J39475L3081P3790N4062q1659
3495.9G16855347n4955Q1539p570q0109J00136J15693l6776M053J22726R6619K4974
3518.3G17221677p629r2387j30475o4134o2466m1902K8074l7313j12533o5029p4566
3540.8G16561317k26020m41313m97043k28286p6115j66476k0862J82212R1791n6386
3561.1G15122819k3186k58923p79629m72664K00808J37686j80125k69413l18467l34502
3581.5G12824404k85446p26998j604438j474679r86993j797974k964973l315807l234029
3599.9F96433067k435743o45519P02143R52005J277685J784206J829624J757383J147569
$$ plain form
3455.1 714176416 714407384 714598536 714797735 715001166 715219617 715396583 715534627 715681672 715796232 715906203
3475.5 715906203 716073036 716235757 716315627 716425180 716636598 716776073 716809154 716882944 716937006 716855347
3495.9 716855347 716800392 716881931 716874361 716794252 716894388 717010081 716973305 716977358 717100084 717196703 717221677
3518.3 717221677 717214048 717121661 716991186 716927052 716864586 716822684 716850758 716813445 716700912 716635883 716561317
3540.8 716561317 716335297 715893984 715396941 715168655 715092540 714926064 714905202 715087414 715179205 715122819
3561.1 715122819 715099633 714840710 714061081 713588417 713789225 713926911 713746786 713477373 713158906 712824404
3581.5 712824404 712538958 711811960 710207522 708732843 707745850 705947876 702982903 699667096 696433067
3599.9 696433067 693997324 693351805 694053948 695005953 696283638 698067844 699897468 701654851 702802420
3618.3G02802420M65691Q92162J365602P74562j135706j540363J55985L04878m09723
3636.6G03675508o58810o36279j98841L51786J00494r43840n52356J327038J485169
3655G03949869L03209M48405R65536O95884N75066M49002n17071p11024L45767k73883
3675.4G06230760m91381R41873J188099Q99374P59602j36137j052439k65718P34210
3693.7G08808243P73788N14984R7155m55141k04920N41389M35173m37558j007795N3585
3714.1G09118903J256644J054109L68058N1975J06454K56837O48916O69241k50459
3732.5G13280678j071513r78649r7632Q55148R4771k018928j081169M09603q90970
3750.8G08501339j006722N95808P86364k21789m02093K02656J8358l07322m39882m40657
$$ plain form
3618.3 702802420 703268111 704160273 705525875 706300437 705164731 703624368 703780353 704085231 703675508
3636.6 703675508 703016698 702380419 702181578 702533364 702633858 701690018 701137662 702464700 703949869
3655 703949869 704253078 704701483 705667019 706362903 706937969 707386971 706869900 706158876 706504643 706230760
3675.4 706230760 705739379 706681252 707869351 708768725 709528327 709392190 708339751 708074033 708808243
3693.7 708808243 709582031 710097015 710194170 709739029 709534109 710075498 710510671 710073113 709065318 709118903
3714.1 709118903 710375547 711429656 711797714 711849689 711956143 712212980 712861896 713531137 713280678
3732.5 713280678 712209165 711230516 711132884 711988032 712082803 710063875 708982706 709392309 708501339
3750.8 708501339 707494617 708090425 708876789 708655000 708252907 708455563 708473921 708166599 707726717 707286060
3771.2G07286060J52230M28856n901n63741m14670p569j71483k19166j1027J08600
3791.6G06582189P2658m00126m83454n13374j396358o66023M5121p23064q4221Q58664
3812G03292012K77579r58860n23150o3717o87838K05875O70969K33412J24812j06931
3832.4G02464163k7179k40744r03189l49402L75688L81887N94914Q79645M16994j886129
3852.8G01706648k843022K86459J768589P67589n35548q73863k29240m70578r64225
3871.2F98612809j16944L88861M45187p8321n66065J7702k03192j83880L61979l68774
3891.6F98309362m19140N80847M84646l88146p65919o87659k36690L99351M42743J76847
3912F97896242J37329p0572k92420N5730L58224O9857l9876L18528L22163J7404J94550
$$ plain form
3771.2 707286060 707438290 707867146 707861245 707297504 706882834 706875265 706703782 706484616 706473589 706582189
3791.6 706582189 706654847 706254721 705771267 705257893 703861535 703195512 703240633 702517569 702433348 703292012
3812 703292012 703569591 702610731 702087581 702023864 701336026 701541901 702212870 702446282 702571094 702464163
3832.4 702464163 702436984 702196240 701293051 700943649 701319337 701701224 702296138 703175783 703592777 701706648
3852.8 701706648 698863626 699150085 700918674 701686263 701150715 700276852 700047612 699577034 698612809
3871.2 698612809 698495865 698884726 699329913 699251592 698685527 698703229 698500037 698316157 698678136 698309362
3891.6 698309362 697890222 698471069 698955715 698567569 697801650 697113991 696877301 697276652 697719395 697896242
3912 697896242 698033571 697962999 697670579 697726309 698084533 698154390 698114514 698433042 698755205 698772609 698967159
3934.4F98967159N58495N23806K33114q6427k1398K41578J38998N9485J59383J07288
3954.8G00881481j252n7756j71900k28107j37985j84774l38555k78949j83464k53021
3975.2F99045718k32756q2314k1875o6221n007J32084O2943l3916M9353Q0288N8651
3997.6F98986948
$$ plain form
3934.4 698967159 699525654 700049460 700282574 700196147 700174749 700416327 700555325 700614810 700774193 700881481
3954.8 700881481 700880229 700822473 700650573 700422466 700284481 700099707 699761152 699482203 699298739 699045718
3975.2 699045718 698812962 698730648 698708773 698642552 698637545 698769629 698832572 698798656 698848009 698928297 698986948
3997.6 698986948
##END=$$ End of the data block
