##TITLE=DI_15-0719127-0 -Napolitano - Poliester $$ Begin of the data block
##JCAMP-DX=5.00 $$ ACD/SpecManager v 10.08
##SPECTROMETER/DATA SYSTEM=Alpha
##DATE=09 Jun 2015 17:42:46
##DATA TYPE=INFRARED SPECTRUM
##DATA CLASS=XYDATA
##ORIGIN=
##OWNER=
##NPOINTS=1667
##FIRSTX=599.64648438
##LASTX=3997.64306641
##MAXX=3997.64306641
##MINX=599.64648438
##MAXY=0.84104681
##MINY=0.14546649
##XFACTOR=1.0000000000
##YFACTOR=1.000000000000000e-9
##FIRSTY=0.83398074
##DELTAX=2.03961372
##XUNITS=1/CM
##YUNITS=ARBITRARY UNITS
##XYDATA=(X++(Y..Y))
599.6 833980739 833967328 834128678 833884597 833393514 832966328 832633555 832097352 831358314 830931604 830849230
620 830849230 830523491 829571545 827828586 823687494 816979408 813998997 818648636 825045705 828030944
638.4 828030944 828589618 828457594 828059316 827430308 826688647 825898290 825097978 824506998 824092031 823495865
658.8 823495865 822687626 821719527 819776118 815788329 812574208 812531233 811861217 808983862 804728091
677.2 804728091 801174164 800280988 801615834 803166389 803678751 803148925 801649809 798812807 793965757
695.5 793965757 786286950 775816798 764277458 753626525 744449317 736468256 729503691 722355962
711.8 722355962 710394084 685250401 636388719 554280341 443944484 338507086 277571380
726.1 277571380 270688325 298837334 345108569 406810850 487247109 582734048 675823092 746933579
742.4 746933579 790268004 812952220 824040771 829301536 831706941 832670689 832787395 832273662
758.7 832273662 831224322 829711080 827799022 825627089 823320329 820947289 818552136 816079795
775.1 816079795 813401580 810211003 805866301 799450696 790095747 777238727 761241317 745904028
791.4 745904028 739245951 746326327 760864615 771251559 773836672 772712648 771362603 770470977
807.7 770470977 769799292 769330382 769228756 769476533 769907117 770230711 770013034 768952250 767020166
826 767020166 764253259 760607183 755992353 750612855 745235443 740745068 737565875 735586047 734490573
844.4 734490573 734044909 734146893 734797120 735878885 737040997 737801313 737197340 733391225 724156737
862.8 724156737 707461655 682174027 650074780 618720233 599538624 598790526 613101244 634634733
879.1 634634733 656579614 674935162 688481867 697567463 702843964 705049157 705255210 704932392
895.4 704932392 705809176 709549904 717256367 728886008 743161440 758111954 771749496 782718599
911.7 782718599 790700912 796094358 799476326 801467657 802556217 802975237 802862644 802433431 801887393
930.1 801887393 801233590 800425947 799545765 798721194 797867656 796818614 795606911 794272065 792768896
948.4 792768896 791064143 789108753 786865175 784244537 781015694 776885688 771607876 765206277
964.7 765206277 758122861 751298368 746198833 744034290 744862974 747721970 751387179 754981756 758041918
983.1 758041918 760290861 761671007 762400627 762645483 762203813 760716915 758012652 754008949 748460293
1001.5 748460293 740426600 727626979 706660450 672306240 616056740 537482381 463144809
1015.7 463144809 432460904 456712365 509943724 559978485 592684925 608488858 612620950
1030 612620950 610637248 605682254 598811269 591002226 584232748 581056714 583392024 591814458 605609953
1048.4 605609953 623068273 641953588 659827888 674226522 683440149 686994493 685348749 679364800
1064.7 679364800 669734359 656449735 638701081 615230262 584903121 547579944 505130589
1079 505130589 461357087 419864446 381935865 346741050 313477933 282914788 257008433 237668842
1095.3 237668842 226081192 222749144 227449983 239258856 256426036 275673389 291641682 299131393
1111.6 299131393 297268271 290153027 283571243 282012492 287450671 299239993 314919174 331669211
1127.9 331669211 347952694 364092946 381503254 401551098 424948633 452052593 483196586
1142.2 483196586 518141329 555391252 592500210 627068877 657279670 681835711 700228930
1156.5 700228930 712917328 720792174 724295139 722759843 714945912 701382339 686152339 675016820
1172.8 675016820 671831191 676936209 688012183 701667368 714520991 724241436 730133533 732546270
1189.1 732546270 732039988 729177117 724535286 718695164 712202847 705369473 698256373 690793514
1205.4 690793514 682753623 673814118 663731575 652401745 639621258 624957979 607878029 587785900
1221.7 587785900 563968360 535330236 500173926 457021832 406444669 352286756 300704002
1236 300704002 257413954 225315601 204035267 191333741 184586525 181485221 180191845 179236546
1252.3 179236546 177466124 174356788 170497596 167472631 166883916 169385329 174918592 183087498
1268.6 183087498 193021283 203136921 211713001 217967123 222449690 226441264 231001779 236830503
1285 236830503 244555339 254949540 268777281 286913157 310384512 339706928 373544395 408147931
1301.3 408147931 439690292 467671961 494641304 522053003 548868895 573855639 596616924
1315.6 596616924 617925346 639728129 662431002 684068859 702227056 714430630 717966318
1329.8 717966318 710069478 689480484 659494996 629905283 614417851 620847702 645277321 677921534
1346.2 677921534 708828211 732010901 746281326 752868414 753281832 746493101 729919970 705067694
1362.5 705067694 677489221 650488734 628646910 617897034 618450403 630022705 649450958 669240594
1378.8 669240594 685327411 695594430 697869122 694878221 691959321 685708225 670843303 651824951
1395.1 651824951 633751690 613641918 587500215 549394190 499783516 456728250 443405747
1409.4 443405747 474609733 541691363 613070488 668058276 710958123 742274642 758062363
1423.7 758062363 762648702 757559419 744347453 728073835 706950068 681883872 667888343 666039944
1440 666039944 664059401 659328341 652539611 646316588 643134236 638962984 629770160 623442650 640975475
1458.3 640975475 672940493 696705222 714331269 733761549 746262252 744058847 739854753 749060810
1474.7 749060810 765386879 778824329 786995769 791385949 790332913 781960249 773628294 775156319
1491 775156319 778239310 768723786 750070870 730845094 704791546 669090331 639258265 651278079
1507.3 651278079 696405351 731201291 746419251 747273386 743237436 738181710 735683858 741951883
1523.6 741951883 750616670 758960009 764932573 763270974 762563407 764891386 754110754 736957073
1539.9 736957073 742180288 761578739 778022528 785464346 785281777 781565428 772445321 753360629
1556.2 753360629 733300030 745385289 770838976 779574513 774578631 762813628 753177583 743898869
1572.6 743898869 722888470 702898800 706879497 726383507 749568701 769589603 781855583
1586.8 781855583 787096739 788453937 787969172 787088156 786569536 785209239 782309532 778893709 774771273
1605.2 774771273 768774271 762279093 756669044 749272585 741442144 745943785 758720398 762248993
1621.5 762248993 760553300 762705088 765981853 769043207 766728818 752774596 741723716 750654042
1637.8 750654042 763116896 765053809 754651606 739010334 734748542 732393563 716435671 714578509
1654.1 714578509 734379411 743522763 736678720 724834025 718080997 709849596 694075525 682600141
1670.5 682600141 677872896 670562923 664648533 659177601 644587696 621846616 609030426 613542080
1686.8 613542080 615714669 609171152 593577564 566023529 533898830 500606716 464977115 431857854
1703.1 431857854 390455216 339147478 288318276 240211919 198181644 166455865 148962110
1717.4 148962110 145466492 147676870 151349589 156692043 163630798 171800748 181983173 201533154
1733.7 201533154 233389929 269825578 318125308 381501853 450119972 515921712 573083043
1748 573083043 624141753 671410799 706858158 729232013 745339215 756605506 766918957 778078020
1764.3 778078020 783108592 781086922 776568890 777706325 789020300 799958706 803798437 804832160
1780.6 804832160 806854963 809526503 812003076 810022950 802668035 800879538 807936192 812541664
1796.9 812541664 811495006 811287582 815296650 819197655 819326043 817005098 816365659 818536758 820081115
1815.3 820081115 820005059 819813967 818251550 814181447 811067522 809559643 809440851 814990163 822137237
1833.6 822137237 825171411 826472223 826594889 821959436 816899896 820719600 828987718 834446728
1850 834446728 837165833 838424325 838995159 839298248 839661121 839791894 837865293 832196414 827445865
1868.3 827445865 830644369 837437928 840707898 841046810 840816557 840452969 839871049 838931203 836749732
1886.7 836749732 833863139 833519280 834727347 834725142 834841430 835347533 835114837 834306121 833094656
1905 833094656 831244171 829687476 829684913 829816937 827238441 823308945 822240412 822748423 822995186
1923.4 822995186 824084580 824704945 823960125 822684765 821273983 819814682 817886531 814348102 810049653
1941.7 810049653 808404565 809303403 810039759 810175717 810193300 810353100 810949445 811955869 813076019
1960.1 813076019 814176142 814790308 815075696 816473961 818800807 820471883 821316063 821906388 822426796
1978.5 822426796 822856367 823201299 823408186 823293328 822707593 822022974 822742283 824964225 826716363
1996.8 826716363 827534854 828160882 828749776 829231739 829641283 830065489 830475867 830550015 830091417 829914987
2017.2 829914987 830688357 831607223 832030952 832246065 832455099 832635760 832758129 832824826 832829952 832656801
2037.6 832656801 832260013 831983447 832060993 832182646 832129836 831935942 831646681 831315160 830953598 830520809
2058 830520809 829991996 829305649 828562796 828161299 828022957 827705979 827219784 826748550 826287746 825840652
2078.4 825840652 825490117 825206161 824871182 824458063 824045300 823747456 823551953 823327065 823064506 822846591
2098.8 822846591 822698712 822582066 822453678 822322249 822207749 822110236 822020292 821965992 821978331 822015941
2119.2 822015941 822063625 822135508 822183609 822207212 822255671 822309434 822336137 822358429 822414041 822507322 822623134
2141.6 822623134 822731197 822833121 822978497 823178470 823426008 823713601 824025810 824346483 824650168 824968994
2162 824968994 825339913 825703502 826009035 826262116 826475024 826679468 826864064 826977909 827038229 827106476
2182.4 827106476 827164650 827171981 827182770 827223003 827236176 827187717 827100456 826967359 826757550 826477408 826131642
2204.8 826131642 825801551 825588226 825450778 825337887 825257003 825183153 825088859 824985147 824879467 824737966
2225.2 824737966 824548900 824352086 824149072 823933721 823694527 823405445 823061764 822700143 822355628 821941674
2245.6 821941674 821392596 820773959 820165992 819633305 819199145 818851888 818588197 818407714 818279028 818168223
2266 818168223 818062484 817924738 817743123 817528367 817281246 817043841 816877127 816865802 817038000 817333281
2286.4 817333281 817727387 818227708 818812609 819430232 820011020 820463121 820756495 820874751 820748210 820401490
2306.8 820401490 819939792 819445252 818968594 818421483 817553222 816338003 815158725 814353466 813822627
2325.2 813822627 813294411 812730670 812315106 812089562 811831117 811446309 811066985 810862780 811112165 812228203
2345.6 812228203 813554049 813539207 811666906 808870196 806424320 804755509 803823531 803472042 803641021
2363.9 803641021 804366052 805526257 806955516 808513701 810034335 811478555 812889814 814214230
2380.2 814214230 815289557 816012740 816445887 816689253 816829503 816990316 817206502 817416310 817639291
2398.6 817639291 817907333 818183422 818456292 818755507 819066942 819348335 819638371 819969475 820294261 820585310
2419 820585310 820891976 821266115 821658432 822001040 822314203 822634697 822929025 823185802 823440015 823643506
2439.4 823643506 823794007 823971927 824142694 824269652 824381590 824453592 824465632 824443221 824416339 824391842
2459.8 824391842 824367464 824364126 824329197 824168324 823948741 823793530 823692679 823572636 823386014 823175192
2480.2 823175192 823008180 822826982 822553933 822229147 821936071 821686566 821431696 821168661 820920467 820673764
2500.6 820673764 820440948 820257425 820117474 819985807 819848776 819718480 819597542 819481134 819348812 819198072
2521 819198072 819067419 818951130 818836033 818752706 818723917 818738759 818743289 818729460 818737149 818720102 818644285 818570435
2545.5 818570435 818539977 818565130 818623722 818653584 818639934 818637192 818682849 818746626 818792343 818829000 818901896 819009781
2569.9 819009781 819075584 819079459 819084048 819111943 819160461 819260597 819438994 819682300 819961905 820270658 820584834
2592.4 820584834 820845485 821019232 821151614 821302712 821448863 821520865 821517646 821503580 821489811 821440220 821359336
2614.8 821359336 821287632 821239591 821146786 820956528 820736885 820602119 820627749 820825696 821160078 821568251
2635.2 821568251 821965992 822299361 822567999 822766423 822901130 823008001 823101401 823170185 823187768 823169112
2655.6 823169112 823167562 823186576 823208272 823212147 823198080 823220611 823261678 823219657 823104858 823024929 823012948 823028505
2680.1 823028505 823051453 823091328 823136568 823137164 823082268 822999179 822892368 822775483 822639465 822494984 822385550
2702.5 822385550 822259784 822076619 821905613 821805477 821741045 821613133 821419120 821267664 821150482 820984721
2722.9 820984721 820756018 820489585 820234001 819999754 819777012 819565415 819350421 819162488 819009840 818806767
2743.3 818806767 818516195 818226576 818031192 817885458 817691267 817486167 817360103 817321658 817302883 817242265
2763.7 817242265 817186892 817165315 817141771 817116141 817068398 816976786 816868126 816743493 816559613 816312015 816048682
2786.1 816048682 815816045 815616965 815403581 815129220 814779282 814389825 814014435 813681126 813443601 813342988
2806.5 813342988 813401639 813604236 813764274 813729286 813574255 813341498 812997162 812596858 812174320 811675251
2826.9 811675251 811080217 810425460 809731960 808967054 808051169 806939781 805599451 803968012 801975071
2845.3 801975071 799681962 797498882 795796275 794505954 793476641 792706609 792165637 791718781 791231215
2863.6 791231215 790645063 789984703 789258242 788383067 787342608 786190927 784867465 783251703 781380415
2882 781380415 779479980 777802765 776583254 776061296 776318610 777146518 778188944 779166698 779893875
2900.3 779893875 780238509 780303419 780455112 780985415 781875253 782837033 783606887 784209609 784790754 785317361
2920.7 785317361 785582364 785464168 785015702 784241974 783005357 781075001 778208256 774218559 768878043
2939.1 768878043 762019217 753820360 744724751 735287964 726151228 717849016 710732698 705180883
2955.4 705180883 701578438 700057387 700533628 702799797 706488490 711180508 716500700 722144008
2971.7 722144008 727875531 733465731 738707542 743503928 747848272 751806855 755493045 758966565
2988 758966565 762182891 765053332 767621100 769995391 772194147 774233043 776212931 778291106 780516028
3006.4 780516028 782721996 784836709 787065268 789534450 792141020 794661045 796856463 798698127
3022.7 798698127 800333500 801747382 802774429 803540349 804326355 805076897 805542648 805536687 804883301
3041.1 804883301 803355455 800728798 797060788 793030024 789686084 787742257 787430227 788402319 789572775
3059.4 789572775 789918303 789362669 788675427 788557708 788991392 789602458 790095031 790238738 790009797 789864957
3079.8 789864957 790433168 791865110 793817580 795841873 797519386 798479676 798536539 797868252 796761036
3098.2 796761036 795595586 795118809 795671046 796888828 798468769 800261140 801958859 803254247 804180324
3116.5 804180324 804871678 805209517 805194616 805095255 805135190 805464089 806051075 806916356 808091581 809212208
3136.9 809212208 810000122 810521781 810970902 811464429 811929822 812294185 812555432 812769473 813023210 813295364
3157.3 813295364 813489318 813628495 813752532 813836813 813905716 813990295 814060092 814039767 813885093 813765824
3177.7 813765824 813878894 814030230 813998997 813936710 814007163 814124227 814180255 814127862 814016342 814121187
3198.1 814121187 814535439 814911187 814986169 814841390 814634144 814489365 814405859 814377785 814393282 814304948
3218.5 814304948 814201415 814226985 814206541 814038336 813906789 813909531 813935280 813951731 814006090 814088345 814125240
3240.9 814125240 814050198 814076543 814406872 814716637 814704239 814550817 814545453 814668775 814745843 814806759 814916313
3263.4 814916313 815053463 815155983 815113485 814862549 814555228 814481258 814669907 814858615 814839303 814692914
3283.8 814692914 814547777 814367771 814139307 813942134 813868046 813865721 813879430 813996494 814157546 814169407
3304.2 814169407 814002097 813858151 813901186 814070523 814269185 814409137 814409018 814252257 813924193 813505292
3324.6 813505292 813163638 812901974 812549114 812049687 811625004 811502695 811660528 811951756 812246621 812446713
3345 812446713 812596679 812797785 813010991 813131869 813150823 813219130 813404918 813612461 813711345 813683689 813757658
3367.4 813757658 814078867 814500391 814798772 814914882 814958930 815014899 814990103 814842701 814817667 814935744
3387.8 814935744 814701796 814127028 813823640 813744485 813562095 813256204 812776864 812171638 811442852 810413718
3408.2 810413718 809100688 807683825 806184292 804370940 802037060 799716711 798192143 797219276
3424.5 797219276 796141028 795009553 794343889 794393063 794922709 795741737 796825826 797925889 798804462
3442.9 798804462 799440026 800572097 802966595 805639505 807528019 808830678 809742212 810235620 810677707
3461.2 810677707 811445177 812199235 812724531 813325822 813879251 814117789 814229310 814070821 813312590 812838614
3481.6 812838614 813297212 813673854 813646078 813898742 814063966 813583791 812993407 812508643 811209440 809338093
3502 809338093 808915675 809648573 809456110 809005439 809500456 809913993 809418738 808339179 806658566 804397941
3522.4 804397941 802482188 801440001 801471293 802667141 803597271 803149641 802459836 802300274 801221251
3540.8 801221251 798195541 795035481 794637501 796282887 797011733 797519743 799118817 800092518 799523890
3559.1 799523890 797798812 793680072 787174463 785124779 792110145 800555885 804255605 804987371
3575.4 804987371 805358708 805786312 805348694 801639915 794504166 791074753 795619309 799905062 799432039
3593.8 799432039 798667610 799462676 800322771 801315367 800512314 795209706 788803399 786069512 785692513
3612.1 785692513 785685480 784334064 781898379 784698546 791500449 791968346 782034039 771870553 776311517
3630.5 776311517 787561536 794408381 797813714 799536705 799770534 797330022 788526118 773453534
3646.8 773453534 764063478 772337317 786719918 793678999 797707558 804452956 809606075 810963333
3663.1 810963333 808022380 798814237 788130164 784202874 781476796 779424369 789057076 803223073
3679.4 803223073 811902225 813858271 808098853 797297657 793056846 801657438 813228428 819438875
3695.8 819438875 819720387 816328347 814398527 816878378 816879094 808991194 799120128 799070358 809181988
3714.1 809181988 817072690 817342639 813400209 809770644 808542788 809936881 810745001 804859698 792680621
3732.5 792680621 784579694 788917065 799176037 801439941 791845262 783118486 783816099 782772362
3748.8 782772362 782074809 792306006 804062366 807932734 808696508 812617779 815723956 814340830
3765.1 814340830 811745644 811418533 815809429 821929455 823237836 819342375 816385686 818116128
3781.4 818116128 820644200 822252691 824463546 825960279 825080335 820756912 814072728 807833195
3797.7 807833195 801503778 798795044 802731216 806482196 811340213 818460941 819488466 811920047
3814.1 811920047 803227782 798302531 794890463 798674643 808309853 813636899 814283013 811858058
3830.4 811858058 807146668 801538467 795484364 793472528 798493803 806427538 814019144 818019807
3846.7 818019807 813109457 797387540 782069445 787782609 804698706 813118756 811380267 806157112
3863 806157112 804070115 803186417 800490618 801457524 807100892 812815666 814603865 810867488 807875872
3881.4 807875872 807719886 808354080 811333716 812596083 812365234 815829813 817589581 811716735 802787364
3899.7 802787364 798355401 801447272 810758233 820277035 825020790 825223565 822177470 817645788
3916 817645788 815612137 817118943 818648279 819008768 820008397 820450306 818919122 818648100 821539044
3934.4 821539044 824343860 824465454 822492659 820803583 820937335 821198523 821036756 822147787 823983729
3952.7 823983729 824996650 825144649 824923754 824718595 824986100 825456977 825493872 825141728 824734628 824493885
3973.1 824493885 824572980 824869335 825014889 824969471 825022459 825186133 825202942 825020909 824830472 824795842
3993.5 824795842 825028181 825425923
3997.6 825425923
##END=$$ End of the data block
