##TITLE=DI_15-0719127-0 -Napolitano - PE $$ Begin of the data block
##JCAMP-DX=5.00 $$ ACD/SpecManager v 10.08
##SPECTROMETER/DATA SYSTEM=Alpha
##DATE=09 Jun 2015 17:40:32
##DATA TYPE=INFRARED SPECTRUM
##DATA CLASS=XYDATA
##ORIGIN=
##OWNER=
##NPOINTS=1667
##FIRSTX=599.64648438
##LASTX=3997.64306641
##MAXX=3997.64306641
##MINX=599.64648438
##MAXY=0.80674136
##MINY=0.04330835
##XFACTOR=1.0000000000
##YFACTOR=1.000000000000000e-9
##FIRSTY=0.80674136
##DELTAX=2.03961372
##XUNITS=1/CM
##YUNITS=ARBITRARY UNITS
##XYDATA=(X++(Y..Y))
599.6H06741357k05934j60694n58555p95961q34465r08255r17972p36832m61877m70936
620H00689876p97331q09014l63708j92284n68032j059056j057446n76973k92063j37269
640.4G94836700N7459r7573l87907m09722l92378l50535l05473m83096n57661l68953
660.8G91540861l14772j329243l283203j769900J728177J068175m71950j004934j051545
679.2G85111666r54807p90536o32167p54714q81374r33409j467228k079129k227843
697.5G74390459k694607l878951n458116p042826q845984j2116492j8244148l0611932
713.9F85497403n1968396n9811830j9782961L4821749M1041076P542313k1338046n546987
730.2F10454321M3358982N9391200L4927011J2847602M286885K196670K537429K164960
$$ plain form
599.6 806741357 806535423 806374729 805816174 805020213 804185748 803277493 802359521 801622689 801160812 800689876
620 800689876 799892545 799083531 798719823 798527539 797959507 796900451 795843005 795266032 794973969 794836700
640.4 794836700 794894159 794796586 794408679 793998957 793606579 793256044 792950571 792467475 791909814 791540861
660.8 791540861 791226089 789896846 786613643 784843743 786571920 787640095 787168145 786163211 785111666
679.2 785111666 784156859 783366323 782734156 781979442 781098068 780164659 778697431 776618302 774390459
697.5 774390459 771695852 767816901 762358785 755315959 746469975 734353483 716109335 685497403
713.9 685497403 633529007 573717177 553934216 588755965 629797041 637339354 616001308 610454321
730.2 610454321 653813303 713204503 748131514 760979116 765266001 767462671 770000100 772165060
746.5G72165060J328945R90391O58274K44677K08556L77477J95026l43025n64754k84493
766.9G74976134J1385J87099J49429K5987M1485j30236m16875l99709j27375k5987
787.3G74291337j24217k40504m24326m00007j65224j85370l21448k67327k84970m19378
807.7G71458566n17010m96984k80976j53244k34723k54929k44737l33488l62932l03805
828.1G68275738k82765l80337m73916m62831m98652n16117m56154m69983n37395n44608
848.5G63652980n20408n97834o64831m88340k82646l40521m91023n04732m51207m26650
868.9G58884788m38035n00262n98669o80148o80685p18177q34346q67426p86603n36382
889.3G52244055j51455L7432r1553k85924m27901n75483p91371j032233r08196l29674
$$ plain form
746.5 772165060 773494005 774484396 775142670 775387347 775595903 775973380 776168406 775825381 775260627 774976134
766.9 774976134 774987519 775174618 775324047 775350034 775391519 775261283 774844408 774444699 774317324 774291337
787.3 774291337 774167120 773926616 773502290 773102283 772937059 772751689 772430241 772162914 771877944 771458566
807.7 771458566 770941556 770444572 770163596 770010352 769775629 769520700 769275963 768942475 768579543 768275738
828.1 768275738 767992973 767612636 767138720 766675889 766177237 765661120 765204966 764734983 764197588 763652980
848.5 763652980 763132572 762534738 761869907 761381567 761098921 760758400 760267377 759762645 759311438 758884788
868.9 758884788 758446753 757946491 757347822 756667674 755986989 755268812 754434466 753567040 752780437 752244055
889.3 752244055 752092600 752130032 752038479 751752555 751324654 750749171 749957800 748925567 748017371 747687697
909.7G47687697J45436K19226M3332j71006k86400l56674m50671m88341m08709l59118
930.1G45574772l89456l55423l27825l90172m25458l98338l51489l26454l53873l96669
950.5G41859615m46856m78447m90665m98712m90487m99010m58896l78609l31342k79546
970.9G37507045k44021k60890l21626m16637m86493n05745n58079o46352o42896n11766
991.3G32912540m06324l98994m06265l91126l96848m18543m17769m67599n66304o21497
1011.6G28421271o17266n72443n00440l83914l04162l71457m90903n60880o46889p47860
1032G23225057p79688p66814p56204p55131p09355o06299o09457p17938o75917m94838
1052.4G16353416n02467p38978r78589j105786j089394r47237p81178p50601q51989
$$ plain form
909.7 747687697 747833133 748052359 748095691 747924685 747638285 747281611 746830940 746342599 745933890 745574772
930.1 745574772 745185316 744829893 744502068 744111896 743686438 743288100 742936611 742610157 742256284 741859615
950.5 741859615 741412759 740934312 740443647 739944935 739454448 738955438 738496542 738117933 737786591 737507045
970.9 737507045 737263024 737002134 736680508 736263871 735777378 735271633 734713554 734067202 733424306 732912540
991.3 732912540 732506216 732107222 731700957 731309831 730912983 730494440 730076671 729609072 729042768 728421271
1011.6 728421271 727804005 727231562 726731122 726347208 726043046 725671589 725180686 724619806 723972917 723225057
1032 723225057 722445369 721678555 720922351 720167220 719457865 718851566 718242109 717524171 716848254 716353416
1052.4 716353416 715850949 715111971 714133382 713027596 711938202 710990965 710209787 709459186 708607197
1070.8G08607197r07123p85888n41269k62738O0559L16560L87132L54052L07619K97308
1091.2G07833409L35634K77519R1851o2644j49668k27809l68297n21242n48721n19633
1111.6G06140399n50568n92768n61416m70520m57048n10752n00918n00619n55277n35190
1132G00905323m15385l59773m45724n74767o84023q78334j378358k145290k647281
1150.3F91376388k432525j679421q34465j37269L81946O96958P80761P27594O42597
1168.7F89522564N53847L84688J12951k98J22428J21534j07289l25262m64857o03914
1189.1F89316392p93278j007676j230717j480103j709461j900375k076864k145529
1205.4F76972389k001643j767933j581133j387834j169265r68933p49886n19097l08513
$$ plain form
1070.8 708607197 707700074 706914186 706372917 706110179 706170738 706487298 706874430 707228482 707536101 707833409
1091.2 707833409 708169043 708446562 708538413 708475769 708326101 708098292 707729995 707208753 706660032 706140399
1111.6 706140399 705589831 704997063 704435647 703965127 703508079 702997327 702496409 701995790 701440513 700905323
1132 700905323 700489938 700130165 699684441 699109674 698425651 697547317 696168959 694023669 691376388
1150.3 691376388 688943863 687264442 686429977 686292708 686674654 687371612 688152373 688879967 689522564
1168.7 689522564 690076411 690461099 690574050 690573752 690696180 690817714 690710425 690385163 689920306 689316392
1189.1 689316392 688523114 687515438 686284721 684804618 683095157 681194782 679117918 676972389
1205.4 676972389 674970746 673202813 671621680 670233846 669064581 668095648 667345762 666826665 666518152
1223.8F66518152o9976J49727K79665L45826L87549M45247N16534N69582O12140O17325
1244.2F70371771N80788N39541M17709K45571J28865M0412l4153k0444l696j91212
1264.6F72075152m50611n87821o02722n00917m34637n35667o56367p12931p76946r05753
1285F65910780j021981j015067j045823j211524j315415j161396q50976n44786k29359
1303.3F57514453P7665M03464P74979J099766J338899J411259J377225J583636J738369
1321.7F67319715J411557Q50260L08276j98424p60496j566708k669692l340423k570689
1340F58783376j224339j178503k055585k511740k153695j203596k64704j7643j065672
1358.4F47107899k980649l935755l238141k572477j480758L60727M34399o36637O70731
$$ plain form
1223.8 666518152 666448176 666597903 666877568 667223394 667610943 668056190 668572724 669142306 669754446 670371771
1244.2 670371771 670952559 671492100 671909809 672155380 672284245 672324657 672290504 672270060 672266364 672075152
1264.6 672075152 671624541 671036720 670433998 669933081 669498444 668962777 668306410 667593479 666816533 665910780
1285 665910780 664888799 663873732 662827909 661616385 660300970 659139574 658288598 657743812 657514453
1303.3 657514453 657592118 657995582 658770561 659870327 661209226 662620485 663997710 665581346 667319715
1321.7 667319715 668731272 669581532 669889808 669691384 668930888 667364180 664694488 661354065 658783376
1340 658783376 657559037 656380534 654324949 651813209 649659514 648455918 648191214 648173571 647107899
1358.4 647107899 644127250 640191495 636953354 634380877 632900119 633260846 633695245 633058608 633729339
1376.7F33729339N148768R050489Q351564M284263J470446J478970Q89123j355291
1393.1F63047671j929402n87881L43681N97656m37439j216412p66694r95994j578331
1411.4F56476855j740932k627135l933429k493501k43783j682460m398763p035613
1427.7F32321239r409369r696543r905100j0594785p334947l685952m225015n757809
1444.1E71711719p356286r551644j2921870j8760860k4848431l1057865m1186184n0676763
1460.4C75351816l9553433j986832K5100649J6974121k593577R392649P0968002R6659959
1476.7E50313354O1846256K5170445R736359L554762k73943q01265K110958K915084
1493F54572010k82109j593053J070082J876652j872062p301569m873216L916680M680157
$$ plain form
1376.7 633729339 638878107 647928596 656280160 660564423 662034869 663513839 664402962 663047671
1393.1 663047671 661118269 660530388 660874069 661471725 661034286 659817874 659051180 658055186 656476855
1411.4 656476855 654735923 652108788 648175359 645681858 645438075 643755615 639356852 632321239
1427.7 632321239 622911870 613215327 603310227 592715442 585380495 581694543 577469528 571711719
1444.1 571711719 564355433 554803789 541881919 523121059 498272628 467214763 426028579 375351816
1460.4 375351816 335798383 333811551 358912200 375886321 373292744 382685393 453653395 550313354
1476.7 550313354 612159610 637330055 647066414 650621176 650347233 649545968 651656926 654572010
1493 654572010 654289901 652696848 653766930 655643582 653771520 646469951 641596735 645513415 650193572
1511.4F50193572J220167j537741k226412k269923j593531J302123K221227J810551
1527.7F49120033R83834j487791j631737l72768l895998o242037Q30770O069183N592347
1546F48965836L102123R23515j65820j836420m953503n769015L920734Q853436M130661
1564.4F57171547M1128j664997j34408J070440j777113j828849K281368K425611M80354
1582.8F58065081l45171o33716r13799j109541j196146r32276l63469j20401j31429
1601.1F52319133J07110L05295J49309K30492L89099r17673k888680r39369K095520
1619.5F50850236L48390r45330N40316J102805J088143l88682m170120l959715K272725
1637.8F46738768L918409R87172k656102m488945r67443k4736m712880n62548P415235
$$ plain form
1511.4 650193572 651413739 649875998 647649586 645379663 643786132 645088255 647309482 649120033
1527.7 649120033 650103867 648616076 646984339 646611571 642715573 636473536 637304306 643373489 648965836
1546 648965836 652067959 652991474 652825654 650989234 646035731 640266716 644187450 653040886 657171547
1564.4 657171547 657212675 655547678 655413270 656483710 654706597 652877748 655159116 657584727 658065081
1582.8 658065081 657719910 657086194 656172395 655062854 653866708 652934432 652570963 652450562 652319133
1601.1 652319133 652426243 652731538 652880847 653111339 653500438 652582765 649694085 648754716 650850236
1619.5 650850236 651198626 650253296 650793612 651896417 652984560 652595878 648425758 644466043 646738768
1637.8 646738768 650657177 651644349 648988247 644499302 643531859 643507123 638794243 638231695 645646930
1656.2F45646930M691183k73406j808286j9312m12822l080725j836241M91739j63973
1674.5F43235087P08938J260877j900792n385697k566457L791332L426612Q72016j657308
1692.9F41784608m698753m710793l181577J32024L360033J852512J041353J328230
1709.2F36907637l79264k900541m597128k688765K556384L785491J516521J66416o77884
1727.6F33688867j947999l495157l301739J342058K673507O78777R42648J471519N30124
1745.9F32582605m04477L92020K983927L420115J551687P07925K58386M04239J360118
1764.3F43256545J98424j713395k421081r40800K323985K714932O64711l05593L755
1782.6F43781483K18392K80320p87675k498746j220346J572967J189172m99606m02748
$$ plain form
1656.2 645646930 650338113 650064707 648256421 648237109 647824287 644743562 642907321 643399060 643235087
1674.5 643235087 643944025 645204902 643304110 637918413 635351956 639143288 642569900 643441916 641784608
1692.9 641784608 637085855 632375062 629193485 629325509 632685542 634538054 635579407 636907637
1709.2 636907637 636528373 633627832 629030704 626341939 628898323 632683814 634200335 634366751 633688867
1727.6 633688867 631740868 628245711 624943972 626286030 628959537 629638314 630580962 632052481 632582605
1745.9 632582605 632178128 632570148 635554075 638974190 640525877 641233802 641492188 641896427 643256545
1764.3 643256545 643454969 641741574 639320493 638379693 640703678 643418610 644083321 643777728 643781483
1782.6 643781483 643999875 644280195 643492520 640993774 639773428 641346395 642535567 642035961 641633213
1801F41633213Q16345R33587o2585p85231l81708M52697L67463j01626j35422m16577
1821.4F42320156j122355j000524o07312m29570J013159J612962M67300j19924l71933
1839.8F41761959j718343k185106L09169J893640J114309K66194r0241k17736k72870
1858.1F40860975k32816k40862p17819j731753j691521M00484J614034P44522r4533
1876.5F38910711k31981k71440l79086n21838r10461j264215o75499r3281k27929m2438
1896.9F34292543K67267K17319J13785J9669j89781j84416K05516K56479m83990r26971
1917.3F33587420j42992L89636K82347M61817L57985K3127p0810r3460o4552j12891
1937.7F34617627n48303q59917j88887N25892M01378Q8393q0824j66535j19448o6042
$$ plain form
1801 641633213 642449558 643383145 643320560 642535329 642153621 642606318 642973781 642872155 642736733 642320156
1821.4 642320156 641197801 640197277 639589965 639160395 640173554 641786516 642253816 642133892 641761959
1839.8 641761959 640043616 637858510 638167679 640061319 641175628 641441822 641351581 641133845 640860975
1858.1 640860975 640628159 640387297 639669478 637937725 636246204 636646688 638260722 639005244 638910711
1876.5 638910711 638678730 638407290 638028204 637506366 636595905 635331690 634656191 634562910 634334981 634292543
1896.9 634292543 634559810 634777129 634890914 634910583 634720802 634536386 634741902 634998381 634514391 633587420
1917.3 633587420 633444428 633834064 634116411 634578228 634936213 634959340 634888530 634795070 634730518 634617627
1937.7 634617627 634069324 633209407 633020520 633546412 633947790 634036183 633955359 633788824 633669376 633603334
1958.1F33603334j13010j45018k78592l79265m9054K87354J64151p6175j40071r6798
1978.5F32776856o2942q2195j52409k66254m04417m93706k07185K19821J23442k06292
1998.8F31244719l29316l78012m52042n45919o96361q64744j049161j162648q18372
2017.2F24948144j39356K51413L25918L36945L03924K48730K08318J72854J22011P5519
2037.6F26854420L2365L5644J13070J30117O5147K1458K9564M6968K1279m3571r2923
2060F27213538j37568j63853n0724N9009n543p3672o8008p2360q4758r2626j00851
2082.5F26422584j00911r9361j02162j07169r2983j05441j86443k33233k08795k14875
2102.9F24971211k56240k44618j83880j35780j12891r9480r9063j04427j18911j62483
$$ plain form
1958.1 633603334 633490324 633345306 633066714 632687449 632638395 632925749 633089900 633013725 632873654 632776856
1978.5 632776856 632713914 632631719 632479310 632213056 631808639 631314933 631107748 631327569 631451011 631244719
1998.8 631244719 630915403 630537391 630085349 629539430 628843069 627978325 626929164 625766516 624948144
2017.2 624948144 624808788 625060201 625386119 625723064 626026988 626275718 626484036 626656890 626778901 626854420
2037.6 626854420 626886785 626922429 627035499 627165616 627230763 627252221 627281785 627328753 627350032 627306461 627213538
2060 627213538 627075970 626912117 626861393 626920402 626914859 626841187 626773179 626700819 626616061 626523435 626422584
2082.5 626422584 626321673 626222312 626120150 626012981 625919998 625814557 625628114 625394881 625186086 624971211
2102.9 624971211 624714971 624470353 624286473 624150693 624037802 623938322 623839259 623734832 623615921 623453438
2123.3F23453438k02894k15113k18034k40862k90275l06904k57850k19345k10822j91569
2143.7F21099770j67727j22726m6969O437J2756J5318K0445L2603O9440P7367J5735
2166.1F21012449l2246k742j1921p9214j13070j17362j07407q4460m9174j9491q34
2188.5F20394528J0431k3008p6711r0897p6413m5002k5451l5286o9618j37925j66893
2211F19657755j14799q1241j03831j05858q2076p8916p0870m6015o2644j30236k06650
2233.4F18574619k87592l73960m47571m00245k30432j21176j16765j51992j93894k06471
2253.8F16044521j93119j82569j88708k22027k66314l01719l10957k97964k93135k80857
2274.2F13507152k18273j05083j9073k5153j08302k15888k96950l19720l13282l33905
$$ plain form
2123.3 623453438 623250544 623035431 622817397 622576535 622286260 621979356 621721506 621502161 621291339 621099770
2143.7 621099770 620932043 620809317 620762348 620768785 620781541 620796859 620817304 620849907 620919347 620996714 621012449
2166.1 621012449 620980203 620977461 620965540 620886326 620773256 620655894 620548487 620464027 620414853 620395362 620394528
2188.5 620394528 620404959 620381951 620305240 620214343 620137930 620092928 620067477 620032191 619962573 619824648 619657755
2211 619657755 619542956 619461715 619357884 619252026 619169950 619091034 619020164 618974149 618911505 618781269 618574619
2233.4 618574619 618287027 617913067 617465496 617065251 616834819 616713643 616596878 616444886 616250992 616044521
2253.8 616044521 615851402 615668833 615480125 615258098 614991784 614690065 614379108 614081144 613788009 613507152
2274.2 613507152 613288879 613183796 613164723 613139570 613031268 612815380 612518430 612198710 611885428 611551523
2294.6F11551523l72946m39405n01276n14805n85019p38383q50022q55982q15928q46624
2315F05031133j035989j290977j337349j073360p94828p85053q41797o21914k81036
2333.3E96968830k29657l86298m23252l04282K0742J062513K000749J212835o70254
2351.7E99251926j841784j611948j019716n65231l6597N64337J069546J376211J529634
2370.1E98716378J619339J635194J621902J600683J485526J233280Q77559M80116J45435
2388.4F09415412l4213p7605n2452m2856q8930j31429j30534j28746j55449j63078
2408.8F08410120j43766j50741j48773p5161K4020Q7798J35243J58012R8109K4080
2429.2F08418941K2293K9862R715N126J4186P987m17j5974m5419p5102r0539o8784
$$ plain form
2294.6 611551523 611178577 610739172 610237896 609723091 609138072 608399689 607549667 606693685 605877757 605031133
2315 605031133 603995144 602704167 601366818 600293458 599498630 598713577 597871780 597249866 596968830
2333.3 596968830 596739173 596352875 595929623 595625341 595646083 596708596 598709345 599922180 599251926
2351.7 599251926 597410142 595798194 594778478 594213247 594176650 594740987 595810533 597186744 598716378
2370.1 598716378 600335717 601970911 603592813 605193496 606679022 607912302 608789861 609269977 609415412
2388.4 609415412 609381199 609303594 609251142 609208286 609119356 608987927 608857393 608728647 608573198 608410120
2408.8 608410120 608266354 608115613 607966840 607891679 607915699 608003497 608138740 608296752 608394861 608418941
2429.2 608418941 608441234 608471096 608480811 608485937 608500123 608508110 608507693 608491719 608446300 608371198 608280659 608211875
2453.7F08211875n8472q7559j37091j89364j70350j38402k58386m20392l85761k13564
2474.1F06152534o5386p748q3805j54197r5427q3089j68621j89603j73688j79111j69874
2496.5F04781985j63734j88589k33233k55704k62618k92837l13700l02672l02970l58284
2516.9F02107644m80950n77748n56647m70996l43919j60515O258Q0168M4346k3663
2537.3E99623978r4652k70426m93229n83708n20945l81410k28822j55270k27034l27349
2557.7E96341133l28600k90811l01361l40105l67701m18782m79162m95970n05805n20646
2578.1E92292190n31793n54562n68986n87105o26982o64293o74189o69181o55055n77629
2598.5E86182415m95612n16117o02364o56605o80268p56681q49128q76009q48770q05855
$$ plain form
2453.7 608211875 608153403 608065844 607928753 607739389 607569039 607430637 607172251 606751859 606366098 606152534
2474.1 606152534 606087148 606079400 605995595 605841398 605745971 605662882 605494261 605304658 605130970 604951859 604781985
2496.5 604781985 604618251 604429662 604196429 603940725 603678107 603385270 603071570 602768898 602465928 602107644
2516.9 602107644 601626694 601048946 600492299 600021303 599677384 599516869 599523127 599603295 599647641 599623978
2537.3 599623978 599529326 599258900 598765671 598181963 597661018 597279608 597050786 596895516 596668482 596341133
2557.7 596341133 596012533 595721722 595420361 595080256 594712555 594293773 593814611 593318641 592812836 592292190
2578.1 592292190 591760397 591205835 590636849 590049744 589422762 588758469 588084280 587415099 586760044 586182415
2598.5 586182415 585686803 585170686 584568322 583911717 583231449 582474768 581625640 580749631 579900861 579095006
2618.9E79095006q29637r39488j017809j028836j010180r31561p55369m85003k07603
2637.2E71889520m947Q8453M9770n9247j66893k45273l00706l52859l85583l93510
2657.6E70118725l46601k30610j11759l2723L0935J15991J77502K00987K41518K70486
2678E70434451K88725K99573K63929K53439L33429M25040L90888K16424R477j66714
2698.4E72748661k95639l97384m93109n61774n87404n75960n49018n36978n61774o06716
2718.8E67582905o72936p62344q13663q22842p90834o83606n56111m79043m18663l00347
2739.2E61282516j90497j69337j64628j73986k76684m38095o15775q22127r82523j036882
2759.6E56411982j060725j130521j233876j312494j407027j580358j750231j932740
$$ plain form
2618.9 579095006 578265369 577325881 576308072 575279236 574269056 573337495 572582126 572097123 571889520
2637.2 571889520 571884573 571973026 572022796 571963549 571796656 571551383 571250677 570897818 570512235 570118725
2657.6 570118725 569772124 569541514 569429755 569397032 569427967 569543958 569721460 569922447 570163965 570434451
2678 570434451 570723176 571022749 571286678 571540117 571873546 572298586 572689474 572905898 572915375 572748661
2698.4 572748661 572453022 572055638 571562529 571000755 570413351 569837391 569288373 568751395 568189621 567582905
2718.8 567582905 566909969 566147625 565333962 564511120 563720286 563036680 562480569 562001526 561582863 561282516
2739.2 561282516 561092019 560922682 560758054 560584068 560307384 559869289 559253514 558431387 557448864 556411982
2759.6 556411982 555351257 554220736 552986860 551674366 550267339 548686981 546936750 545004010
2775.9E45004010k213895k503276k732694k925515l099859l292203l482163l619969
2792.2E21134436l727734l827989l925622m069030m271149m473746m686535m993796
2808.6D87158835n390644n868167o465941p164628p963657q921534j0117561j1634349
2824.9D23632354j3548375j5950322j9119113k3575992k9685110l7314444m5601577
2839.1B38837421n2068263n2379847m3432459k7099513r383235M578203J4086146K1390840
2855.5I4529293K7950794L2953404L4620717L1945497K5417313J7066225R534627M051984
2871.8B78069854l79086n113363j0025114j4006033j6335339j7200321j7093703j6261712
2888.1A81655183j4893949j3230025j1530310j0027737q888267q258804q209072q723416
$$ plain form
2775.9 545004010 542790115 540286839 537554145 534628630 531528771 528236568 524754405 521134436
2792.2 521134436 517406702 513578713 509653091 505584061 501312912 496839166 492152631 487158835
2808.6 487158835 481768191 475900024 469434083 462269455 454305798 445384264 435266703 423632354
2824.9 423632354 410083979 394133657 375014544 351438552 321753442 284438998 238837421
2839.1 238837421 186769158 134389311 90956852 63857339 54474104 59052307 73138453 94529293
2855.5 94529293 122480087 155433491 190054208 221999705 247417018 264483243 274017870 278069854
2871.8 278069854 277690768 272577405 262552291 248546258 232210919 215010598 197916895 181655183
2888.1 181655183 166761234 153531209 142000899 131973162 123084895 114826091 106617019 97893603
2904.4I7893603r720296j0829001j1275947j0318868p740121m115250n85765K156053
2920.7D5464408M305914O291616Q409396J0868952J3824381J7342053K1367967K5680676
2937A53555363K9750035L2780751L3743680L1670600K6563644J9946695J4204502J1162221
2953.4C53377491J0974080J2499302J4666319J6887605J8701762J9678235J9519866
2967.6D66304660J8278479J6354204J4132261J1862278R806812Q110702O732106N594373
2984E57175875M624903L847480L295839K843499K431988K085984J774192J540184J405478
3002.3E81025422J289427J141786J010776R31025Q40008P70807P44701O75559O03437
3020.7E89032948N73993N69880O02722O19769O32286P43210Q76129R10938R00209Q70287
$$ plain form
2904.4 97893603 88173307 77344306 66068359 55749491 48009370 43894120 43308355 45464408
2920.7 45464408 49770322 56061938 64471334 75340286 89164667 106506720 127874687 153555363
2937 153555363 183305398 216086149 249829829 281500429 308064073 328010768 342215270 353377491
2953.4 353377491 364351571 376850873 391517192 408404797 427106559 446784794 466304660
2967.6 466304660 484583139 500937343 515069604 526931882 536738694 544849396 551581502 557175875
2984 557175875 561800778 565648258 568944097 571787596 574219584 576305568 578079760 579619944 581025422
3002.3 581025422 582314849 583456635 584467411 585398436 586238444 587009251 587753952 588429511 589032948
3020.7 589032948 589606941 590176821 590779543 591399312 592031598 592774808 593650937 594561875 595462084 596332371
3041.1E96332371P89821P38085P40587P08044O35028N34117M61996M74512M63128L52264
3061.5F02229953K35855K16782K78414L33667L24189K56956K01881K03550K73108L86059
3081.9F04940414M45903M71473N36143O09279O89566P58469P99299P77542O63400N85615
3102.2F11277103N43774M22299K81095K13802J84417J40845J33634J73330J60039Q4758
3122.6F13615096N6386J00016J43051R1732n484L5167J27673O4850j4424K8729N9188
3145.1F14301980L6001K4855J9312j8656n2393k1458L0637L7313m948m291J2398m0770
3169.6F14319980p4029n2929n4776q8156n5730K265m9412q2076L874K8909k9028o6042
3194F13802850p7963j8298P4327R5069O1989R000n4836o2585k8789L696L2246O735
$$ plain form
3041.1 596332371 597122192 597860277 598600864 599308908 599943936 600478053 600940049 601414561 601877689 602229953
3061.5 602229953 602465808 602682590 602961004 603294671 603618860 603875816 604077697 604281247 604554355 604940414
3081.9 604940414 605386317 605857790 606393933 607003212 607692778 608451247 609250546 610028088 610691488 611277103
3102.2 611277103 611820877 612243176 612524271 612738073 612922490 613063335 613196969 613370299 613530338 613615096
3122.6 613615096 613671482 613771498 613914549 614006281 614000797 614035964 614163637 614228487 614214063 614242792 614301980
3145.1 614301980 614337981 614362836 614382148 614363492 614311099 614289641 614320278 614357591 614352643 614348352 614360750 614319980
3169.6 614319980 614245951 614193022 614138246 614050090 613994360 613996625 613947213 613865137 613869011 613897920 613868892 613802850
3194 613802850 613724887 613706589 613780916 613875985 613937974 613946974 613892138 613829553 613800764 613804460 613836706 613843441
3218.5F13843441L695L2187k9027j02282q2910l6955k9385n7936r3579q5950j03354
3240.9F13257945j92106j92523o9559j9252r6560j73509j31428m9293o9559r7930r3937
3263.4F12072289j04487j21534j60754j79112j92284j96457r1553J0491p1585j66834
3283.8F10798180j01805p0393j64687k10405j55747q2612n4121r6202j46746j49787
3304.2F09565675j69098j74940q6069l6120o6102m4048l516l398q8393k10464j99020
3326.6F08484507r0242n1975j05858j40369q5175n543k0862j05500j36971n9545L8981
3349F07721448K0444m7385p8202q1062n5373l8147m7028m2557o855L7193O2824Q4877
3373.5F07530177J70529K25126J39416J8537l0041K4557J18196J11341M8459Q0585
$$ plain form
3218.5 613843441 613847136 613879323 613850296 613748014 613665104 613628149 613598764 613540828 613447249 613361299 613257945
3240.9 613257945 613065839 612873316 612803757 612784505 612687945 612514436 612383008 612333715 612264156 612166226 612072289
3263.4 612072289 611967802 611846268 611685514 611506402 611314118 611117661 611026108 611036599 610965014 610798180
3283.8 610798180 610696375 610625982 610461295 610250890 610095143 610012531 609958410 609862208 609715462 609565675
3304.2 609565675 609396577 609221637 609135568 609099448 609033346 608989298 608985782 608982384 608893991 608683527 608484507
3326.6 608484507 608394265 608342290 608236432 608096063 608010888 608005345 607984483 607878983 607742012 607682467 607721448
3349 607721448 607741892 607694507 607616305 607535243 607479870 607441723 607394695 607352138 607345283 607382476 607445300 607530177
3373.5 607530177 607700706 607925832 608065248 608083785 608053744 608078301 608196497 608307838 608356297 608436882
3393.9F08436882J15991J20223J63018J40310J05679J24037Q3685M7922N7280N7519
3414.3F09452546N1856l6836q8513L3617J20759P3850j3590n0902J9908P9691O7115
3436.7F09709501K1100j07646j78516j71780j19746J75893M19438L05891Q9467n067
3457.1F10138535N246N4359J41382J57476P9095P9274R1374k324n7042n2631j45078
3479.6F10489666j31070J03593J58846Q9288J56581J14501p5221j17660p510j31547
3500F10649467m04358j50800K47300Q5949j1742K66254L00348J7822k20835l81828
3520.4F10397577m81188l45051j03832J11819L82185L67522M470j52886j9252j26123
3540.8F10035241o08147q43763k77400L72171J87099K1458L56972K59698k20597n66125
$$ plain form
3393.9 608436882 608552873 608673096 608836114 608976424 609082103 609206140 609289825 609337747 609395027 609452546
3414.3 609452546 609504402 609467566 609379053 609412670 609533429 609607279 609593689 609542787 609562695 609642386 609709501
3436.7 609709501 609730601 609622955 609444439 609272659 609152913 609328806 609748244 610054135 610143602 610138535
3457.1 610138535 610143781 610198140 610339522 610496998 610576093 610655367 610746741 610744417 610687375 610634744 610489666
3479.6 610489666 610358596 610462189 610621035 610710323 610866904 610981405 610906184 610788524 610781014 610649467
3500 610649467 610245109 610094309 610341609 610427558 610415816 610682070 610982418 611000240 610779405 610397577
3520.4 610397577 609916389 609571338 609467506 609579325 609961510 610329032 610333502 610180616 610161364 610035241
3540.8 610035241 609427094 608583331 608305931 608678102 608865201 608886659 609243631 609503329 609282732 608716607
3561.1F08716607j154780j949907j141071J304448K005756P49826j48714k28583j76728
3579.5F07976854l45230j060248k114474j665175M36425P30037p15017j194477q93414
3597.9F01155281q44240n24044k98083r08554j096606n8234P17521Q62718M34398l02195
3618.3E99137962P60496K176523Q90791k161622l331125M03762L099144J902640O29723
3636.6F03508294J36554k04027p00354k080799l928899l219784J453996M003108K100885
3655F01068974P89225J643419J417756L61145n66543k175867l251195j616597p74801
3673.3E96895516j132846J926422L948093K591133P76171j285970l241360k101362
3689.6E98375797J759589L075480J696170J09851r29415p76649N17130L60906j589298
$$ plain form
3561.1 608716607 607561827 605611920 604470849 605775297 607781053 608530879 608382165 608153582 607976854
3579.5 607976854 607631624 606571376 604456902 602791727 603228152 603958189 603243172 602048695 601155281
3597.9 601155281 600311041 599786997 599488914 598580360 597483754 597425520 598143041 599005759 599440157 599137962
3618.3 599137962 599898458 602074981 602965772 600804150 597473025 597876787 600975931 602878571 603508294
3636.6 603508294 603644848 603440821 602740467 600659668 596730769 593510985 594964981 598968089 601068974
3655 601068974 601858199 603501618 604919374 605280519 604713976 602538109 599286914 597670317 596895516
3673.3 596895516 595762670 597689092 601637185 604228318 605004489 603718519 600477159 598375797
3689.6 598375797 600135386 603210866 604907036 605016887 604087472 603310823 603827953 604188859 602599561
3708F02599561k574682n63860K472997K445757L48091r69350r23634l52144K95222
3726.4F02777958M74989j132071l208399k585351O24001K760947J325249k412974l324330
3744.7E95300019j192Q0943q59022K135515L558636J594483K02775Q66116R12129l40581
3765.1F03449821q14378m16636P95006J671672O37889r35971j071275J86801N78523
3783.5F04081452K75135N54204M65333j84416j077474j858651j648963j716435j316130
3801.8E97574055Q35598R47356O92248J771748Q08359j745880k716124j430631r70781
3820.2E95765948M51744K547502J678825L13699m79281j191974j398265j723468r46105
3838.5E95018625J276493K265215K029360J259446o83844l700614n101204j65105M545569
$$ plain form
3708 602599561 600024879 599461019 601934016 604379773 604727864 603758514 602834880 602482736 602777958
3726.4 602777958 603252947 602120876 598912477 596327126 596951127 599712074 601037323 598624349 595300019
3744.7 595300019 595298827 595379770 594520748 596656263 600214899 601809382 602012157 602878273 603790402 603449821
3765.1 603449821 602635443 602218807 603013813 604685485 605323374 604387403 603316128 603502929 604081452
3783.5 604081452 604356587 604910791 605376124 605191708 604114234 602255583 600606620 598890185 597574055
3801.8 597574055 598409653 599357009 600049257 601821005 602629364 600883484 598167360 596736729 595765948
3820.2 595765948 596217692 598765194 600444019 600757718 600278437 599086463 597688198 595964730 595018625
3838.5 595018625 596295118 598560333 600589693 601849139 601165295 597464681 592363477 592198372 596743941
3856.9E96743941L156364J28448j418829r49859l81410j002133k39730J395881J540363
3875.2E98973036O44386q90136q49247M709j47879O34968O41763j25349P72179Q43882
3895.6F00502312j123011k397358j577199K48313K026439K467751J362741K08915n46992
3914F01171911j084447o93977K86937M94361J49548L11434L74138j93476j01924Q37445
3934.4F01551950J016796K52902m60327n11467M7386J22845j90139J64688O54339N03362
3954.8F03152335M5418j50501q1361O3837J07706l7075j63078j93000j65105q1420
3975.2F02497756K683J2159r417K5749Q4400P9691k3126r1017l4213R8765J92702
3997.6F02836132
$$ plain form
3856.9 596743941 599900305 600028753 598609924 597660065 597278655 596276522 596036792 597432673 598973036
3875.2 598973036 599617422 598727286 597878039 597882748 597734869 598369837 599011600 598886251 599658430 600502312
3895.6 600502312 599379301 596981943 595404744 595653057 597679496 600147247 601509988 601718903 601171911
3914 601171911 600087464 599393487 599680424 600174785 600324333 600635767 601009905 600816429 600714505 601551950
3934.4 601551950 602568746 602821648 602361321 601849854 601897240 602020085 601829946 601994634 602648973 603152335
3954.8 603152335 603197753 603047252 602965891 603029728 603137434 603100359 602937281 602744281 602579176 602497756
3975.2 602497756 602500439 602512598 602503181 602528930 602613330 602693021 602669895 602578878 602544665 602643430 602836132
3997.6 602836132
##END=$$ End of the data block
