##TITLE=DI_15-0719127-0 - Pizza - Poliester $$ Begin of the data block
##JCAMP-DX=5.00 $$ ACD/SpecManager v 10.08
##SPECTROMETER/DATA SYSTEM=Alpha
##DATE=09 Jun 2015 18:00:42
##DATA TYPE=INFRARED SPECTRUM
##DATA CLASS=XYDATA
##ORIGIN=
##OWNER=
##NPOINTS=1667
##FIRSTX=599.64648438
##LASTX=3997.64306641
##MAXX=3997.64306641
##MINX=599.64648438
##MAXY=0.81581551
##MINY=0.03134046
##XFACTOR=1.0000000000
##YFACTOR=1.000000000000000e-9
##FIRSTY=0.78859758
##DELTAX=2.03961372
##XUNITS=1/CM
##YUNITS=ARBITRARY UNITS
##XYDATA=(X++(Y..Y))
$$ plain form
599.6 788597584 788411558 788286865 787976980 787716866 787409186 786843479 786181986 785732448 785679638 785718560
620 785718560 785300970 784245670 782619417 778979778 772986233 770163953 774132609 780023754 783095300
638.4 783095300 783811212 783793807 783523142 783066332 782518804 781908810 781415582 781154037 780849695 780255139
658.8 780255139 779547811 778807998 777381778 774353802 771709800 771421075 770597458 767903626 764101088
677.2 764101088 761116266 760587156 761982441 763423562 763752043 763064682 761533797 758857310 754389822
695.5 754389822 747364104 737790823 727167070 717334926 708938420 701621473 695073783 688121617
711.8 688121617 676280499 651337266 601717114 514084876 389133632 262449741 183468759
726.1 183468759 168452844 197784454 252372652 328284115 426878721 539898574 644547820
$$ packed form
599.6G88597584j86026j24693l09885k60114l07680n65707o61493m49538n2810L8922
620G85718560m17590j055300j626253l639639n993545k822280L968656N891145L071546
638.4G83095300P15912j7405k70665m56810n47528o09994m93228k61545l04342n94556
658.8G80255139p07328p39813j426220l027976k644002k88725q23617k693832l802538
677.2G64101088k984822n29110J395285J441121L28481o87361j530885k676487m467488
695.5G54389822p025718r573281j0623753r832144q396506p316947o547690o952166
711.8F88121617j1841118k4943233m9620152q7632238j24951244j26683891p8980982
726.1A83468759j5015915K9331610N4588198P5911463R8594606J13019853J04649246
$$ plain form
740.4 644547820 720036805 763577402 785352826 795748770 800643146 802735209 803598583 804143131
756.7 804143131 804261148 803501248 802017987 800106883 797812521 795373380 793064237 790895998 788839936
775.1 788839936 786713541 783973813 780046046 774304569 765767336 753598154 738239944 723564744
791.4 723564744 717523515 725047946 739626765 749821961 752456129 751601398 750378013 749513090
807.7 749513090 749135613 749148846 749378443 749812424 750366151 750784934 750636637 749547660 747563481 744810402
828.1 744810402 741170347 736526012 731141090 725758910 721186340 717906058 715883136 714651942
844.4 714651942 713921249 713912547 714753151 716026366 717302322 718134761 717463911 713548243 704251170
862.8 704251170 687343180 661155760 626906574 592722416 571803153 571399570 587549150 611408830
$$ packed form
740.4F44547820P5488985M3540597K1775424J0395944M894376K092063Q63374N44548
756.7H04143131J18017p59900j483261j911104k294362k439141k309143k168239k056062
775.1G88839936k126395k739728l927767n741477q537233j2169182j5358210j4675200
791.4G23564744o041229P524431J4578819J0195196K634168q54731j223385q64923
807.7G49513090l77477J3233K29597M33981N53727M18783j48297j088977j984179k753079
828.1G44810402l640055m644335n384922n382180m572570l280282k022922j231194
844.4G14651942p30693q702Q40604J273215J275956Q32439o70850l915668r297073
862.8G04251170j6907990k6187420l4249186l4184158k0919263m03583J6149580K3859680
$$ plain form
879.1 611408830 635416687 655174851 669485569 678958535 684454739 686772466 686979592 686539769
895.4 686539769 687280118 691083074 699184716 711395085 726116836 741172016 754599154 765244365
911.7 765244365 772901833 777988434 781182408 783080637 784025371 784239650 783999443 783547997 782933950
930.1 782933950 782165349 781403601 780699432 779884994 778941154 777991235 776994824 775822937 774462402
948.4 774462402 772891223 770969629 768586814 765683472 762082994 757508636 751784682 744942784
964.7 744942784 737364352 730059445 724627972 722420990 723585904 726981640 731067896 734858930
981.1 734858930 737966955 740161002 741369367 741870224 741939545 741350234 739646792 736715615 732514977
999.4 732514977 726692855 718328357 705278695 683972001 648332596 587825358 499610931 412470788
$$ packed form
879.1F11408830K4007857J9758164J4310718R472966N496204K317727K07126m39823
895.4F86539769P40349L802956Q101642J2210369J4721751J5055180J3427138J0645211
911.7G65244365P657468N086601L193974J898229R44734K14279k40207m51446o14047
930.1G82933950p68601p61748p04169q14438r43840r49919r96411j171887j360535
948.4G74462402j571179j921594k382815k903342l600478m574358n723954o841898
964.7G44942784p578432p304907n431473k206982J164914L395736M086256L791034
981.1G34858930L108025K194047J208365N00857O9321n89311j703442k931177m200638
999.4G32514977n822122q364498j3049662k1306694l5639405o0507238q8214427q7140143
$$ plain form
1015.7 412470788 374426812 401979059 464312404 522342861 560200989 578941762 584234953
1030 584234953 582361877 577016890 569353044 560510993 552804291 549098969 551581025 560917616 576116323
1048.4 576116323 594976068 614883244 633225679 647545159 656250656 659025252 656534076 649714828
1064.7 649714828 639189482 624962866 606271088 581635296 549418688 509018362 462005824
1079 462005824 412136793 363331825 317270219 273346305 231014073 191581979 157707185 131894767
1095.3 131894767 115564279 108975135 111676969 122970589 141526297 164011747 183815211 193745300
1111.6 193745300 191838473 182779476 173782438 170592725 175916955 189324096 208100080 228741467
1127.9 228741467 248968795 268892854 290310055 315070480 344189018 378133953 417105138
$$ packed form
1015.7D12470788l8043976K7552247O2333345N8030457L7858128J8740773N293191
1030E84234953j873076n344987p663846q842051p706702l705322K482056R336591J5198707
1048.4E76116323J8859745J9907176J8342435J4319480Q705497K774596k491176o819248
1064.7F49714828j0525346j4226616j8691778k4635792l2216608m0400326m7012538
1079D62005824m9869031m8804968m6061606m3923914m2332232l9432094l3874794k5812418
1095.3A31894767j6330488o589144K701834J1293620J8555708K2485450J9803464R930089
1111.6A93745300j906827r058997q997038l189713N324230J3407141J8775984K0641387
1127.9B28741467K0227328J9924059K1417201K4760425K9118538L3944935L8971185
$$ plain form
1142.2 417105138 460422397 505790293 549923182 589990616 624156058 651316106 671257138
1156.5 671257138 684753954 692980766 696547210 694873989 686819136 672911108 657238901 645868599
1172.8 645868599 643005073 648922980 660954773 675441146 688802958 698509753 703883410 705521941
1189.1 705521941 704159558 700465798 695125759 688688815 681641221 674358904 666960657 659377992
1205.4 659377992 651373208 642506003 632363617 620665431 607033908 591038346 572343409 550516367
1221.7 550516367 524714768 493424833 454311669 405098885 345742524 280352324 216680869
1236 216680869 162669942 122697681 96491352 80973491 72545625 68314977 66234834 64779900
1252.3 64779900 62728390 59407946 55224199 51532887 49714494 50377652 53650491 59455514 67324214
$$ packed form
1142.2D17105138M3317259M5367896M4132889M0067434L4165442K7160048J9941032
1156.5F71257138J3496816Q226812L566444j673221q054853j3908028j5672207j1370302
1172.8F45868599k863526N917907J2031793J4486373J3361812R706795N373657J638531
1189.1G05521941j362383l693760n340039o436944p047594p282317p398247p582665
1205.4F59377992q004784q867205j0142386j1698186j3631523j5995562j8694937k1827042
1221.7E50516367k5801599l1289935l9113164m9212784n9356361o5390200o3671455
1236B16680869n4010927l9972261k6206329j5517861q427866m230648k080143j454934
1252.3F4779900k051510l320444m183747l691312j818393O63158L272839N805023P868700
$$ plain form
1270.7 67324214 75990982 83705619 89378588 93234502 96398532 100013919 104959264 112001970
1287 112001970 122164689 136639237 156817079 184319869 220244288 263158560 307974219 349177808
1303.3 349177808 385750026 420833588 456180245 490340590 521708190 549859345 575764239
1317.6 575764239 601720095 628173709 652777791 672837436 685834348 689052165 679619551 656078458
1333.9 656078458 621791244 587534547 569096088 575929761 603778839 641301274 676848471
1348.2 676848471 703433156 719782114 727546811 728671491 721732855 703465939 676112056 646427572
1364.5 646427572 617147267 592748582 580352604 580475986 593240082 615343451 637741983 655611932
1380.8 655611932 666712880 668491423 664600313 662018359 656033993 639501810 618100286 598269403
$$ packed form
1270.7F7324214Q666768P714637N672969L855914L164030L615387M945345P042706
1287A12001970J0162719J4474548K0177842K7502790L5924419M2914272M4815659M1203589
1303.3C49177808L6572218L5083562L5346657L4160345L1367600K8151155K5904894
1317.6E75764239K5955856K6453614K4604082K0059645J2996912L217817r432614k3541093
1333.9F56078458l4287214l4256697j8438459O833673K7849078L7522435L5547197
1348.2F76848471K6584685J6348958P764697J124680o938636j8266916k7353883k9684484
1364.5F46427572k9280305k4398685j2395978J23382J2764096K2103369K2398532J7869949
1380.8F55611932J1100948J778543l891110k581954n984366j6532183k1401524j9830883
$$ plain form
1397.1 598269403 576227903 546865404 502113283 441566557 387309730 368979126 405712873
1411.4 405712873 485987812 569505692 631019294 677869618 712846875 730817616 736453354
1425.7 736453354 731310248 717179596 700251400 677506506 649679720 635386229 635389686 634269476
1442 634269476 629044950 620866895 613401234 609939158 605187416 593646646 584296048 603407741
1458.3 603407741 640642822 667374134 685674429 706558228 719739497 714885950 707991183 718999386
1474.7 718999386 739820182 757267714 767942309 773725688 772571862 762317061 753159523 757981837
1491 757981837 764710188 754409313 732786953 712609589 686065078 647279561 612034082 623085260
1507.3 623085260 673894227 713280320 728758216 726286948 718125224 709409297 704349875 710859179
$$ packed form
1397.1E98269403k2041500k9362499m4752121o0546726n4256827j8330604L6733747
1411.4D05712873Q0274939Q3517880O1513602M6850324L4977257J7970741N635738
1425.7G36453354n143106j4130652j6928196k2744894k7826786j4293491L457j120210
1442F34269476n224526q178055p465661l462076m751742j1540770r350598J9111693
1458.3F03407741L7235081K6731312J8300295K0883799J3181269m853547o894767J1008203
1474.7G18999386K0820796J7447532J0674595N783379j153826j0254801r157538M822314
1491G57981837O728351j0300875k1622360k0177364k6544511l8785517l5245479J1051178
1507.3F23085260N0808967L9386093J5477896k471268q161724q715927n059422O509304
$$ plain form
1523.6 710859179 720605314 730039120 736553133 733113527 730802596 732722580 718175769 695609331
1539.9 695609331 701616943 725839198 746764898 756440461 756481826 752110004 740815222 716855824
1556.2 716855824 691996932 708238602 740931153 752319396 746805847 733457923 723954558 715564311
1572.6 715564311 692700982 671358049 677971840 700425386 724965155 745320737 757413149
1586.8 757413149 762299359 763342738 762610912 761677086 761301637 759745061 756155908 752137601 747652769
1605.2 747652769 741297305 734902859 729932845 722071350 712231755 716646075 731155038 734304965
1621.5 734304965 731557965 734217644 738415420 742420375 739398122 721384108 707360625 719026804
1637.8 719026804 735099554 737725735 724573076 704893589 700090230 697705209 678443432 677929461
$$ packed form
1523.6G10859179R746135R433806O514013l439606k310931J919984j4546811k2566438
1539.9F95609331O007612K4222255K0925700R675563M1365m371822j1294782k3959398
1556.2G16855824k4858892J6241670L2692551J1388243n513549j3347924r503365q390247
1572.6G15564311k2863329k1342933O613791K2453546K4539769K0355582J2092412
1586.8G57413149M886210J043379p31826r33826l75449j556576l589153m018307m484832
1605.2G47652769o355464o394446m970014p861495r839595M414320J4508963L149927
1621.5G34304965k747000K659679M197776M004955l022253j8014014j4023483J1666179
1637.8G19026804J6072750K626181j3152659j9679487m803359k385021j9261777n13971
$$ plain form
1654.1 677929461 704547644 717589736 710924625 698439181 692369103 683491945 664350152 650692225
1670.5 650692225 645589352 637372077 631324589 625891685 608965874 581938207 567556858 574772358
1686.8 574772358 578921676 572668791 555678010 524430752 488456011 451230556 410759747 372662246
1703.1 372662246 322937906 259264767 195745364 137390330 89802898 56938346 38952287
1717.4 38952287 32634795 31340457 31920262 33839248 37221957 42208403 49956240 65715484
1733.7 65715484 92715271 129313380 184902966 261883497 348386914 432522923 504746437
1748 504746437 567358434 624205709 666595161 692816675 711314142 723977983 735616148 748680770
1764.3 748680770 754134417 750649035 744150758 744957328 758915722 772500277 776968479 777830780
$$ packed form
1654.1F77929461K6618183J3042092o665111j2485444o070078q877158j9141793j3657927
1670.5F50692225n102873q217275o047488n432904j6925811k7027667j4381349P215500
1686.8E74772358M149318o252885j6990781l1247258l5974741l7225455m0470809l8097501
1703.1C72662246m9724340o3673139o3519403n8355034m7587432l2864552j7986059
1717.4C8952287o317492j294338N79805J918986L382709M986446P747837J5759244
1733.7F5715484K6999787L6598109N5589586P6980531Q6503417Q4136009P2223514
1748E04746437O2611997N6847275M2389452K6221514J8497467J2663841J1638165J3064622
1764.3G48680770N453647l485382o498277Q06570J3958394J3584555M468202Q62301
$$ plain form
1780.6 777830780 779980659 782999575 785862267 782947838 773040354 770492792 779381037 785000503
1796.9 785000503 783384323 783010781 788202703 793229759 793336034 790288329 789479971 792387664 794494927
1815.3 794494927 794501126 794371784 792347372 786919534 782723844 780555308 780138612 787097156 795994699
1833.6 795994699 799481153 800807536 800607860 794162691 787226737 791826367 802056253 808698356
1850 808698356 811923087 813307405 813834727 814027131 814331710 814343274 811614156 803999901 797818601
1868.3 797818601 802193999 811118841 815347373 815815508 815586507 815214097 814583361 813483238 810709357
1886.7 810709357 807024598 806780815 808564425 808752000 809126437 809969604 809841692 809028149 807695866
1905 807695866 805486977 803724766 804025412 804401040 801187813 796311677 795221865 796104014 796703875
$$ packed form
1780.6G77830780K149879L018916K862692k914429r907484k547562Q888245N619466
1796.9G85000503j616180l73542N191922N027056J06275l047705q08358K907693K107263
1815.3G94494927O199j29342k024412n427838m195690k168536m16696O958544Q897543
1833.6G95994699L486454J326383j99676o445169o935954M599630J0229886O642103
1850H08698356L224731J384318N27322J92404L04579J1564k729118p614255o181300
1868.3G97818601M375398Q924842M228532M68135k29001l72410o30736j100123k773881
1886.7H10709357l684759k43783J783610J87575L74437Q43167j27912q13543j332283
1905H07695866k208889j762211L00646L75628l213227m876136j089812Q82149N99861
$$ plain form
1923.4 796703875 798507750 799628675 798894465 797518849 796103477 794709384 792661130 788454890
1939.7 788454890 783318639 781728685 783370972 784621656 784928858 784946144 785048902 785646141 786706388
1958.1 786706388 787851334 788921773 789319098 789336503 790915549 793724060 795668125 796595812 797232866
1976.4 797232866 797773123 798212707 798581004 798775434 798510075 797589839 796551943 797406614 800198674
1994.8 800198674 802301705 803194344 803876698 804520667 805003762 805378497 805800498 806264699 806293726 805581391
2015.2 805581391 805265069 806237459 807406664 807938814 808209062 808483124 808727503 808889687 808970869 808990836
2035.6 808990836 808840454 808414161 808100700 808236003 808452666 808454692 808286667 808033407 807756484 807457507
2056 807457507 807045639 806468070 805655599 804768860 804413974 804474175 804278433 803822041 803349257 802892089
$$ packed form
1923.4G96703875J803875J120925p34210j375616j415372j394093k048254m206240
1939.7G88454890n136251j589954J642287J250684L07202J7286J02758N97239J060247
1958.1G86706388J144946J070439L97325J7405J579046K808511J944065R27687O37054
1976.4G97232866N40257M39584L68297J94430k65359r20236j037896Q54671K792060
1994.8H00198674K103031Q92639O82354O43969M83095L74735M22001M64201K9027p12335
2015.2H05581391l16322R72390J169205N32150K70248K74062K44379J62184Q1182J9967
2035.6H08990836j50382m26293l13461J35303K16663K026j68025k53260k76923k98977
2056H07457507m11868n77569q12471q86739l54886O0201j95742m56392m72784m57168
$$ plain form
2076.4 802892089 802468121 802117467 801815391 801481545 801067173 800635219 800372005 800292492 800157130 799910188
2096.8 799910188 799691200 799565494 799487233 799384415 799281418 799220800 799141109 798985302 798880935 798939824
2117.1 798939824 799060166 799182415 799327314 799460590 799568474 799663067 799753428 799823582 799853146 799901843
2137.5 799901843 800022006 800179243 800325930 800481617 800684333 800913930 801173270 801482022 801834345 802219868
2157.9 802219868 802593231 802942455 803322792 803732634 804097176 804390788 804640472 804870248 805085063 805253088
2178.3 805253088 805357695 805440962 805526078 805571079 805590570 805636227 805670202 805649996 805587709 805471361 805277586
2200.8 805277586 804991484 804630280 804306924 804102957 803969920 803857923 803768516 803698123 803650260 803604782
2221.2 803604782 803486407 803278744 803065896 802874684 802649617 802383661 802070498 801702082 801298141 800873995
$$ packed form
2076.4H02892089m23968l50654l02076l33846m14372m31954k63214p9513j35362k46942
2096.8G99910188k18988j25706p8261j02818j02997o0618p9691j55807j04367N8889
2117.1G98939824J20342J22249J44899J33276J07884R4593R0361P0154K9564M8697
2137.5G99901843J20163J57237J46687J55687K02716K29597K59340L08752L52323L85523
2157.9H02219868L73363L49224L80337M09842L64542K93612K49684K29776K14815J68025
2178.3H05253088J04607Q3267Q5116M5001J9491M5657L3975k0206o2287j16348j93775
2200.8H05277586k86102l61204l23356k03967j33037j11997q9407p0393m7863m5478
2221.2H03604782j18375k07663k12848j91212k25067k65956l13163l68416m03941m24146
$$ plain form
2241.6 800873995 800427675 799885452 799198687 798428833 797663987 796968639 796379983 795905471 795553327 795331001
2262 795331001 795199215 795094192 795002341 794920325 794784248 794563293 794310510 794119835 794034898 794099987 794393957
2284.4 794393957 794880688 795473576 796163499 796935976 797722876 798438787 798985362 799373031 799652338 799735546
2304.8 799735546 799561918 799239099 798908174 798589230 798152387 797409356 796423852 795558572 795018435 794642508
2325.2 794642508 794240832 793895185 793783605 793786883 793641686 793375552 793178678 793124020 793318510 794163346
2345.6 794163346 795008659 794471860 792559028 790396690 788687170 787435055 786625743 786224186 786271870
2363.9 786271870 786777973 787543416 788445711 789500892 790567577 791549087 792537808 793497562 794258237
2382.3 794258237 794770122 795101285 795318723 795454323 795573711 795747638 795969546 796203673 796449184 796718955
$$ packed form
2241.6H00873995m46320n42223o86765p69854p64846o95348n88656m74512l52144k22326
2262G95331001j31786j05023r1851q2016j36077k20955k52783j90675q4937O5089K93970
2284.4G94393957M86731N92888O89923P72477P86900P15911N46575L87669K79307Q3208
2304.8G99735546j73628l22819l30925l18944m36843p43031r85504q65280n40137l75927
2325.2G94642508m01676l45647j11580L278j45197k66134j96874n4658J94490Q44836
2345.6G94163346Q45313n36799j912832k162338j709520j252115q09312m01557M7684
2363.9G86271870N06103P65443R02295J055181J066685R81510R88721R59754P60675
2382.3G94258237N11885L31163K17438J35600J19388J73927K21908K34127K45511K69771
$$ plain form
2402.7 796718955 797027469 797399938 797773242 798072219 798354685 798673630 799010336 799359441 799726069 800115108
2423.1 800115108 800503373 800838888 801156998 801520467 801887631 802173555 802375376 802573323 802794576 802988291
2443.5 802988291 803129137 803236842 803327322 803422332 803521872 803577006 803571045 803522885 803430140 803348124 803320527
2465.9 803320527 803248048 803090572 802915931 802750528 802588999 802435219 802287400 802099824 801853061 801559627
2486.3 801559627 801243484 800963819 800702214 800421774 800150335 799906135 799683392 799461126 799239099 799053729
2506.7 799053729 798897147 798748076 798642993 798547983 798408031 798256397 798100531 797947049 797826827 797748744
2527.1 797748744 797704101 797667503 797646224 797634125 797598064 797580659 797591209 797561884 797508657 797498465 797513902
2549.5 797513902 797512889 797511935 797510207 797518969 797577381 797658801 797733665 797816336 797881603 797900140 797899187 797910452 797955155
$$ packed form
2402.7G96718955L08514L72469L73304K98977K82466L18945L36706L49105L66628L89039
2423.1H00115108L88265L35515L18110L63469L67164K85924K01821J97947K21253J93715
2443.5H02988291J40846J07705R0480R5010R9540N5134n961m8160r2745q2016k7597
2465.9H03320527p2479j57476j74641j65403j61529j53780j47819j87576k46763k93434
2486.3H01559627l16143k79665k61605k80440k71439k44200k22743k22266k22027j85370
2506.7G99053729j56582j49071j05083r5010j39952j51634j55866j53482j20222p8083
2527.1G97748744m4643l6598k1279j2099l6061j7405J0550k9325n3227j0192J5437
2549.5G97513902j013r54j728Q762N8412Q1420P4864Q2671O5267J8537r53J1265M4703
$$ plain form
2576 797955155 798031032 798113525 798201561 798372567 798665285 798961520 799210727 799491167 799786150 800002217
2596.4 800002217 800177455 800363004 800483584 800510228 800501168 800509751 800525129 800509572 800465286 800394177 800285041
2618.9 800285041 800111115 799866140 799620807 799491048 799557924 799807250 800169051 800581515 800991535 801367581
2639.3 801367581 801691234 801913798 802034914 802126884 802221179 802298427 802353859 802417159 802465498 802456081 802445590
2661.7 802445590 802465498 802473724 802476585 802501023 802522421 802495778 802442729 802402854 802384317 802409351 802461863 802493691
2686.2 802493691 802478313 802457571 802450836 802365482 802205622 802055538 801936686 801832914 801708758 801559150
2706.6 801559150 801403105 801242471 801100731 801005363 800904572 800748944 800556302 800346494 800128043 799881876
2727 799881876 799593747 799310386 799075425 798869729 798680782 798542142 798408151 798170924 797853231 797572494
$$ packed form
2576G97955155P5877Q2493Q8036J71006K92718K96235K49207K80440K94983K16067
2596.4H00002217J75238J85549J20580K6644r060Q583J5378j5557m4286p1109j09136
2618.9H00285041j73926k44975k45333j29759O6876K49326L61801M12464M10020L76046
2639.3H01367581L23653K22564J21116R1970R4295P7248N5432O3300M8339r417j0491
2661.7H02445590J9908Q226K861K4438K1398k6643n3049l9875j8537K5034N2512L1828
2686.2H02493691j5378k0742o735q5354j59860j50084j18852j03772j24156j49608
2706.6H01559150j56045j60634j41740r5368j00791j55628j92642k09808k18451k46167
2727G99881876k88129k83361k34961k05696j88947j38640j33991k37227l17693k80737
$$ plain form
2747.4 797572494 797388911 797241688 797042310 796834767 796696544 796622872 796596289 796597481 796588480 796556175 796519458
2769.8 796519458 796499789 796480775 796411633 796285510 796135664 795950830 795711160 795427501 795095146 794759035
2790.2 794759035 794482231 794228077 793919563 793533623 793122172 792771876 792567134 792524397 792578876 792683899
2810.6 792683899 792776644 792752743 792589903 792345464 792013228 791522324 790900886 790238738 789552987 788802326
2831 788802326 787918448 786870539 785647511 784189105 782388330 780096829 777232170 774078310 771317661
2849.3 771317661 769386888 768123567 767241001 766652107 766310751 766050160 765690148 765162766 764490902
2867.7 764490902 763732135 762882054 761915147 760814488 759491026 757817805 755802929 753701270 751846492
2886.1 751846492 750529945 749992847 750225842 750958383 751903415 752767444 753266811 753349483 753202438 753139377
$$ packed form
2747.4G97572494j83583j47223j99378k07543j38223p3672k6583J192r001l2305l6717
2769.8G96519458j9669j9014o9142j26123j49846j84834k39670k83659l32355l36111
2790.2G94759035k76804k54154l08514l85940m11451l50296k04742m2737N4479J05023
2810.6G92683899R2745k3901j62840k44439l32236m90904o21438o62148o85751p50661
2831G88802326q83878j047909j223028j458406j800775k291501k864659l153860k760649
2849.3G71317661j930773j263321q82566n88894l41356k60591l60012n27382o71864
2867.7G64490902p58767q50081r66907j100659j323462j673221k014876k101659j854778
2886.1G51846492j316547n37098K32995P32541R45032Q64029M99367Q2672j47045o3061
$$ plain form
2906.5 753139377 753443122 754073322 754684806 755066156 755364835 755777836 756280601 756669223 756739557 756463289
2926.8 756463289 755836785 754683256 752766490 749895751 745850086 740341008 733180523 724459648
2943.2 724459648 714597523 704284191 694236875 685021937 677158058 671125233 667250276 665712595
2959.5 665712595 666494429 669294357 673661172 679172933 685407102 691940010 698474050 704805553
2975.8 704805553 710782886 716346920 721467257 726149440 730470359 734503388 738227963 741564393
2992.1 741564393 744567275 747333169 749839604 752125323 754348755 756685913 759158015 761552155
3008.4 761552155 763829529 766318083 769203901 772241116 775048494 777417362 779394388 781142056
3024.7 781142056 782662094 783760965 784530938 785381079 786309063 786961079 787042856 786306322 784615815
$$ packed form
2906.5G53139377L03745O30200O11484L81350K98679M13001N02765L88622P0334k76268
2926.8G56463289o26504j153529j916766k870739m045665n509078p160485q720875
2943.2G24459648r862125j0313332j0047316r214938p863879o032825l874957j537681
2959.5F65712595P81834K799928M366815N511761O234169O532908O534040O331503
2975.8G04805553N977333N564034N120337M682183M320919M033029L724575L336430
2992.1G41564393L002882K765894K506435K285719K223432K337158K472102K394140
3008.4G61552155K277374K488554K885818L037215K807378K368868J977026J747668
3024.7G81142056J520038J098871P69973Q50141R27984O52016Q1777p36534j690507
$$ plain form
3043.1 784615815 781802773 777879953 773604989 770127118 768146038 767855048 768880844 770072579
3059.4 770072579 770370662 769761622 769093096 769072652 769636095 770344317 770838857 770884812 770599544 770607591
3079.8 770607591 771467090 773137450 775248051 777458727 779324114 780273676 780088365 779167056 777968943
3098.2 777968943 776862621 776514709 777208805 778578997 780312657 782199144 783915043 785216093 786190748
3116.5 786190748 786892951 787115633 786999345 786957145 787163019 787662268 788327992 789215922 790509164 791774750
3136.9 791774750 792611241 793181181 793703496 794217527 794689000 795076013 795331895 795526803 795796454 796103835
3157.3 796103835 796316445 796418369 796462476 796486318 796521604 796592474 796656191 796614587 796423972 796286643 796415806
3179.8 796415806 796546757 796449661 796380162 796506524 796650231 796713769 796661437 796498358 796550095 796925664
$$ packed form
3043.1G84615815k813042l922820m274964l477871j981080k90990J025796J191735
3059.4G70072579K98083o09040o68526k0444N63443P08222M94540M5955k85268Q047
3079.8G70607591Q59499J670360K110601K210676J865387R49562j85311r21309j198113
3098.2G77968943j106322l47912O94096J370192J733660J886487J715899J301050R74655
3116.5G86190748P02203K22682j16288m2200K05874M99249O65724Q87930J293242J265586
3136.9G91774750Q36491N69940N22315N14031M71473L87013K55882J94908K69651L07381
3157.3G96103835K12610J01924M4107K3842L5286P0870O3717m1604j90615j37329J29163
3179.8G96415806J30951r7096o9499J26362J43707O3538n2332j63079N1737L75569
$$ plain form
3200.1 796925664 797281861 797406793 797262788 796935022 796692491 796570361 796499610 796465039 796338677 796283126
3220.5 796283126 796395063 796333611 796047628 795806229 795711517 795721471 795762599 795806766 795858145 795820713 795650661
3243 795650661 795641303 795964122 796237886 796154618 795870423 795748532 795823276 795801342 795697808 795689404 795768976
3265.4 795768976 795805156 795617223 795159698 794679761 794539690 794766486 795010388 795038640 794958532 794862092
3285.8 794862092 794667065 794367135 794083476 793902636 793784857 793742537 793865919 794043899 794079185 793860257
3306.2 793860257 793548226 793492138 793685555 793887854 793978393 793928504 793718994 793335259 792845905 792343736
3326.6 792343736 791895747 791523814 791135132 790737271 790590584 790787041 791073263 791320026 791604102 791922510
3347 791922510 792184234 792374909 792532265 792648852 792779148 792943537 793072760 793122411 793195307 793512166
$$ packed form
3200.1G96925664L56197J24932j44005l27766k42531j22130p0751l4571j26362n5551
3220.5G96283126J11937o1452k85983k41399r4712R954M1128M4167N1379l7432j70052
3243G95650661r358L22819K73764q3268k84195j21891P4744k1934j03534q404P9572
3265.4G95768976L6180j87933m57525m79937j40071K26796K43902K8252q0108r6440
3285.8G94862092j95027k99930k83659j80840j17779m2320J23382J77980L5286k18928
3306.2G93860257l12031n6088J93417K02299R0539m9889k09510l83735m89354n02169
3326.6G92343736m47989l71933l88682l97861j46687J96457K86222K46763K84076L18408
3347G91922510K61724J90675J57356J16587J30296J64389J29223M9651P2896L16859
$$ plain form
3367.4 793512166 794070721 794594109 794892430 795076787 795220137 795250356 795113683 794869900 794809043 794911325
3387.8 794911325 794628799 793998659 793668628 793583095 793408036 793129802 792682350 792108417 791390061 790328622
3408.2 790328622 788935959 787413001 785803437 783783793 781116486 778561711 777020931 776031494
3424.5 776031494 774843931 773636222 772935033 772964537 773564816 774578452 775782883 776845336 777674973
3442.9 777674973 778173327 779283822 782152832 785366237 787344873 788478255 789314330 789843082 790280759
3461.2 790280759 791032910 791830063 792467415 793216586 793819904 793996930 794089496 793951452 793014526 792234957
3481.6 792234957 792604804 793076754 793229580 793757915 794042647 793347299 792456627 791816175 790226400
3500 790226400 787865639 787365139 788372278 788190544 787732720 788547575 789275587 788833261 787518203
$$ packed form
3367.4G93512166N58555N23388K98321J84357J43350L0219j36673k43783o0857J02282
3387.8G94911325k82526o30140l30031q5533j75059k78234m47452n73933p18356j061439
3408.2G90328622j392663j522958j609564k019644k667307k554775j540780r89437
3424.5G76031494j187563j207709p01189K9504O00279J013636J204431J062453Q29637
3442.9G77674973M98354J110495K869010L213405J978636J133382Q36075N28752M37677
3461.2G90280759P52151P97153O37352P49171O03318J77026R2566j38044r36926p79569
3481.6G92234957L69847M71950J52826N28335K84732o95348q90672o40452j589775
3500G90226400k360761n00500J007139j81734m57824Q14855P28012m42326j315058
$$ plain form
3518.3 787518203 785224915 782188475 779837072 778804719 779241621 781159878 782592714 782120347 781273842
3536.7 781273842 781176984 779956102 776011288 771739602 771266818 773557782 774619281 775495410 777695537
3555 777695537 778807104 777837932 775423288 769674718 760633826 757987618 767560482 778583169 783080757
3573.4 783080757 783754587 784016490 784475684 783951342 779004514 769346178 764948368 771366179 777066529
3591.7 777066529 776360571 775490224 776706517 777966321 779429615 778437555 771509945 763451993 760297894
3610.1 760297894 759872794 759856999 758141279 755190909 759540677 768939853 769500434 756149113 742928147
3628.5 742928147 749281287 763838053 772311985 776570976 778602123 778592408 775217235 763502300
3644.8 763502300 743503332 731381834 742679060 761223316 769487679 774403572 783119202 789519727
$$ packed form
3518.3G87518203k293288l036440k351403j032353M36902J918257J432836m72367q46505
3536.7G81273842r6858j220882l944814m271686m72784K290964J061499Q76129K200127
3555G77695537J111567r69172k414644n748570r040892k646208R572864J1022687M497588
3573.4G83080757O73830K61903M59194n24342m946828r658336m397810O417811N700350
3591.7G77066529p05958q70347J216293J259804J463294r92060o927610q057952l154099
3610.1G60297894m25100j5795j715720k950370M349768R399176N60581j3351321j3220966
3628.5G42928147O353140J4556766Q473932M258991K031147r715l375173j1714935
3644.8G63502300j9998968j2121498J1297226J8544256Q264363M915893Q715630O400525
$$ plain form
3661.1 789519727 791053295 786954343 774441659 760340333 755468667 751562953 748634756 761445761
3677.4 761445761 779589176 790449202 792766869 784836650 770391524 765071690 776500165 791341305
3693.7 791341305 799119592 799198210 794448018 791899145 795293391 795139432 784521461 771463573
3710 771463573 771611571 784988463 795011938 795102715 789989471 785415709 783995211 786182582 787564635
3728.4 787564635 779790878 763675272 753228962 759397089 772958100 775305510 762361050 751690567
3744.7 751690567 752946138 750979602 750128329 763824761 778675973 783086836 784064710 789496243
3761 789496243 793460965 791393757 787836015 787315130 793261588 801387131 802958071 797734559 793965101
3779.4 793965101 796371520 799482703 801371396 804297209 806361794 805227637 799384892 790631592
$$ packed form
3661.1G89519727J533568m098952j2512684j4101326m871666l905714k928197J2811005
3677.4G61445761J8143415J0860026K317667p930219j4445126n319834J1428475J4841140
3693.7G91341305P778287P8618m750192k548873L394246j53959j0617971j3057888
3710G71463573J47998J3376892J0023475R0777n113244m573762j420498K187371J382053
3728.4G87564635p773757j6115606j0446310O168127J3561011K347410j2944460j0670483
3744.7G51690567J255571j966536q51273J3696432J4851212M410863R77874N431533
3761G89496243L964722k067208l557742n20885N946458Q125543J570940n223512l769458
3779.4G93965101K406419L111183J888693K925813K064585j134157n842745q753300
$$ plain form
3795.7 790631592 782701492 774492264 771385908 776850283 781515539 788036764 797476947 798387945
3812 798387945 788110435 777047396 770839155 766211867 771552801 784291685 790865541 791454017
3828.3 791454017 788197517 782218337 775009751 767045438 764649272 771389544 781678855 791669786
3844.6 791669786 796933949 790279210 769474983 749953330 758440971 780455232 790689051 787923634
3861 787923634 781033933 778600216 777525425 773795068 775149763 782649815 790134668 792295635 787212968
3879.3 787212968 783518434 783317208 784187019 788512647 790165484 789818883 794560075 796611011 788433731
3897.7 788433731 776701987 771131217 775444031 787984312 800532162 806519032 806589842 802479148
3914 802479148 796494424 793950438 796023726 797884107 798196435 799528480 800052047 797874510 797603965
$$ packed form
3795.7G90631592p930100q209228l106356N464375M665256O521225R440183R10998
3812G98387945j0277510j1063039o208241m627288N340934J2738884O573856N88476
3828.3G91454017l256500n979180p208586p964313k396166O740272J0289311R990931
3844.6G91669786N264163o654739k0804227j9521653Q487641K2014261J0233819k765417
3861G87923634o889701k433717j074791l730357J354695P500052P484853K160967n082667
3879.3G87212968l694534k01226Q69811M325628J652837l46601M741192K050936q177280
3897.7G88433731j1731744n570770M312814J2540281J2547850N986870P0810m110694
3914H02479148n984724k543986K073288J860381L12328J332045N23567k177537k70545
$$ plain form
3932.3 797603965 801706851 805560291 805633307 802772403 800462723 800797522 801110208 800749302 802218139
3950.7 802218139 804681838 805992603 806139231 805851400 805621266 806035757 806768417 806889355 806423783
3969.1 806423783 805900991 805588663 805646002 805998623 806199968 806178153 806295335 806515098 806402087 805980563
3989.5 805980563 805717409 805744052 806026816 806536496
3997.6 806536496
$$ packed form
3932.3G97603965M102886L853440P3016k860904k309680L34799L12686l60906J468837
3950.7H02218139K463699J310765J46628k87831k30134M14491P32660J20938m65572
3969.1H06423783n22792l12328N7339L52621K01345k1815J17182K19763j13011m21524
3989.5H05980563k63154K6643K82764N09680
3997.6H06536496
##END=$$ End of the data block
