##TITLE=DI_15-0719127-0 - Pizza - PE $$ Begin of the data block
##JCAMP-DX=5.00 $$ ACD/SpecManager v 10.08
##SPECTROMETER/DATA SYSTEM=Alpha
##DATE=09 Jun 2015 17:56:40
##DATA TYPE=INFRARED SPECTRUM
##DATA CLASS=XYDATA
##ORIGIN=
##OWNER=
##NPOINTS=1667
##FIRSTX=599.64648438
##LASTX=3997.64306641
##MAXX=3997.64306641
##MINX=599.64648438
##MAXY=0.55237585
##MINY=0.00445783
##XFACTOR=1.0000000000
##YFACTOR=1.000000000000000e-9
##FIRSTY=0.55237585
##DELTAX=2.03961372
##XUNITS=1/CM
##YUNITS=ARBITRARY UNITS
##XYDATA=(X++(Y..Y))
599.6E52375853k76148P391k5571j30474l14653m59969n21302m83275k81036j53005
$$ 552375853 552099705 552107096 552081525 551951051 551636398 551176429 550655127 550171852 549890816 549737811
620E49737811l76522n71013l29196j17422l47316p30932r03785p93397n63681l28064
$$ 549737811 549361289 548790276 548461080 548343658 547996342 547265410 546361625 545568228 545004547 544676483
640.4E44676483l14534o52611q81970q57473p63297m65870j76072l58045o62684o06418
$$ 544676483 544361949 543709338 542827368 541969895 541206598 540740728 540564656 540206611 539543927 538937509
660.8E38937509o01768j145006k005815j463831j76012n80192j355290j706481j847863
$$ 538937509 538335741 537190735 535184920 533721089 533545077 532964885 531609595 529903114 528055251
679.2E28055251j891256j907229k160311k641678k964198l301978m202307n580723
$$ 528055251 526163995 524256766 522096455 519454777 516490579 513188601 508986294 503405571
695.5E03405571p256955r478986j2189657j5076548j8285900k2760510k9797852m0463627
$$ 503405571 496148616 486669630 474479973 459403425 441117525 418357015 388559163 348095536
711.8C48095536n6227624p3131859o8840489k5056467K5418356L5108775O190226k1873340
$$ 348095536 291867912 218736053 149895564 124839097 150257453 185366228 191556454 169683114
728.1A69683114q90479O1326638R1101572O6817284L4524530J7806440J0938228P976293
$$ 169683114 168792635 230119273 321220845 388038129 422562659 440369099 451307327 459283620
744.5D59283620O573051N805016N255818M741401M146486L377766K328902J216561
$$ 459283620 465856671 471661687 476917505 481658906 485805392 489183158 491512060 492728621
760.8D92728621M09126J16438L36647J043677J764655K044320J940608J706004J545310
$$ 492728621 493137747 493254185 493590832 494634509 496399164 498443484 500384092 502090096 503635406
779.1E03635406J394570J258493J182914J030504P34985M68016K84433K78056M70579
$$ 503635406 505029976 506288469 507471383 508501887 509236872 509704888 509989321 510267377 510737956
797.5E10737956O11007N80072M13120J28686k16603m29094m33802j99497K51889P12454
$$ 510737956 511348963 511929035 512342155 512470841 512254238 511825144 511391342 511191845 511443734 512156188
817.9E12156188R62019R99094R20355Q17180Q43524Q42572O14166L75867K37226M5956
$$ 512156188 513118207 514117301 515037656 515854836 516698360 517540932 518155098 518530965 518768191 518814147
838.3E18814147q6248j34230k83361m55677n16534n05805m98891m33147k35200L457
$$ 518814147 518727899 518593669 518310308 517854631 517338097 516832292 516333401 515900254 515665054 515668511
858.7E15668511J31905J94192K51532K30134J82926J31369K2650j54972m45784p49230
$$ 515668511 515800416 515994608 516246140 516476274 516659200 516790569 516813219 516658247 516212463 515463233
879.1E15463233j039982j447499j695931j362919m31300N84126J037955R08911N37038
$$ 515463233 514423251 512975752 511279821 509916902 509485602 510069728 511107683 512016594 512553632
897.4E12553632N5433o02484j575768k530456k236783k07544J831711K171695J297355
$$ 512553632 512609065 512006581 510430813 507900357 505663574 505456030 507287741 509459436 510756791
915.8E10756791N71787L40402J76370o3479k88963m32968m23491l21746k58207k78235
$$ 510756791 511328578 511668980 511845350 511781871 511492908 511059940 510636449 510314703 510056496 509778261
936.2E09778261l18289k85089j96218j44839j68324k36750l04162l50058m00484m92215
$$ 509778261 509459972 509174883 508978665 508833826 508665502 508428752 508124590 507774532 507374048 506881833
956.6E06881833n89669o22332n75840m23670j51992J19984K33233J73807O7532n7995
$$ 506881833 506292164 505669832 505093992 504670322 504518330 504638314 504871547 505045354 505112886 505054891
977E05054891k95997o03914q95142j190126j438618j469374j240879r76771q44151
$$ 505054891 504758894 504154980 503259838 502069712 500631094 499161720 497920841 496944070 496099919
995.3D96099919p95871p53522o93977o44445o64920q50588j165926j551658k018392
$$ 496099919 495304048 494550526 493856549 493212104 492547184 491696596 490530670 488979012 486960620
1013.7D86960620k190382j566410m35114K19524l9190o82622j235425j635909j883835
$$ 486960620 484770238 483203828 482768714 482988238 482949048 482266426 481031001 479395092 477511257
1032D77511257k097398k333284k395808k149880j681984j292407j382709j812607j643657
$$ 477511257 475413859 473080575 470684767 468534887 466852903 465560496 464177787 462365180 460721523
1050.4D60721523r02385r18031j821875k720386l180236l028541k415210j830370j641094
$$ 460721523 459819138 458901107 457079232 454358846 451178610 448150069 445734859 443904489 442263395
1068.8D42263395j767934j794517j393288o17206L33190J302570K054274K437413K521365
$$ 442263395 440495461 438700944 437307656 436690450 437023640 438326210 440380484 442817897 445339262
1087.1D45339262K500356K471566K306670J882851J292735P46519L62187N9188k83689
$$ 445339262 447839618 450311184 452617854 454500705 455793440 456539959 456902146 456961334 456677645
1105.5D56677645o39915r27657j087785j073271r38087p88957o38694m87417m09126
$$ 456677645 456037730 455110073 454022288 452949017 452010930 451221973 450583279 450095862 449686736
1123.8D49686736m47810n05686m02093j13129J00404J22368J62095K68817L68357M64320
$$ 449686736 449238926 448733240 448331147 448218018 448318422 448440790 448602885 448871702 449240059 449704379
1144.2D49704379M25011R4115l14295m17560k14011p242N7042M2439K4586Q2195K12550
$$ 449704379 450129390 450223505 449909210 449491650 449277639 449270397 449327439 449369878 449394464 449476659 449689209
1166.7D49689209K79189J67876k16633p97659q35180J8209O71953M77284O6012j02490
$$ 449689209 449968398 450136274 449919641 449121982 448286802 448305011 448976964 449454248 449520260 449417770
1187.1D49417770j91480m75168r48042j490861j959562k183736k173364k068758j943320
$$ 449417770 449226290 448751122 447803080 446312219 444352657 442168921 439995557 437926799 435983479
1205.4D35983479j848876j976252k344787k669454k738446k531081k061844j475126
$$ 435983479 434134603 432158351 429813564 427144110 424405664 421874583 419812739 418337613
1221.7D18337613r83566n48690j53840P2897K02775M00632N98848P18415Q01831Q20041
$$ 418337613 417354047 416805357 416651517 416724414 416927189 417327821 417926669 418645084 419446915 420266956
1242.1D20266956P96646P76857O57648L69191L7700j97768l67999n51731n90264n57334
$$ 420266956 421063602 421840459 422498107 422867298 422904998 422707230 422339231 421787500 421197236 420639902
1262.5D20639902p86513j123845j311183j268000j027643r11951j072437j273930j418948
$$ 420639902 419853389 418729544 417418361 416150361 415122718 414210767 413138330 411864400 410445452
1280.9D10445452j624376j987785k285093k306700k441644k896578l172129k807409
$$ 410445452 408821076 406833291 404548198 402241498 399799854 396903276 393731147 390923738
1297.2C90923738j981526j048505j68413O42836J662850K949357M116565N005717N349845
$$ 390923738 388942212 387893707 387725294 388368130 390030980 392980337 397096902 402102619 407452464
1315.6D07452464N484760O372034O975651O117612M587800L031373J307875p86633
$$ 407452464 412937224 419309258 426284909 432402521 436990321 440021694 441329569 440542936
1331.9D40542936l561705o927431q840114o763428l312558l326833n642176o938577
$$ 440542936 436981231 430053800 421213686 414450258 411137700 407810867 402168691 395230114
1348.2C95230114o025522l236473k40386P54893j995683p069319r971052r202838p889480
$$ 395230114 389204592 385968119 385727733 386482626 384486943 377417624 367446572 358243734 350354254
1366.6C50354254m653632O52432J656801j136959J334876J3631820K6449711K6858359
$$ 350354254 345700622 346353054 348009855 346872896 348207772 361839592 388289303 415147662
1382.9D15147662J6687393Q742661P366031M331023j703859k977788q7619J867980
$$ 415147662 431835055 440577716 447943747 452274770 450570911 447593123 447505504 449373484
1399.2D49373484K042532j183480l408075k616018l566682m764468m367411n578965
$$ 449373484 451416016 450232536 446824461 444208443 440641761 435877293 431509882 425930917
1415.5D25930917p334381l050536P73728m549861j2010098j9123047k5073439k5467306
$$ 425930917 418596536 415546000 416319728 411769867 399759769 380636722 355563283 330095977
1431.8C30095977k4239481k3460299j6291260r099424r140417j0728285j2385979j4889911
$$ 330095977 305856496 282396197 266104937 257005513 247865096 237136811 224750832 209860921
1448.1B09860921j8724382k4544597k8298482k8447881k5915325k2482038j5761453
$$ 209860921 191136539 166591942 138293460 109845579 83930254 61448216 45686763
1462.4D5686763k942410O304030M842561O9610J1731215N5344030R0461433Q2674370
$$ 45686763 42744353 49048383 53890944 53960554 65691769 121035799 211497232 294171602
1478.7B94171602N3740263L1244277J6160310N867541M001915R853810R985984J871198
$$ 294171602 347911865 379156142 395316452 401183993 405185908 415039718 425025702 426896900
1495.1D26896900q33631M707069N243867m322827j6291916r914458R045512J0338217
$$ 426896900 426063269 430770338 436014205 431691378 415399462 405485004 414530516 424868733
1511.4D24868733L121465k713770m025489m092604k300411L709674N001336M388482
$$ 424868733 427990198 425276428 421250939 417158335 414857924 418567598 423568934 427957416
1527.7D27957416K360403l353417k974897m23044q606643j1924088M425973J4970213
$$ 427957416 430317819 426964402 423989505 423566461 414959818 403035730 407461703 422431916
1544D22431916J4085710Q709371M167110K109408j711488r176313r472996J4544695
$$ 422431916 436517626 445226997 449394107 451503515 449792027 440615714 431142718 445687413
1560.3D45687413K3197651J0701299J291066k545416J370728L257036m399598m046469
$$ 445687413 468885064 479586363 480877429 478332013 479702741 482959777 478560179 474513710
1576.6D74513710N454361N302548Q97259j111776k417296l735393m410565m361093
$$ 474513710 479968071 485270619 486167878 485056102 482638806 478903413 474492848 470131755
1593D70131755l253847j390368k00182N52117J903236K709627K278626K390802K482832
$$ 470131755 466877908 465487540 465287358 465839475 467742711 470452338 472730964 475121766 477604598
1611.3D77604598j246691n619615J88231O626278J546562p35730L212363M205703L920645
$$ 477604598 476357907 470738292 470926523 477552801 479099363 478363633 481575996 485781699 489702344
1629.7D89702344n44846j0096908q457213O800532R680539K050430o833285j0501117
$$ 489702344 489157498 479060590 470603377 477403909 487084448 489134878 482301593 471800476
1646D71800476j337528K2411j0750860R72569J8616289J0693103j191169m243314L48270
$$ 471800476 470462948 470485359 459734499 460707068 479323357 490016460 488825291 484581977 484930247
1664.3D84930247j473278q030057m195213J234531m14133J915783K358466o091714
$$ 484930247 483456969 475426912 471231699 472466230 472052097 473967880 476326346 470234632
1680.7D70234632j3825982n270422R409487P128448R51409n383998j2544662j2010515
$$ 470234632 456408650 451138228 460547715 467676163 468627572 463243574 450698912 438688397
1697D38688397p793635M82708O564558K278984J070469J709283k573669q143276j0902912
$$ 438688397 430894762 431377470 437942028 440221012 441291481 443000764 440427095 432283819 421380907
1715.3D21380907m673004P434219Q695692L115684J95265k197594n640566r068817
$$ 421380907 416707903 424142122 432837814 435953498 436148763 433951169 428310603 419241786
1731.7D19241786p320255L102779M618705J005202L174424M802049L108978J724511
$$ 419241786 411921531 415024310 419643015 420648217 423822641 428624690 431733668 433458179
1748D33458179N170107J2440890J2687236P715524N707949M127324M491835O126762
$$ 433458179 438628286 451069176 463756412 471471936 477179885 481307209 485799044 491925806
1764.3D91925806K004057l086984m642189k50548P819772P843465K412378K39790J101911
$$ 491925806 493929863 490842879 486200690 485950142 493769914 501613379 504025757 504265547 505367458
1782.6E05367458J594484J609146j659333n974710j823157N211859L501535r05216
$$ 505367458 506961942 508571088 506911755 500937045 499113888 504325747 507827282 506922066
1799E06922066k73466L076911L101945K05994j711667m77195J734615J344323J73092
$$ 506922066 506648600 509725511 512827456 513033450 511321783 510844588 512579203 513923526 514096618
1817.3E14096618K54035o28352k564848j921534q80659k95758L826320N034149J688957
$$ 514096618 514350653 513722301 511157453 509235919 508355260 508059502 511885822 516919971 518608928
1835.7E18608928K61545n60641m308701m991174J822055N480110L400505J345515L05236
$$ 518608928 518870473 518309832 514001131 509009957 510832012 516312122 519712627 521058142 521363378
1854E21363378j68384l54528k55167l40403j821220m697084m119873K009332M973829
$$ 521363378 521194994 520840466 520585299 520244896 518423676 513726592 509606719 511616051 516589880
1872.4E16589880K314866O616m36902n58257q68917j372218k624571l618598j896978
$$ 516589880 518904746 518911362 518474460 517916203 517047286 515675068 513050497 509431899 507534921
1890.7E07534921l84807o78182J62363J174510J131773R75728O97910O1632J43468
$$ 507534921 507150114 506471932 506634295 507808805 508940578 509916306 510614216 510675848 510819316
1909.1E10819316J271963J337051q63134k088666L7133J259506J087964J837670J501620
$$ 510819316 512091279 513428330 512565196 510476530 510513663 511773169 512861133 514698803 516200423
1927.5E16200423M34697J00732J10328J47521j53601j352846j969993N7280J896619
$$ 516200423 516635120 516735852 516846180 516993701 516840100 515487254 513517261 513574541 515471160
1945.8E15471160J434148N56707N8532j48654k38J45077Q1301J7405l96133o90937
$$ 515471160 516905308 517462015 517520547 517371893 517371655 517516732 517598033 517615438 517219305 516528368
1966.2E16528368K69651J142264O90222J02281k4557k9325n9128j14203k58147n96524
$$ 516528368 516798019 517940283 518630505 518732786 518708229 518678904 518619776 518505573 518247426 517650902
1986.6E17650902j041293j213133k17438Q96752M21226m42743p00117q98838j290440
$$ 517650902 516609609 515396476 515179038 516075790 516497016 516054273 515354156 514455318 513164878
2005E13164878j793921k353013l013789l787160m045040k700299l66002J078427J479953
$$ 513164878 511370957 509017944 506004155 502216995 498171955 495471656 495105654 496184081 497664034
2023.3D97664034J581818J505405J334786J153291R99450R02295P66814N99802O89149
$$ 497664034 499245852 500751257 502086043 503239334 504238784 505141079 505907893 506507695 507196844
2041.7E07196844R59098R56356P85828P10547O70612O04331N25058M32610L40700J75775
$$ 507196844 508155942 509112298 509898126 510608673 511279285 511883616 512408674 512841284 513181984 513357759
2062.1E13357759O7532L39984N97477M54843K51294J85907J89542J76788J35481J26660
$$ 513357759 513425291 513765275 514362752 514817595 515068889 515254796 515444338 515621126 515756607 515883267
2082.5E15883267J16527M5896k2054K8193Q4877j2756j51991k39730k99812l63886
$$ 515883267 515999794 516045690 516023636 516051829 516136706 516123950 515971959 515732229 515432417 515068531
2102.9E15068531m23729m05074k79367j21772j4543P5876J32144P7844o4075k29240
$$ 515068531 514644802 514239728 513960361 513838589 513824046 513899922 514032066 514109910 514045835 513816595
2123.3E13816595l69966m56750n06103o07372p56502q21113p46608o33419n76198n03838
$$ 513816595 513446629 512989879 512483776 511876404 511119902 510298789 509552181 508918762 508342564 507838726
2143.7E07838726l48449j42693P8022K84136M37021N19335N36025M92096M36365M01557
$$ 507838726 507490277 507347584 507425606 507709742 508146763 508666098 509202123 509694219 510130584 510532141
2164.1E10532141L51846K88904K20239J15931J1265l3975n7697r7513q7082j3471J9252
$$ 510532141 510883987 511172891 511393130 511509061 511520326 511486351 511428654 511331141 511244059 511230588 511249840
2186.5E11249840J4007N5790R7275R2208Q0765O2942K3306l8207q5890p8440p9572
$$ 511249840 511263847 511319637 511416912 511509120 511589885 511652827 511676133 511637926 511552036 511473596 511394024
2208.9E11394024j48773k35975k96295l16202k69652j59204m3869J6809J7821o8187
$$ 511394024 511245251 511009276 510712981 510396779 510127127 509967923 509924054 509940863 509958684 509890497
2229.3E09890497k83003n94676r58323j261294j322150j086891p31945m84824l87967
$$ 509890497 509607494 509012818 508054495 506793201 505471051 504384160 503652215 503167391 502779424
2247.7E02779424m11868n01394n31495n13911n02288m81844m78000n18530o28621p85172
$$ 502779424 502367556 501866162 501334667 500820756 500318468 499836624 499358624 498840094 498211473 497426301
2268.1D97426301r17822r54121q25227n16712j26273J45644K24680K14368J92702J13904
$$ 497426301 496508479 495554358 494729131 494212419 494086146 494231790 494456470 494670838 494863540 494977444
2288.5D94977444r715r7484j91301k98351m04328n46217o63370p14689p77543q81821
$$ 494977444 494967729 494870245 494678944 494380593 493976265 493430048 492766678 492051989 491274446 490392625
2308.9D90392625r85652j089394j198053j346022j528174j590252j431435j118154
$$ 490392625 489406973 488317579 487119526 485773504 484245330 482655078 481223643 480105489
2325.2D80105489q32021o09100k65389O8009J04069n1260j66863m0263L79145J242549
$$ 480105489 479273468 478664368 478398979 478466988 478571057 478519797 478352934 478312671 478691816 479934365
2345.6D79934365K122908J979053J172483Q15630J034648J114875J124680J201063
$$ 479934365 482057273 484036326 485208809 486024439 487059087 488173962 489298642 490499705
2361.9D90499705J161456J063943R89825J006633J099020J116067J066417J040309
$$ 490499705 491661161 492725104 493714929 494721562 495820582 496936649 498003066 499043375
2378.2D99043375R97037Q39531O05226L97086K07841L6657o2585j07526j36495j64747
$$ 499043375 500040412 500879943 501485169 501882255 502090096 502126753 502064168 501956642 501820147 501655400
2398.6E01655400j91808k17617k84373l95060n05388n76704n80818m68343j75536K26587
$$ 501655400 501463592 501245975 500961602 500566542 500061154 499484450 498903632 498435289 498259753 498486340
2419D98486340N62131P18028P02828N91636M58479L79622L39448K85685K57075K35856
$$ 498486340 499048471 499766499 500469327 501060963 501519442 501899064 502238512 502524197 502781272 503017128
2439.4E03017128J84476J20461M2498k3961o2525q8036j17839j53243j81556k45452
$$ 503017128 503201604 503322065 503364563 503340602 503278077 503190041 503072202 502918959 502737403 502491951
2459.8E02491951l71754m95970o53387r87261j343787j279294p09474j44720L0249
$$ 502491951 502120197 501624227 500970840 499983579 498639792 497360498 496651024 496506304 496536553
2478.1D96536553l5137j36912k25723k99662l63827l83794m03047m48405m52906m28200
$$ 496536553 496501416 496364504 496138781 495839119 495475292 495091498 494688451 494240046 493787140 493358940
2498.5D93358940m49985n33849o21975p04616q02189q84056r65447j096874j278788
$$ 493358940 492908955 492375106 491753131 491048515 490246326 489362270 488396823 487299949 486021161
2516.9D86021161j507759j739889j810790j556754r67085k78980K25753M97967N54532
$$ 486021161 484513402 482773513 480962723 479405969 478438884 478159904 478385657 478883624 479438156
2535.3D79438156L42339j69724q91000j521945j721770j439601r67026o07431m67151
$$ 479438156 479780495 479610771 478719771 477197826 475476056 474036455 473069429 472461998 471994847
2553.6D71994847n20438o41525p42435q60781j003116j120925j222998j323849j394868
$$ 471994847 471474409 470832884 470090449 469229668 468226552 467105627 465882629 464558780 463163912
2572D63163912j447975j511246j582593j670688j790286j882851j932025j990765k043575
$$ 463163912 461715937 460204691 458622098 456951410 455161124 453278273 451346248 449355483 447311908
2590.3D47311908k058536j993626j845271j719594j682937j704454j818508k013892
$$ 447311908 445253372 443259746 441414475 439694881 438011944 436307490 434488982 432475090
2606.6D32475090k195030k384395k569228k662361k711087k804667k893090k963156
$$ 432475090 430280060 427895665 425326437 422664076 419952989 417148322 414255232 411292076
2623D11292076l074139l189057l204137k954781k328486j426071n15669J31726M05729
$$ 411292076 408217937 405028880 401824743 398869962 396541476 395115405 394599736 394731462 395137191
2641.3C95137191L81738J55955k08497n99205q96901j066119j131981j060248q45551
$$ 395137191 395518929 395674884 395466387 394867182 393970281 392904162 391772181 390711933 389866382
2659.7C89866382n92083l46213n8294K86162O23614Q96483J087994J175165J152754
$$ 389866382 389274299 388928086 388869792 389155954 389779568 390676051 391764045 392939210 394091964
2678C94091964J089215J078397J106978J173257J357228J531810J479357J150519O26742
$$ 394091964 395181179 396259576 397366554 398539811 399897039 401428849 402908206 404058725 404685467
2696.4D04685467N1618m99129r54420j194655j285524j374334j412898j398057j424849
$$ 404685467 404737085 404237956 403283536 402088881 400803357 399429023 398016125 396618068 395193219
2714.7C95193219j468181j515925j655043j927495k208858k246887j941979j541257
$$ 395193219 393725038 392209113 390554070 388626575 386417717 384170830 382228851 380687594
2731.1C80687594j264661j046747p76351m61578j74969M2528J37209L4035k95252p54893
$$ 380687594 379422933 378376186 377599835 377138257 376963288 377005816 377143025 377177060 376881808 376126915
2751.4C76126915j227766j671940k023071k281279k491712k665967k817660l016651
$$ 376126915 374899149 373227209 371204138 368922859 366431147 363765180 360947520 357930869
2767.8C57930869l386974l894330m391133m862458n373210n965173o569236p070124
$$ 357930869 354543895 350649565 346258432 341395974 336022764 330057591 323488355 316418231
2784.1C16418231p475347p799923q017212q126706q152634q139402q152872q220971
$$ 316418231 308942884 301142961 293125749 284999043 276846409 268707007 260554135 252333164
2800.4B52333164q307755q420914q603990q862615r178162r607046j0147110j0679916
$$ 252333164 244025409 235604495 227000505 218137890 208959728 199352682 189205572 178525656
2816.7A78525656j1194229j1757925j2408972j3148546j3912953j4530175j4936424
$$ 178525656 167331427 155573502 143164530 130015984 116103031 101572856 86636432
2831H6636432j5218750j5190806j4377084j2570158j0011969p146104m444362k157458
$$ 86636432 71417682 56226876 41849792 29279634 19267665 12121561 7677199 5519741
2847.3E519741l66365Q84502J716488K363845L023522L703344M257931M491334M137181
$$ 5519741 5153376 6037878 7754366 10118211 13141733 16845077 21103008 25594342 29731523
2865.7B9731523L189519K058782J042631Q765j206759k346851l023803l194597l009362
$$ 29731523 32921042 34979824 36022455 36031220 34824461 32477610 29453807 26259210 23249848
2884B3249848k594819k167866j846356j539234j257951j056667r00746p99708p99681
$$ 23249848 20655029 18487163 16640807 15101573 13843622 12786955 11886209 11086501 10286820
2902.4A0286820q77587r77261j058569j062337r29034o43593k80609L8404K72665M54049
$$ 10286820 9409233 8431972 7373403 6311066 5382032 4738439 4457830 4496234 4768899 5222948
2922.8E222948O59341R34729J236694J584633K008161K496974L057875L753898M562311
$$ 5222948 5882289 6817018 8053712 9638345 11646506 14143480 17201355 20955253 25517564
2941.1B5517564N313421N839514N796421N064748M202739L894325M362535N479905
$$ 25517564 30830985 36670499 42466920 47531668 51734407 55628732 59991267 65471172
2957.4F5471172P162929R402648J2121118J4977820J7485842J9269124K0119459K0030617
$$ 65471172 72634101 82036749 94157867 109135687 126621529 145890653 166010112 186040729
2973.8A86040729J9152224J7827466J6342193J4792309J3313144J1950463J0708749
$$ 186040729 205192953 223020419 239362612 254154921 267468065 279418528 290127277
2988B90127277R603173Q582801P716953O972015O237418N605131N165845M900575M660606
$$ 290127277 299730450 308313251 316030204 323002219 329239637 334844768 340010613 344911188 349571794
3006.4C49571794M318416L989488L784120L614545L435672L266096L081023K914578
$$ 349571794 353890210 357879698 361663818 365278363 368714035 371980131 375061154 377975732
3022.7C77975732K858520K854854K802908K936929L341496L668607L773302L753602
$$ 377975732 380834252 383689106 386492014 389428943 392770439 396439046 400212348 403965950
3039D03965950L717452L664553L506661L279716L083437K902925K602101K322554K285481
$$ 403965950 407683402 411347955 414854616 418134332 421217769 424120694 426722795 429045349 431330830
3057.4D31330830K222597J933784J669913J665205J797169J777679J590878J429528
$$ 431330830 433553427 435487211 437157124 438822329 440619498 442397177 443988055 445417583
3073.7D45417583J371682J361787J494974J838595K146869K342523K581715K911598
$$ 445417583 446789265 448151052 449646026 451484621 453631490 455974013 458555728 461467326
3090D61467326L254741L475130L532827L351330K965957K674759K394736J936972J542926
$$ 461467326 464722067 468197197 471730024 475081354 478047311 480722070 483116806 485053778 486596704
3108.4D86596704J329511J123011Q65489P43211Q21173Q74668Q28326P88748P70748
$$ 486596704 487926215 489049226 489914715 490657926 491479099 492353767 493182093 493970841 494741589
3126.7D94741589P18087N79327N84901P89076P42018N05984M63903N10603M64052L97086
$$ 494741589 495459676 496039003 496623904 497412980 498154998 498660982 499124885 499635488 500099540 500496626
3147.1E00496626L48568K76863K78235L48151L40283K45451J43290R9599J24276J50383
$$ 500496626 500845194 501122057 501400292 501748443 502088726 502334177 502477467 502577066 502701342 502851725
3167.5E02851725J02222M470m6969j23262k07543j21951q2970j47104n5194L9339R596
$$ 502851725 502953947 502958417 502911448 502788186 502580643 502458692 502375722 502228618 502173424 502212763 502222359
3189.9E02222359J6213J4662k0027J65642M93526N84126M15086J77622L8743O9976
$$ 502222359 502238572 502253234 502233207 502398849 502892375 503476501 503891587 504069209 504107952 504177928
3210.3E04177928J10090J43587J83821Q6725N7816J37270K4319j29343j08301j15216
$$ 504177928 504288018 504431605 504615426 504702151 504759967 504897237 504921556 504792213 504683912 504568696
3230.7E04568696k19285k35141j74761j53660k38538m21524m28915k08557j55866l58224
$$ 504568696 504349411 504114270 503939509 503785849 503547311 503125787 502696872 502488315 502332449 501974225
3251.1E01974225n26249m35591k11299j95264l58761m45425m11779m00305m99040o01410
$$ 501974225 501447976 501012385 500801086 500605822 500247061 499801636 499389857 498989552 498490512 497889102
3271.5D97889102o07491m63307k20656j59383l18438m17680m04983m32730n07146m69178
$$ 497889102 497281611 496818304 496597648 496438265 496119827 495702147 495297164 494864434 494357288 493888110
3291.9D93888110l51280l23653l21120l07501l62664m22388m60655m30912k79128j66953
$$ 493888110 493536830 493213177 492892057 492584556 492221892 491799504 491338849 490907937 490628809 490461856
3312.3D90461856j17868p6622j45852k90484l99559m28856l08364j04636o1095k28614
$$ 490461856 490343988 490267366 490121514 489831030 489431471 489002615 488694251 488589615 488528520 488299906
3332.7D88299906l47852k01911J9789M3839k682K5570K1756n8383p1734l1144J371
$$ 488299906 487952054 487750143 487769932 487813771 487811089 487836659 487858415 487800032 487728298 487697154 487698525
3355.2D87698525J08391J66089J48445J29819J30236K79546N33640P24763P76201P45148
$$ 487698525 487806916 487973005 488121450 488251269 488381505 488661051 489194691 489919454 490695655 491440803
3375.5D91440803P02590O78449O36280O26355Q00074Q53478M85838K97904N91040P26014
$$ 491440803 492143393 492821842 493458122 494084477 494884551 495738029 496223867 496521771 497112811 497838825
3395.9D97838825O87063P40587P24525O93381O77228N85496M81129M19736L58700J61588
$$ 497838825 498525888 499266475 499991000 500684381 501361609 501947105 502428234 502847970 503206670 503368258
3416.3E03368258j61051p7188M91440P04467L71456O4791L636R2029J82569J95444
$$ 503368258 503207207 503130019 503621459 504325926 504697382 504762173 504765809 504857838 505040407 505235851
3436.7E05235851P8738j42098k61128l89457j03891R26018J346469Q00431L67343K38479
$$ 505235851 505314589 505172491 504911363 504521906 504418015 505344033 506690502 507490933 507858276 508096755
3457.1E08096755J32143J23143L24309M52340M65691N19752M12166K21253J99556O8248
$$ 508096755 508228898 508352041 508676350 509128690 509594381 510114133 510526299 510747552 510947108 511015356
3477.5E11015356m00305l40164L82781N03421K82526M95613M09483j32799k21550l2604
$$ 511015356 510615051 510274887 510657668 511161089 511443615 511939228 512348711 512215912 511994362 511961758
3497.9E11961758o22690j227796j56343R23872K93672P8857Q56758Q73565J72615m00483
$$ 511961758 511339068 510111272 509954929 510878801 511172473 511251330 512108088 512981653 513154268 512753785
3518.3E12753785j000285j529754j214206m02510M97878J410245J196504M4227k93374
$$ 512753785 511753500 510223746 509009540 508607030 509104908 510515153 511711657 511755884 511462510
3536.7E11462510O4969o51121k327383k718866n64933J278341M33624R8944J184702
$$ 511462510 511527479 510876358 508548975 505830109 505265176 506543517 506977141 507076085 508260787
3555E08260787O87837q12173j723647l572106n942732k871245M571050O045073K202034
$$ 508260787 508948624 508136451 506412804 502840698 496897966 494026721 498597771 504642844 506844878
3573.4E06844878k75194n90384m67539r85563l526390o765097m579157J775563J600623
$$ 506844878 506569684 505979300 505511761 504526198 500999808 494234711 489655554 491431117 493031740
3591.7D93031740l050834m316002l698707l711909k405107j407176k819985k576619
$$ 493031740 489980906 485664904 481966197 478254288 475849181 474442005 471622020 469045401
3608.1D69045401P92205K749413K994865J604379K5510L691376O743490J716316o942332
$$ 469045401 469837606 472587019 475581884 477186263 477211773 480903149 487646639 489362955 482420623
3626.4D82420623q274018K709448Q191079M482925J457751j06842j171231k492130
$$ 482420623 474146605 476856053 485047132 489530057 490987808 490880966 489709735 487217605
3642.7D87217605o581962j1476368p815748N949557J1409670N433976K682448N037367
$$ 487217605 480635643 469159275 461343527 467293084 478702754 484136730 486819178 491856545
3659D91856545M018426J089394k085864p076025q732796l200620k112300k541035O516278
$$ 491856545 495874971 496964365 494878501 487802476 479069680 475869060 473756760 471215725 477732003
3677.4D77732003J0651797O580531J720846m176706q831859m475504N653322Q358151
$$ 477732003 488383800 494964331 496685177 492508471 483676612 479201108 484854430 493212581
3693.7D93212581M500895J79261k700597j763314J949072N42730n424797p548750o76155
$$ 493212581 497713476 497892737 495192140 493428826 495377898 495920628 490495831 482947081 482270926
3712.1D82270926P550717O365090M65751k878338k644748r05603J144558J077474m114360
$$ 482270926 489821643 496186733 496652484 493774146 491129398 490223795 491368353 492445827 488331467
3730.4D88331467r578645o975413K709300Q165031K642036p151187p141590R07034
$$ 488331467 478752822 471777409 474486709 482651740 485293776 478142589 471000999 471908033
3746.7D71908033m99457j253873P338762R218961L039122K10225K866268K507389j173407
$$ 471908033 471408576 470154703 477493465 486712426 489751548 489961773 492828041 495335430 494162023
3765.1D94162023k271324q00759K771556M586041J222462k995998k646863J019478
$$ 494162023 491890699 491089940 493861496 498447537 499669999 496674001 494027138 495046616
3781.4D95046616J692712Q67397J423954J070053n77241l235013n131840m653782n216271
$$ 495046616 496739328 497606725 499030679 500100732 499523491 496288478 491156638 486502856 481286585
3799.8D81286585l019094K510846K151370K592265N048096J027793n813539o923765
$$ 481286585 478267491 480778337 482929707 485521972 490570068 491597861 485784322 478860557
3816.1D78860557l653496k884210K323449P340938M190266P11024j550049l288865
$$ 478860557 475207061 472322851 474646300 481987238 486177504 486888528 485338479 482049614
3832.4D82049614l976464m787147k014637L578782N766749N542755L379494k730757
$$ 482049614 478073150 473286003 471271366 474850148 480616897 486159652 489539146 486808389
3848.7D86808389j1183470j2548208K775997J2612462O762892j205445m403293k156615
$$ 486808389 475624919 463076711 465852708 478465170 485228062 484022617 479619324 477462709
3865D77462709j068085k865255j78188L861278M309982J571715k938599k423167j76489
$$ 477462709 476394624 473529369 473351181 477212459 481522441 483094156 480155557 477732390 477555901
3883.4D77555901J40071K306044J095265o33985K356380J643122m103512o668359l630668
$$ 477555901 477695972 480002016 481097281 480463296 482819676 484462798 480359286 473690927 470060259
3901.8D70060259J683414O505400O992370L444642J99258k065808l351956j545906
$$ 470060259 471743673 478249073 485241443 488686085 488885343 486819535 483467579 481921673
3918.1D81921673J341969J433879L58015P86126M78297j006901P2032K804607K863586
$$ 481921673 483263642 484697521 485055536 485841662 486319959 485313058 485385090 488189697 491053283
3936.4D91053283O54787j277059j261264L16679M42028k8312J038164J609802P85679
$$ 491053283 491708070 490431011 489169747 489486426 489928454 489900142 490938306 492548108 493333787
3954.8D93333787K4885k13027k51949J2398J52945k39789n87434o32554n46694k55376
$$ 493333787 493358672 493145645 492893696 492906094 493059039 492819250 492231816 491599262 491052568 490797192
3975.2D90797192Q0466L8207q3208J63316L19749O1572j30445n7012J1445J16854K78891
$$ 490797192 490877658 490915865 490832657 490995973 491315722 491377294 491246849 491189837 491201282 491318136 491597027
3997.6D91597027
$$ 491597027
##END=$$ End of the data block
