##TITLE=DIG $$ Begin of the data block
##JCAMP-DX=5.00 $$ ACD/SpecManager v 10.08
##SPECTROMETER/DATA SYSTEM=Alpha
##DATE=12 Mar 2014 10:59:36
##DATA TYPE=INFRARED SPECTRUM
##DATA CLASS=XYDATA
##ORIGIN=
##OWNER=
##NPOINTS=1765
##FIRSTX=399.75695801
##LASTX=3997.56933594
##MAXX=3997.56933594
##MINX=399.75695801
##MAXY=0.80183947
##MINY=0.18584958
##XFACTOR=1.0000000000
##YFACTOR=1.000000000000000e-9
##FIRSTY=0.53535753
##DELTAX=2.03957629
##XUNITS=1/CM
##YUNITS=ARBITRARY UNITS
##XYDATA=(X++(Y..Y))
399.8E35357535N418837N141497O188988N736709M496813M596770M744470L787100
416.1E75468719L845274M606545L262937K006531K403140K991796K368629J682818
432.4E98636389K365649K697765J660884J471340K449394K139747R59515J213909K158463
450.7F15753055J745700P87318J497627K281904J120686L13282J212418J894355J095951
469.1F27702296Q31246J838505J692415O04331J019657K177060J766264P43627J216889
487.5F39592290J998544J280605N20766J434207J962245Q28504N57184J698256J561821
505.8F51434422J59382J49489J281977J049816J64092O81877J343667N43833k7537
524.2F56781018P73787J137436K33412J7225J098514J203537P8261J81555J132250
$$ y = [535357535, 540776372, 545917869, 552106857, 557843566, 562340379, 566937149, 571681619, 575468719, 579313993, 583920538, 587183475, 589190006, 591593146, 594584942, 596953571, 598636389, 601002038, 603699803, 605360687, 606832027, 609281421, 611421168, 612380683, 613594592, 615753055, 617498755, 618286073, 619783700, 622065604, 623186290, 623499572, 624711990, 626606345, 627702296, 628533542, 630372047, 632064462, 632668793, 633688450, 635865510, 637631774, 638375401, 639592290, 641590834, 642871439, 643392205, 644826412, 646788657, 647617161, 648174345, 649872601, 651434422, 651593804, 651743293, 653025270, 654075086, 654239178, 654921055, 656264722, 656808555, 656781018, 657554805, 658692241, 658925653, 658942878, 660041392, 661244929, 661323190, 661504745, 662636995]
542.5F62636995P25866k57790Q5115Q52525L28362n07772o7711O66321K90692n4062
562.9F64698541P19488J063227K43903r6977M93646N35428j07288O3658Q67009Q47697
583.3F69328332K75373M18306Q77201N13316k02537p8142L99173R3102l87788j49071
603.7F71087265L9160m42266n58257K54035R73284Q86559Q11756J408756J695216J158773
624.1F77314281Q41618J171172J215815R61364J386284K178610K005398J255691J329541
642.5F89659774J699329J142263L50952N76675J031578N53429k1637L57509P36535
660.8F96086407J31309m21644K45870J292169M05669j5795P61807R32693J05679j311
681.2F99522853O56366L39628p65026r69648p83623k136111m588842n896867m110515
$$ y = [662636995, 663362861, 663105071, 663190186, 664042711, 664371073, 663863301, 663795590, 664461911, 664752603, 664698541, 665418029, 666481256, 666725159, 666628182, 667121828, 667657256, 667549968, 667613626, 668480635, 669328332, 669603705, 670022011, 670899212, 671412528, 671209991, 671131849, 671531022, 671624124, 671236336, 671087265, 671126425, 670684159, 670125902, 670379937, 671353221, 672239780, 673051536, 674460292, 676155508, 677314281, 678155899, 679327071, 680542886, 681504250, 682890534, 685069144, 687074542, 688330233, 689659774, 691359103, 692501366, 692852318, 693428993, 694460571, 695014000, 694992363, 695349872, 696086407, 696217716, 695796072, 696041942, 697334111, 697739780, 697723985, 698485792, 699418485, 699524164, 699522853, 700179219, 700518847, 699753821, 698784173, 698000550, 695864439, 691275597, 685378730, 681268215]
699.6F81268215j468837k455413n827427q993149j2104333j1296153l648758L531158
715.9F39005303N010724O060720R352684J1755347J2149990J1838078J0953069Q268774
732.2G14394689M763424L015339K666533J589716L82125P10309J396656O10113l89636
750.6G29139268J28568O56545l03447r95338k15829O9678r88007j250088j45197K36571
771G26332724n08070l98874N95033L70264p00116m67181M47213L8445q15987l14713
791.4G24578738M11988k06769q01146o4194L90947n23687j120209m71533k87235j210510
811.7G20696390j423478n54204n02229j442015j501918p75159j043796k030373k100944
830.1G09322274j784861k631247l894747m224717m757703o152749p323324q347452
$$ y = [681268215, 679799378, 677343965, 671516538, 662523389, 650419056, 639122903, 635474145, 639005303, 644016027, 650076747, 659429431, 671184778, 683334768, 695172846, 706125915, 714394689, 719158113, 722173452, 724839985, 726429701, 726811826, 727522135, 728918791, 729528904, 729139268, 729267836, 729924381, 729620934, 728625596, 728409767, 728479445, 727491438, 726241350, 726096153, 726332724, 725824654, 725425780, 726020813, 726391077, 725690961, 725223780, 725670993, 725709438, 724893451, 724578738, 724990726, 724783957, 723982811, 723918617, 724309564, 723785877, 722665668, 722194135, 721906900, 720696390, 719272912, 718718708, 718216479, 716774464, 715272546, 714497387, 713453591, 711423218, 709322274, 707537413, 704906166, 701011419, 696786702, 692028999, 685876250, 678552926, 670205474]
846.4F70205474q648098r039998j1561155j2597859r307146n428851m111945n824685
862.7F03685737j1636615k3060501l8166880m8211962m4372797k6802659Q17030L3048094
879.1D45299447N4994940N6198657M6030283L6449492K7928114J9462406J3591648
893.3F99954987J0536849Q010209N782783M859924M342735K856970J434922J375496
909.6G39154875J211167k48552j370370j163364j093864j796544j885712j017928p08878
928G31080830j186132r96828j57237j37568q15332q23438n14865j109362k027988k030969
948.4G21281111j720130k245605k863348k522230k104401k533257k855242k321422
964.7G02115476j954853k422870k702236k280652k202630k845824l109872k677560
$$ y = [670205474, 661557376, 652517378, 640956223, 628358364, 619051218, 613622367, 609510422, 603685737, 592049122, 568988621, 530821741, 482609779, 438236982, 411434323, 412251353, 445299447, 500294387, 556493044, 602523327, 638972819, 666900933, 686363339, 699954987, 710491836, 718502045, 724284828, 729144752, 733487487, 736344457, 737779379, 739154875, 740366042, 740117490, 738747120, 737583756, 736489892, 734693348, 732807636, 731789708, 731080830, 729894698, 728897870, 728740633, 728603065, 727787733, 726964295, 726449430, 725340068, 723312080, 721281111, 719560981, 717315376, 714452028, 711929798, 709825397, 707292140, 704436898, 702115476, 700160623, 697737753, 695035517, 692754865, 690552235, 687706411, 684596539, 681918979]
981F81918979k626241l097534k995252k335251k250254k633035k429128j892566k066434
999.4F59593284k581537k489626k232134k618671l151595k982080k629817k865434
1015.7F38042390l081143k632975k229154k426327k553641k152741j885236k119839
1032F18961334k086818j495719j156986j379668j427651j133382j196981j603484j581251
1050.4F05899394j163364j171291j529753j439214j027465j103639j438260j323104
1066.7E95703304j128853j518189k006650j914978j942158k981782l493250r10759
1083E79806685K566517L172457K526224K800405K884567K096056J346112J098394P70271
1101.4E99067688K41578J47640M21107L07799p0215P4387M92513L44515r7036j09494
$$ y = [681918979, 679292738, 676195204, 673199952, 670864701, 668614447, 665981412, 663552284, 661659718, 659593284, 657011747, 654522121, 652289987, 649671316, 646519721, 643537641, 640907824, 638042390, 634961247, 632328272, 630099118, 627672791, 625119150, 622966409, 621081173, 618961334, 616874516, 615378797, 614221811, 612842143, 611414492, 610281110, 609084129, 607480645, 605899394, 604736030, 603564739, 602034986, 600595772, 599568307, 598464668, 597026408, 595703304, 594574451, 593056262, 591049612, 589134634, 587192476, 584210694, 580717444, 579806685, 582373202, 585545659, 588071883, 590872288, 593756855, 595852911, 597199023, 598297417, 599067688, 599309266, 599456906, 599878013, 600185812, 600115597, 600189984, 600682497, 601027012, 600929976, 600820482]
1121.8F00820482J8537k80976n44310j37508K94387N1737k29537q047J39058j53005
1142.2E99970818k67089P4566J99317j27077l08334j97649k83242n26070l15011L15607
1162.6E98535836P27236Q65102J170873J615584J825631J921475K256751K521217K202511
1180.9F13642216J616001J292884J011551M12106j87814l70979m72248q59499j176059
1199.3F14908159j119137j067877j297176j426816j250624j206160j471579j602113
1215.6F04466677j479388j467704j652420j653492j434446j402914j555920j505613
1231.9E92314780j259208j227915j349092j230538r99033j072645j243174j119614
1248.2E82813561r42528j063943j210511j033127q67427j000046j118780r30249p79271
$$ y = [600820482, 600839019, 600558043, 600013733, 599876225, 600170612, 600222349, 599992812, 599984765, 600123823, 599970818, 599703729, 599778295, 599977612, 599850535, 599542201, 599344552, 599061310, 598535240, 598220229, 598535836, 599263072, 600128174, 601299047, 602914631, 604740262, 606661737, 608918488, 611439705, 613642216, 615258217, 616551101, 617562652, 617974758, 617786944, 617415965, 616943717, 616084218, 614908159, 613789022, 612721145, 611423969, 609997153, 608746529, 607540369, 606068790, 604466677, 602987289, 601519585, 599867165, 598213673, 596779227, 595376313, 593820393, 592314780, 591055572, 589827657, 588478565, 587248027, 586248994, 585176349, 583933175, 582813561, 581871033, 580807090, 579596579, 578563452, 577696025, 576695979, 575577199, 574646950, 573867679]
1266.6E73867679r03786r76026q28921p97034j003563j063287r05991q80599j058817
1284.9E65449655j066625r91702j191080j528263j635015j637101j862168k124489
1301.2E53413212k181470k179086k400041k584517k531648k493322k626955k656698
1317.6E33759475k462447k377093k525687k680004k682387k815247l047764l111661
1333.9E12057185l036082l210723l560722l566712l393650l456801l734857l906936
1350.2D84190702m025846m243285m517257m566789m664212n212873n645782n610049
1366.5D45704609n697548n884171o091535o567120o736875o925941p415056p643729
1382.8C92742634p621646q157015q830845q749962r516359j1273562j2199492j2902975
$$ y = [573867679, 572963893, 571987867, 571158946, 570361912, 569358349, 568295062, 567389071, 566508472, 565449655, 564383030, 563391328, 562200248, 560671985, 559036970, 557399869, 555537701, 553413212, 551231742, 549052656, 546652615, 544068098, 541536450, 539043128, 536416173, 533759475, 531297028, 528919935, 526394248, 523714244, 521031857, 518216610, 515168846, 512057185, 509021103, 505810380, 502249658, 498682946, 495289296, 491832495, 488097638, 484190702, 480164856, 475921571, 471404314, 466837525, 462173313, 456960440, 451314658, 445704609, 440007061, 434122890, 428031355, 421464235, 414727360, 407801419, 400386363, 392742634, 385120988, 376963973, 368133128, 359383166, 349866807, 338593245, 326393753, 313490778]
1399.1C13490778j3246059j3188601j3953775j3802022j2948692j2476846j1606753
1413.4B22268030j0201961r203031q216992n343050k587691q65728N06342J593962
1429.7A87949881K127245K203017K382711K361059J681716J219391J021892R27761
1446B01874673R05320Q03486P75605Q84921J308247J576126J173273Q74280P24555
1464.4B10900486L93852J78024L23788O75708R48012J043513J206994J465946J817689
1482.8B18954012K138257K635881L441811M083708M073396M635066O164908O855637
1499.1B52982676O559640O282747P843941J1167855R860515Q000046Q350611R040773
1515.4C20088804R527653R419233J0142326R690434Q412063Q475334P842838P699490
$$ y = [313490778, 300244719, 287056118, 273102343, 259300321, 246351629, 233874783, 222268030, 212066069, 202863038, 194646046, 189302996, 186715305, 185849577, 186355919, 187949881, 190077126, 192280143, 194662854, 197023913, 198705629, 199925020, 200946912, 201874673, 202779993, 203583479, 204359084, 205244005, 206552252, 208128378, 209301651, 210175931, 210900486, 211294338, 211472362, 211796150, 212471858, 213419870, 214463383, 215670377, 217136323, 218954012, 221092269, 223728150, 227169961, 231253669, 235327065, 239962131, 246127039, 252982676, 259542316, 265825063, 273669004, 284836859, 294697374, 302697420, 311048031, 320088804, 329616457, 339035690, 349178016, 358868450, 367280513, 375755847, 383598685, 391298175]
1531.7C91298175Q460224P372140O603837Q783728Q928150O784290O146849N909264
1548D50286657O186187O302267O214529N995870P286549P572531M246802L459721L939599
1566.4E01490712M183471M020930K953648K723813L271520K403737J631498J702249
1582.7E24381578J654327J202464P79510N59687L20256p8738l85940m17590n75423
1601.1E27440131r26614j160264j208782j495540j880050j875997j746058j980543
1617.4E15166283j884103j379728j227797j359582j369535j080394n91636l9995L61741
1635.7E06595254L53336M35472Q27849J417994K407670K705157J866102K625227L943146
1654.1E23177207K345025J766443K600611L499984L494978K918959L387928L997385
$$ y = [391298175, 399758399, 407130539, 413734376, 422518104, 431446254, 438230544, 444377393, 450286657, 456472844, 462775111, 468989640, 474985510, 482272059, 489844590, 494091392, 497551113, 501490712, 505674183, 509695113, 512648761, 515372574, 518644094, 521047831, 522679329, 524381578, 526035905, 527238369, 528017879, 528577566, 528897822, 528819084, 528433144, 528015554, 527440131, 526513517, 525353253, 524144471, 522648931, 520768881, 518892884, 517146826, 515166283, 513282180, 511902452, 510674655, 509315073, 507945538, 506865144, 506273508, 506233513, 506595254, 506948590, 507384062, 508211911, 509629905, 512037575, 514742732, 516608834, 519234061, 523177207, 525522232, 527288675, 529889286, 533389270, 536884248, 539803207, 543191135, 547188520]
1670.4E47188520L288508L196418L558099L224016L080249L681898M579961L574192
1686.7E75371861K695740L035366L247023M016161M522443M354298M880547L929377
1703F06052816L341377L633856L342331L146052L133238L265559L455758K650202J756012
1721.4F33777201J851440K123236K088666K071679K088368K394140K063751J466036
1737.7F49924517J889646K246678K114772K207399K471983K612174K318144J903116
1754F67688429K032221K198755K034784J952290J731456J643657J774550J706123J413822
1772.4F84176087O77050j08839m48584n22077o49512r75072j157821p72476k80618
1790.7F79938138l24905n79536l55244K08795P61092J142502J518488J991450K400160
$$ y = [547188520, 550477028, 553673446, 557231545, 560455561, 563535810, 567217708, 571797669, 575371861, 578067601, 581102967, 584349990, 588366151, 592888594, 597242892, 602123439, 606052816, 609394193, 613028049, 616370380, 619516432, 622649670, 625915229, 629370987, 632021189, 633777201, 635628641, 637751877, 639840543, 641912222, 644000590, 646394730, 648458481, 649924517, 651814163, 654060841, 656175613, 658383012, 660854995, 663467169, 665785313, 667688429, 669720650, 671919405, 673954189, 675906479, 677637935, 679281592, 681056142, 682762265, 684176087, 684853137, 684744298, 684295714, 683773637, 683124125, 682149053, 680991232, 680218756, 679938138, 679613233, 679033697, 678678453, 678887248, 679648340, 680790842, 682309330, 684300780, 686700940]
1809.1F86700940K644777K707899K704024K632618K466798K331674K235770K022803
1825.4G06447303J715839J602113J393021J118719J158893J272321J199365J141131
1841.7G17048705J254797J157105Q15391P02858Q40902R68337R36091Q28505Q38757
1860.1G25391448R06229R09745R34661R67502P91312N35905N49138P27713Q04543O90758
1880.5G33208954O23405P47621Q34346P23303N56409N93960O83725N76437N13970O55830
1900.9G39717960O51479M93884N46396P11083O00577L83615N07474P20203N63324L27229
1921.3G45223224M28736N57304M23729L07083M56155N77390M02212L12209N22971O31094
1941.7G49842107L80695K33650M16994M68195K82824K72512M31300L74078K02537K83062
$$ y = [686700940, 689345717, 692053616, 694757640, 697390258, 699857056, 702188730, 704424500, 706447303, 708163142, 709765255, 711158276, 712276995, 713435888, 714708209, 715907574, 717048705, 718303502, 719460607, 720275998, 720978856, 721819758, 722788095, 723724186, 724552691, 725391448, 726297677, 727207422, 728142083, 729109585, 729900897, 730436802, 730985940, 731713653, 732518196, 733208954, 733832359, 734579980, 735414326, 736137629, 736694038, 737287998, 737971723, 738548160, 739062130, 739717960, 740369439, 740863323, 741409719, 742120802, 742721379, 743104994, 743612468, 744332671, 744895995, 745223224, 745651960, 746209264, 746632993, 746940076, 747396231, 747973621, 748375833, 748688042, 749211013, 749842107, 750222802, 750456452, 750873446, 751341641, 751624465, 751896977, 752328277, 752702355, 752904892, 753187954]
1962.1G53187954N10097M90367L04640L30925M70519M03940K84315L89695M80473L11673
1982.5G57164598J77681L41713M58718L00467J89185K95222L38494J78636J34945L13818
2002.8G59893477L56793J93358J64449K99752L07441J84893J84119K49803J69694Q5712
2023.2G62089491J80542K83420J82331Q4996K05159K95222J78874J28865K66194L05176
2043.6G64200270J68324J23799K62677L10242K00153K06709L25560L07918K00033K14219
2064G66519904K81811K56717K14160K64346L26097K83957K14815K53379L18647K86877
2084.4G69220710K40564K69115L09765K55108J92106K24471K59698K24590J85192K08318
2104.8G71589637K31147J92225J41143J60456K09451K02775J63913J66535J96576J93179
$$ y = [753187954, 753698051, 754188418, 754493058, 754823983, 755294502, 755698442, 755982757, 756372452, 756852925, 757164598, 757342279, 757683992, 758142710, 758443177, 758632362, 758927584, 759266078, 759444714, 759579659, 759893477, 760250270, 760443628, 760608077, 760907829, 761215270, 761400163, 761584282, 761834085, 762003779, 762089491, 762270033, 762553453, 762735784, 762820780, 763025939, 763321161, 763500035, 763628900, 763895094, 764200270, 764368594, 764492393, 764755070, 765065312, 765265465, 765472174, 765797734, 766105652, 766305685, 766519904, 766801715, 767058432, 767272592, 767536938, 767863035, 768146992, 768361807, 768615186, 768933833, 769220710, 769461274, 769730389, 770040154, 770295262, 770487368, 770711839, 770971537, 771196127, 771381319, 771589637, 771820784, 772013009, 772154152, 772314608, 772524059, 772726834, 772890747, 773057282, 773253858, 773447037]
2125.2G73447037J74165J79469K14636K15948J82629K02894K57730K42293J86086K08020
2145.6G75510907K78473K76387K26319K82585L79741L50774K95758L66330M50909L87550
2166G78805733L05533L82424M70757L87728L10838L85225M34935L57271L35097M31776
2186.4G82607317M27365K86103K50041L65138L94464L01957K77519L40819L16739K24591
2206.8G85792053K60234L45051K85149J78396K24650L21627K49743J29104K07782L24130
2227.2G88317919K54869J74403K37287K88605K14339J78158K64585L00884K00033J74701
2247.6G90605783L03805L21448J74403J55270L02613L09944J96815K39432L51548K95877
2268G93256938J77742K32219L39687K48373J40011K58088L46005J85847N2452J79947
$$ y = [773447037, 773621202, 773800671, 774015307, 774231255, 774413884, 774616778, 774874508, 775116801, 775302887, 775510907, 775789380, 776065767, 776292086, 776574671, 776954412, 777305186, 777600944, 777967274, 778418183, 778805733, 779111266, 779493690, 779964447, 780352175, 780663013, 781048238, 781483173, 781840444, 782175541, 782607317, 783034682, 783320785, 783570826, 783935964, 784330428, 784632385, 784909904, 785250723, 785567462, 785792053, 786052287, 786397338, 786682487, 786860883, 787085533, 787407160, 787656903, 787786007, 787993789, 788317919, 788572788, 788747191, 788984478, 789273083, 789487422, 789665580, 789930165, 790231049, 790431082, 790605783, 790909588, 791231036, 791405439, 791560709, 791863322, 792173266, 792370081, 792609513, 792961061, 793256938, 793434680, 793666899, 794006586, 794254959, 794394970, 794653058, 794999063, 795184910, 795237362, 795417309]
2288.4G95417309K88963J57714P7784K09272K63035J09375M1723J63019J98722Q6903
2308.8G97013819Q7321K08259J62959m173J1743J82449J96874P3612R3580K04563J66177
2331.2G98397183K3604N543Q0586L7491R417K50936M45604J98365j20163r4951J33098
2353.6G99366713J38044O2466K02894L04162J65582J00374K69175K95281J29044J27673
2374H01161408J94490P6652l0339O5446J70052O7353o4194O020J16229M1366o4313
2396.5H01740170J1980Q7321k7001j02520L2186R6679o0916j39713L099O0857q1063
2418.9H01621079j29938l0696n8889k18809k07305n3525o2585j90437j72198q4400
2439.3H00412297j67787l03089k63453j84476k67148l71516l49522l43740m72486n76973
$$ y = [795417309, 795706272, 795863986, 795941770, 796151042, 796414077, 796523452, 796565175, 796728194, 796926916, 797013819, 797101140, 797309399, 797472358, 797468185, 797479928, 797662377, 797859251, 797932863, 798026443, 798231006, 798397183, 798420787, 798426330, 798506916, 798544407, 798553824, 798804760, 799250364, 799448729, 799328566, 799233615, 799366713, 799504757, 799567223, 799770117, 800074279, 800239861, 800340235, 800609410, 800904691, 801033735, 801161408, 801355898, 801432550, 801402211, 801467657, 801637709, 801705062, 801640868, 801646888, 801763117, 801804483, 801740170, 801752150, 801839471, 801812470, 801709950, 801742136, 801838815, 801777899, 801638186, 801641285, 801702142, 801621079, 801491141, 801460445, 801401556, 801182747, 800975442, 800921917, 800859332, 800668895, 800496697, 800412297, 800244510, 799941421, 799677968, 799493492, 799226344, 798854828, 798505306, 798161566, 797689080, 797112107]
2459.7G97112107n57184n85914p41005q44419q35895r43124j225233j425982j456261
2478.1G88497090j550018j762748j860857j831711j878678j962901j881837j681805
2494.4G74086535j525760j408755j232207j050771j023233j091599j123250j203477
2510.7G64427483j412094j542091j404285j118958q43525n36323j59383J85252M42087
2529G58038163O92129R81391J165390J149416J080274J034439R45806R11654J047551
2547.4G67046213J216173J208604J056432R45092Q62062O96361M99129M48644N25236
2565.8G74503946M71235K99573K36213K47717J85847Q7798O1869P8142L8326j2040
2586.2G76198626J847Q524m2320o6876j5080j4782j21891j42694k1100L4154j2577
$$ y = [797112107, 796554923, 795969009, 795228004, 794383585, 793547690, 792604566, 791379333, 789953351, 788497090, 786947072, 785184324, 783323467, 781491756, 779613078, 777650177, 775768340, 774086535, 772560775, 771152020, 769919813, 768869042, 767845809, 766754210, 765630960, 764427483, 763015389, 761473298, 760069013, 758950055, 758106530, 757570207, 757410824, 757596076, 758038163, 758730292, 759711683, 760877073, 762026489, 763106763, 764141202, 765087008, 765998662, 767046213, 768262386, 769470990, 770527422, 771472514, 772334576, 773030937, 773530066, 773978710, 774503946, 774975181, 775274754, 775510967, 775758684, 775944531, 776032329, 776094198, 776172340, 776210666, 776198626, 776200473, 776208997, 776166677, 776099801, 776084721, 776069939, 775948048, 775805354, 775784254, 775818408, 775805831]
2608.6G75805831J3530J25289J50800J04487J66833K78592K71261J95563K11120K92539
2629G77615845K91109K44975K88546L56019K97725K24412K62201K56061J29640N1260
2649.4G80017793Q5771R0361n186o1452k3007n0307j43111j55568j16706j52945k32041
2671.8G79253602k08557j43110j99259k93910k66731j88112j95861k48850k31742k15292
2692.2G77062178l03090l54826k70129k09212k68638l05235k70725k80320l45052l72290
2712.6G74082661l37363l12030l26455l33547l08156l02434l21090k85149k28286k53618
2733G71074533k90572k54333k20239k38955k69354k61366k44558k52604k47181k31087
2753.4G68564284k55525l20971l42906l03864l02375l62455m01140l78310l58046l76045
$$ y = [775805831, 775819361, 775944650, 776095450, 776199937, 776366770, 776645362, 776916623, 777112186, 777323306, 777615845, 777906954, 778151929, 778440475, 778796494, 779094219, 779318631, 779580832, 779836893, 779966533, 780017793, 780103564, 780193925, 780188739, 780127287, 780104280, 780053973, 779910862, 779755294, 779638588, 779485643, 779253602, 779045045, 778901935, 778702676, 778408766, 778142035, 777953923, 777758062, 777509212, 777277470, 777062178, 776759088, 776404262, 776134133, 775924921, 775656283, 775351048, 775080323, 774800003, 774454951, 774082661, 773745298, 773433268, 773106813, 772773266, 772465110, 772162676, 771841586, 771556437, 771328151, 771074533, 770783961, 770529628, 770309389, 770070434, 769801080, 769539714, 769295156, 769042552, 768795371, 768564284, 768308759, 767987788, 767644882, 767341018, 767038643, 766676188, 766275048, 765896738, 765538692, 765162647]
2773.8G65162647l78251l77119m10020m49777m74691n05150n54323n80311n67555n72264
2794.2G60293186o15239o35744o17206o08444o33895p25568q11517p97570p97748q82268
2814.6G53167987r33409r41992r97960j092434j140893j132250j188457j341104j483977
2832.9G42915511j624286j829445k006293k154767k480150k933621l121436k733707
2849.3G24031806j931727j173973o77884m14312l52323m44591o24776q42988j038253
2867.6G16530979j174093j176715r59873o93917o00159n82099n34773n78403o93322
2886G09537625p25686p06911p26223p49350o64711n31316n59926o95705p45118q34465
2906.4G02598214j148641j542032j817405j892567j735448j382828r32873n78224l24488
$$ y = [765162647, 764784396, 764407277, 763997257, 763547480, 763072789, 762567639, 762013316, 761433005, 760865450, 760293186, 759677947, 759042203, 758424997, 757816553, 757182658, 756457090, 755645573, 754848003, 754050255, 753167987, 752234578, 751292586, 750294626, 749202192, 748061299, 746929049, 745740592, 744399488, 742915511, 741291225, 739461780, 737455487, 735300720, 732820570, 729886949, 726765513, 724031806, 722100079, 720926106, 720248222, 719833910, 719481587, 719036996, 718412220, 717569232, 716530979, 715356886, 714180171, 713220298, 712526381, 711926222, 711344123, 710809350, 710230947, 709537625, 708811939, 708105028, 707378805, 706629455, 705964744, 705433428, 704873502, 704177797, 703432679, 702598214, 701449573, 699907541, 698090136, 696197569, 694462121, 693079293, 692146420, 691568196, 691243708]
2924.7F91243708k4855K89619N64277P79510R29832J018286J022458R43065Q36968
2943.1F97602868P56860O33597M04358J70112L6895l7908k3783J15991K64227M02630
2963.5G00325847N65171O94096P45654P66993Q44717R73999J009941R80795J072883
2981.8G07980096J161814J060069Q90135P76291P42853P67767P11918O25730O18935
3000.2G15335608N81502N08368M53830L49462K21372J64986J63018J35660M6313o5207
3020.6G17894912j94013l03507l43621l88741m59135n17428n05388m83870n90086o95050
3041G13414073o64532n95212n84066o28531o96898p32660o85751o15895o20961o86467
3061.4G06903100p23779o84381n96642n66125n99265o04391o26922o65128o25372n91993
$$ y = [691243708, 691218853, 691508472, 692072749, 692852259, 693782091, 694800377, 695822835, 696765900, 697602868, 698359728, 698993325, 699397683, 699567795, 699604690, 699566782, 699542999, 699658990, 699923217, 700325847, 700891018, 701585114, 702330768, 703097761, 703942478, 704916477, 705926418, 706907213, 707980096, 709141910, 710201979, 711092114, 711868405, 712611258, 713379025, 714090943, 714716673, 715335608, 715917110, 716425478, 716879308, 717228770, 717450142, 717615128, 717778146, 717913806, 717960119, 717894912, 717700899, 717397392, 717053771, 716665030, 716205895, 715688467, 715183079, 714699209, 714109123, 713414073, 712749541, 712154329, 711570263, 710941732, 710244834, 709512174, 708826423, 708210528, 707589567, 706903100, 706179321, 705494940, 704898298, 704332173, 703732908, 703128517, 702501595, 701836467, 701211095, 700619102]
3081.8G00619102o25611o13332n29825n03660n77628o26028n88357n62847o00457o49273
3102.2F94742084o53029o44743o92845p22348o86229o76989p22885p46847p46131q02636
3122.6F87647402q79764q79169q50916q86500r43183r41039r06825r30190r90391j009941
3143F78429484j042008j100540j086474j022160j045465j150608j199782j185715j180232
3161.3F68416500j198947j209915j196444j219988j288891j335859j310468j285434
3177.6F58370554j331985j339793j309514j349628j393258j363576j343608j366138
3193.9F47573054j379728j409293j448750j427412j357436j308620j315296j359224
3210.3F36567295j364112j320303j307845j337230j368761j376212j376569j391888
$$ y = [700619102, 699993491, 699380159, 698850334, 698346674, 697769046, 697143018, 696554661, 695991814, 695391357, 694742084, 694089055, 693444312, 692751467, 692029119, 691342890, 690665901, 689943016, 689196169, 688450038, 687647402, 686767638, 685888469, 685037553, 684151053, 683207870, 682266831, 681360006, 680429816, 679439425, 678429484, 677387476, 676286936, 675200462, 674178302, 673132837, 671982229, 670782447, 669596732, 668416500, 667217553, 666007638, 664811194, 663591206, 662302315, 660966456, 659655988, 658370554, 657038569, 655698776, 654389262, 653039634, 651646376, 650282800, 648939192, 647573054, 646193326, 644784033, 643335283, 641907871, 640550435, 639241815, 637926519, 636567295, 635203183, 633882880, 632575035, 631237805, 629869044, 628492832, 627116263, 625724375]
3226.6F25724375j370191j316369j307070j366794j410187j374840j353860j365781
3242.9F14859283j326859j304090j344383j337707j261353j216948j243592j266479
3259.2F04557872j245499j214206j191855j151800j079559j051664j082659j122177
3275.5E95418453j138866j070142j013934j076520j132071j132726j107812j056612
3291.8E86689770j076579j168370j228213j222969j155436j105070j189112j353681
3308.2E77190340j449407j491963j534760j539648j547754j624167j689911j684308
3324.5E64628422j709878j827896j927435j927257j912176j941324k010822k077758
3340.8E49293876k089799k111017k149046k143621k182782k302289k362669k338051
$$ y = [625724375, 624354184, 623037815, 621730745, 620363951, 618953764, 617578924, 616225064, 614859283, 613532424, 612228334, 610883951, 609546244, 608284891, 607067943, 605824351, 604557872, 603312373, 602098167, 600906312, 599754512, 598674953, 597623289, 596540630, 595418453, 594279587, 593209445, 592195511, 591118991, 589986920, 588854194, 587746382, 586689770, 585613191, 584444821, 583216608, 581993639, 580838203, 579733133, 578544021, 577190340, 575740933, 574248970, 572714210, 571174562, 569626808, 568002641, 566312730, 564628422, 562918544, 561090648, 559163213, 557235956, 555323780, 553382456, 551371634, 549293876, 547204077, 545093060, 542944014, 540800393, 538617611, 536315322, 533952653, 531614602]
3357.1E31614602k321065k350688k368748k294421k249837k367020k477169k369046
3373.4E12816608k144516j975357j877725j872003j852453j727462j533568j339048
3389.7D98494476j339018j503378j477033j201034j043081j206190j355648j198560
3406.1D88170534j003831r58383r39519r07599q54910p19547n73546n10961m26411
3424.4D81275827k67715j11132m2081N8800K27242K27869J29044K19017M38035N98073
3444.8D82752979P18027P61628P76559Q74281J007557J118809J186222J201719J229972
3463.2D91627753J350671J470953J370221J157463J180887J366496J531631J577854
3479.5E02633929J486719J474500J585066J620591J590132J623452J660705J684785
$$ y = [531614602, 529293537, 526942849, 524574101, 522279680, 520029843, 517662823, 515185654, 512816608, 510672092, 508696735, 506819010, 504947007, 503094554, 501367092, 499833524, 498494476, 497155458, 495652080, 494175047, 492974013, 491930932, 490724742, 489369094, 488170534, 487166703, 486208320, 485268801, 484361202, 483506292, 482786745, 482213199, 481702238, 481275827, 481008112, 480896980, 480854899, 480913699, 481140941, 481368810, 481497854, 481716871, 482154906, 482752979, 483471006, 484232634, 485009193, 485883474, 486891031, 488009840, 489196062, 490397781, 491627753, 492978424, 494449377, 495819598, 496977061, 498157948, 499524444, 501056075, 502633929, 504120648, 505595148, 507180214, 508800805, 510390937, 512014389, 513675094, 515359879]
3495.8E15359879J694679J737654J821399J727342J550854J648128J872956J956761
3512.1E29369652J928449J878977J897812J960694K089441K130032K008617J982152
3528.4E45245826K050758K114415K231300K306163K246380K281189K448022K541065
3544.7E63465118K398372K202392K304256K512097K485514K449631K586484K684296
3561.1E83088160K659142K846419L321886L146172K542496K552449K923310L131330
3577.4F06211364L234685L253221L128648L293455L778398L553748K950251L159523
3593.7F32563293L597736L504455L356576L373146L251374L258884L678799L784537
3610F60368800L504992L352463L113508L360808L737271K998173K311766K637744L967643
$$ y = [515359879, 517054558, 518792212, 520613611, 522340953, 523891807, 525539935, 527412891, 529369652, 531298101, 533177078, 535074890, 537035584, 539125025, 541255057, 543263674, 545245826, 547296584, 549410999, 551642299, 553948462, 556194842, 558476031, 560924053, 563465118, 565863490, 568065882, 570370138, 572882235, 575367749, 577817380, 580403864, 583088160, 585747302, 588593721, 591915607, 595061779, 597604275, 600156724, 603080034, 606211364, 609446049, 612699270, 615827918, 619121373, 622899771, 626453519, 629403770, 632563293, 636161029, 639665484, 643022060, 646395206, 649646580, 652905464, 656584263, 660368800, 663873792, 667226255, 670339763, 673700571, 677437842, 680436015, 682747781, 685385525, 689353168]
3628.4F89353168M144728K547205K162695K497136K556503K634108K611697K458453
3644.7G10965693K773583L669143L356099J758158J442909K295554K275586J760125
3661G30296850J731158J744627J774550K249062K290249J514554J774371J850664R17077
3679.4G46143162P93875J054167J235009J847922K258241J370252N72979O11484Q13186
3697.7G56700277R28700J031041Q98898O71983P87198J055062J000464L98278R716
3716.1G63481617K29299N25594N93960N13375L94642K61367K82943O48558R87828P67767
3736.5G68686950J54436l22521j85192P10845P79331R6798K43068L23534o0916q4817
3756.9G70341516J45435J47760n186J56462L18945K91049K08319p0513j46270J70589
$$ y = [689353168, 693497896, 696045101, 698207796, 700704932, 703261435, 705895543, 708507240, 710965693, 713739276, 717408419, 720764518, 722522676, 723965585, 726261139, 728536725, 730296850, 732028008, 733772635, 735547185, 737796247, 740086496, 741601050, 743375421, 745226085, 746143162, 746937037, 747991204, 749226213, 751074135, 753332376, 754702628, 755275607, 755887091, 756700277, 757628977, 758660018, 759558916, 760230899, 761018097, 762073159, 763073623, 763471901, 763481617, 763710916, 764236510, 764830470, 765343845, 765738487, 765999854, 766282797, 766931355, 767919183, 768686950, 768841386, 768518865, 768333673, 769044518, 769823849, 769920647, 770163715, 770487249, 770426333, 770341516, 770486951, 770634711, 770629525, 770785987, 771104932, 771395981, 771604300, 771533787, 771387517, 771558106]
3777.3G71558106M37140K12491j06692j0670J45197J44601J17898J06931K56956L02851
3797.7G73164809J78516L50117R4653l08097p5400n4955k04385Q94M58599M36961J26005
3820.1G74167717J45494j55925k99335q1062O7830K62260L17812K27571K01940m1604
3840.5G74812698l36408l44098k32577q8275N9724L97802N07295k51830n70655k06768
3860.9G73746908J75893K34187J907J6272J88410r6857k52903k00748j4901K01165
3881.3G73999333k8669m0472m947k27273r6798n0306k13683m589K97546J99437m7147
3903.7G73782432k32935l94821l15428q2135o914K7597J03831L159j56045j21295n9903
3926.1G72547543r8169l9816L9280o7234j97411j60515o6579q285k5570m5896K2710
$$ y = [771558106, 771995246, 772207737, 772101045, 772090375, 772235572, 772380173, 772498071, 772605002, 772861958, 773164809, 773343325, 773693442, 773788095, 773479998, 773404598, 773349643, 773145258, 773146152, 773604751, 774041712, 774167717, 774313211, 774157286, 773857951, 773776889, 773844719, 774106979, 774424791, 774652362, 774854302, 774812698, 774476290, 774132192, 773899615, 773811340, 773871064, 774268866, 774776161, 774524331, 773953676, 773746908, 773922801, 774156988, 774158895, 774175167, 774363577, 774266720, 774013817, 773813069, 773798168, 773999333, 773970664, 773930192, 773925245, 773697972, 773601174, 773550868, 773337185, 773332596, 773630142, 773829579, 773782432, 773549497, 773154676, 772839248, 772757113, 772750199, 772777796, 772881627, 772884786, 772728741, 772607446, 772547543, 772449374, 772409558, 772448838, 772381604, 772184193, 772023678, 771957099, 771948814, 771923244, 771877348, 771900058]
3948.6G71900058j7286j42633j70351j02400J8179N9068j8120o4551k8372r239j5020
3971G71409333K98K4497J6690l1472p510N8830J4305m8995l8922l1590j7584r596n1498
3997.5G71286786
$$ y = [771900058, 771882772, 771740139, 771569788, 771467388, 771485567, 771544635, 771526515, 771461964, 771433592, 771424353, 771409333, 771409631, 771434128, 771450818, 771419346, 771411836, 771470666, 771484971, 771435976, 771397054, 771365464, 771347880, 771338284, 771286786]
##END=$$ End of the data block
