##TITLE=DI16-0361810-6 $$ Begin of the data block
##JCAMP-DX=5.00 $$ ACD/SpecManager v 10.08
##SPECTROMETER/DATA SYSTEM=Alpha
##DATE=17 Mar 2016 10:50:26
##DATA TYPE=INFRARED SPECTRUM
##DATA CLASS=XYDATA
##ORIGIN=
##OWNER=
##NPOINTS=1765
##FIRSTX=399.76428223
##LASTX=3997.64306641
##MAXX=3997.64306641
##MINX=399.76428223
##MAXY=0.66636670
##MINY=0.31755820
##XFACTOR=1.0000000000
##YFACTOR=1.000000000000000e-9
##FIRSTY=0.58625072
##DELTAX=2.03961372
##XUNITS=1/CM
##YUNITS=ARBITRARY UNITS
##XYDATA=(X++(Y..Y))
399.8E86250722N80430n72502k165973j672030q71122j384675j434624j601339l104746
418.1E74024141k518594k46466l70800p20680o0618k17438p47799j62304Q6784n14328
438.5E68551898l65555j57476o98328n97119k00927j144112j883149j287937o99520
456.9E61517775N54562J684069P85530m40180m05729n36978j304150q21054P15o69300
477.3E60365260j073778o90639j099527j391053q42631j061082j479268r00269p86364
495.6E51040649j257538q85964n21004p95245n65827q3447k71558l41893j44839q90255
516E45283079j514971j093924j537383k805114l504872n013466q223533r666205m488408
534.4E07435203O575763J4621317J3124347O364882J595080K37584o42479k460777
$$ plain form
399.8 586250722 586831152 586258650 584092677 582420647 581549525 580164850 578730226 577128887 574024141
418.1 574024141 571505547 571259081 570888281 570167601 570106983 569889545 569141746 568979442 569066226 568551898
438.5 568551898 568186343 568028867 567330539 566733420 566532493 565388381 563505232 562217295 561517775
456.9 561517775 562072337 563756406 564541936 564101756 563696027 563159049 561854899 561033845 561034560 560365260
477.3 560365260 559291482 558600843 557501316 556110263 555267632 554206550 552727282 551827013 551040649
495.6 551040649 549783111 548897147 548376143 547580898 547015071 546931624 546660066 546318173 546173334 545283079
516 545283079 543768108 542674184 541136801 538331687 534826815 529813349 521589816 511923611 507435203
534.4 507435203 514010966 528632283 541756630 548121512 549716592 549954176 549311697 546850920
550.7E46850920l978789l939986l143013j407385N294442J3451398J3209402O501973
567E72838962J057565r81450r27627r89377j322866j001000p62046j114249r79960
585.4E65817952o91414j222491j517117j078963j144946j347899r55820j090408j672745
603.7E55096149j471519r64642j313448j895308k370060l093957l113807k281367k078236
622.1E36513805k406120j831651q56697o86288r80318q92222k30491Q14259J152695
640.4E30596972L32891l74496p96198j935363l615380m976570o789148r301662j1281401
658.8D91859645j2144745j2044132j0715693j1823296j2921036l689169N217284J0686457
675.1D44425315J1801630Q624703M069447J102775K034784P087290J4436901K1772206
$$ plain form
550.7 546850920 542872131 538932145 535789132 534381747 539676189 553127587 566336989 572838962
567 572838962 573896527 572915077 571987450 570998073 569675207 568674207 567912161 566797912 565817952
585.4 565817952 565126538 563904047 562386930 561307967 560163021 558815122 557859302 556768894 555096149
603.7 555096149 553624630 552659988 551346540 549451232 547081172 543987215 540873408 538592041 536513805
622.1 536513805 534107685 532276034 531419337 530733049 529752731 528860509 528630018 529444277 530596972
640.4 530596972 530929863 530555367 529759169 527823806 524208426 519231856 512442708 503141046 491859645
658.8 491859645 479714900 467670768 456955075 445131779 432210743 428521574 433738858 444425315
675.1 444425315 456226945 464851648 468921095 470023870 472058654 479145944 493582845 515355051
691.4E15355051K6568472K6864648K3432493J9106925J4612019R923219O380737M055441
707.7F46299005J902520M96865K79605k40684q91745p34389o17086j011134p85350
726.1F44697607m62890r29475j027405n66542o73294q62599l96490m07100p90417n02229
746.5F38079166l02434o98149n60641j13905l43024l61741J03355r5547n11646j88172
766.9F35007262k48074q69215p42793l40760n32865m24326R2328o9261k93791J550
787.3F31580055k30491q72136p74324n85794q85665p80702m95613p36475p64668m23789
807.7F25030398o65247j005054p43389p32302j118720r28283o30617q38816o00815
826F17767155l1233k52247o86228l28064K87235N17011N63264L22997l19898n49912
$$ plain form
691.4 515355051 541923523 568788171 592220664 611327589 625939608 635862827 642243564 646299005
707.7 646299005 648201525 648698390 648977995 648737311 647845566 647111177 646494091 645482957 644697607
726.1 644697607 644234717 643305242 642277837 641711295 641038001 640175402 639778912 639371812 638581395 638079166
746.5 638079166 637776732 637078583 636517942 636404037 636061013 635699272 635802627 635707080 635195434 635007262
766.9 635007262 634759188 633889973 633147180 632806420 632273555 631849229 631941557 631872296 631578505 631580055
787.3 631580055 631349564 630477428 629703104 629117310 628231645 627450943 626955330 626218855 625454187 625030398
807.7 625030398 624365151 623360097 622616708 621884406 620765686 619837403 619206786 618367970 617767155
826 617767155 617735922 617483675 616797447 616469383 616756618 617273629 617836893 618159890 617839992 617290080
846.4F17290080m29035p63178r74595p50184r74298j446306j392067j447499j876294
864.8F07236624j932144j991988k553403k779841k463818k186954j538813m53711M8578
883.2E91384530q1956j08540k76804p25150p35760n25058p46190q83818o98268q35478
903.5E85767508j021982p29680n91397q25107p16746n13256p44581q16583o19472p99179
923.9E78389525j045763r46283j072467j469195j601517j773536k213836k320647k164841
942.3E63781440k299726k281308j822591j586437j549482j233816j074911j297354
958.6E50635815j421571j659513k330422k894163l207565l777802m448711m921139
974.9E25974929n607187o582380p485032q591741j0068774j1294187j2137919j2835562
$$ plain form
846.4 617290080 616861045 616097867 615123272 614373088 613398790 611952484 610560417 609112918 607236624
864.8 607236624 605304480 603312492 600759089 597979248 595515430 593328476 591789663 591335952 591384530
883.2 591384530 591302574 591194034 590917230 590192080 589456320 588931262 588185072 587301254 586602986 585767508
903.5 585767508 584745526 584015846 583424449 582599342 581882596 581369340 580624759 579808176 579188704 578389525
923.9 578389525 577343762 576397479 575325012 573855817 572254300 570480764 568266928 565946281 563781440
942.3 563781440 561481714 559200406 557377815 555791378 554241896 553008080 551933169 550635815
958.6 550635815 549214244 547554731 545224309 542330146 539122581 535344779 530896068 525974929
974.9 525974929 520367742 513785362 506300330 497708589 487639815 476345628 464207709 451372147
991.3D51372147j3012380j2627035j2378186j2328208j1075884o502360J652748R339362
1007.6C94440204J1747926R738565Q410007J0611832J5159845J9263357K0701766J8844009
1023.9E08917511J5107810J1733830R291470O943405M595637K467871L12805j452684
1040.2E57917655k099872k112329k220154k194583k026677k043665k008378j909256
1056.5E41302741k117515k419651k532363k698957k839148k771199k947688l467441
1072.8E19508779l804326l969967m339397m729212m995584n445987n983085o255239
1089.2D79985982o434142o706089o923467p235885p730841p888407p409096o824433
1105.5D22833622o755025p158816p398039o889790n996287n833179o536692o821096
$$ plain form
991.3 451372147 438359767 425732732 413354546 401026338 389950454 383448094 385100842 394440204
1007.6 394440204 406188130 415926695 424336702 434948534 450108379 469371736 490073502 508917511
1023.9 508917511 524025321 535759151 545050621 551994026 556589663 559057534 559370339 557917655
1040.2 557917655 555817783 553705454 551485300 549290717 547264040 545220375 543211997 541302741
1056.5 541302741 539185226 536765575 534233212 531534255 528695107 525923908 522976220 519508779
1072.8 519508779 515704453 511734486 507395089 502665877 497670293 492224306 486241221 479985982
1089.2 479985982 473551840 466845751 459922284 452686399 444955558 437067151 429658055 422833622
1105.5 422833622 416078597 408919781 401521742 394631952 388635665 382802486 376265794 369444698
1121.8C69444698o103068n116821m141658k732128j013279M69953J645624K767742
1138.1C55221063M118115N859553P725090R164721R946018R894640Q517086N877257
1154.4D16323543L433764L371864O933659J3041795J8524974K0619989J9270807J6179502
1170.7E17699897J2585461R085000O148219L866792K166211J101613M14491k56300
1187.1E52811384p70747j033545j333475j616418j626194j582742j613855j479626
1203.4E41754782j287758j230717j137853j021087j079142j093328q32140o10054n80311
1221.7E32882392m65512k83718j81556j3470J77919J78695J38283K36511K72095K03491
1242.1E33145130K78353M17769M74394O11663P39395N59688K66611J24395l9160k68638
$$ plain form
1121.8 369444698 363341630 358224809 354083151 351351023 350337744 350807697 352453321 355221063
1138.1 355221063 359339178 365198731 372923821 382088542 392034560 401929200 410446286 416323543
1154.4 416323543 419757307 423129171 430062830 443104625 461629599 482249588 501520395 517699897
1170.7 517699897 530285358 539370358 545518577 549385369 551551580 552653193 553067684 552811384
1187.1 552811384 552040637 551007092 549673617 548057199 546431005 544848263 543234408 541754782
1203.4 541754782 540467024 539236307 538098454 537077367 535998225 534904897 534072757 533462703 532882392
1221.7 532882392 532416880 532133162 531951606 531938136 532116055 532294750 532433033 532669544 532941639 533145130
1242.1 533145130 533423483 533841252 534315646 534927309 535666704 536226392 536493003 536617398 536578238 536309600
1262.5E36309600m51028p11918j041890j106917r26793q78334r01580q42035r33528
1280.9E28515577j142382j209200j293182j448333j426161j344144j418293j423716
1297.2E17810166j254261j180887j152456r89258q66592q74698q23557p00415o57975
1315.6E09310067n98014l43620j20163n5492P7188J83522K04981K98142K75552j7762
1336E09214401j24156L13043O94394N33164K39968N3346r2625j23143j79470l12924
1356.4E10215998m79877q20160r58026l99768k7418k17974l07799l30984j00136K84195
1376.7E06858051k66493j993596k579928O60778N628049P201850N085886L034890K278208
1395.1E25907695K274216K487063K586961K036214J711189J983762J871467J580000
$$ plain form
1262.5 536309600 535858572 535146654 534104764 532997847 532071054 531192720 530291140 529449105 528515577
1280.9 528515577 527373195 526163995 524870813 523422480 521996319 520652175 519233882 517810166
1297.2 517810166 516555905 515375018 514222562 513233304 512366712 511492014 510668457 509968042 509310067
1315.6 509310067 508712053 508368433 508248270 508192778 508269966 508453488 508658469 508956611 509232163 509214401
1336 509214401 509090245 509403288 510097682 510630846 510870814 510924160 510831535 510708392 510528922 510215998
1356.4 510215998 509736121 508915961 507957935 507558167 507530749 507312775 507004976 506673992 506573856 506858051
1376.7 506858051 506591558 504597962 502018034 502678812 508306861 515508711 520594597 523629487 525907695
1395.1 525907695 528181911 530668974 533255935 535292149 537003338 538987100 540858567 542438567
1411.4E42438567J472294R52184J09434M69566J357138J052260O95765M49062N6684
1429.8E49052954K03967J26660m52161L03387J425982J205444O06537L27766P24912
1448.1E53525448J441419J468539O87421p0572J715779L675163K804935J741886K173960
1466.5E69163978K289415J032233N09143J949191K833605K426147J739264J240253
1482.8E83183229M66764o49452j085282q8930M93586p00473j774252q57234J35362
1501.2E79123318n88238k997279l325701P11918J581132K50995q63194j053095q55565
1519.5E71984291o26326N97179J158476J273990J324236M35174L11851J154542L9935
1537.9E77653348j418709R70006L135085L062546K221823J527965J240909Q14736j42932
$$ plain form
1411.4 542438567 543910861 544863045 544972479 545442045 546799183 547851443 548547208 548996270 549052954
1429.8 549052954 549256921 549383581 548931420 549234807 550660789 551866233 552472770 552800536 553525448
1448.1 553525448 554966867 556435406 557122827 557052255 558768034 562443197 565248132 566990018 569163978
1466.5 569163978 571453393 572485626 572994769 574943960 577777565 580203712 581942976 583183229
1482.8 583183229 583649993 583000541 581915259 581826329 582319915 581619442 579845190 578987956 579123318
1501.2 579123318 578535080 575537801 572212100 572924018 574505150 574756145 573892951 572839856 571984291
1519.5 571984291 571357965 571955144 573113620 574387610 575711846 576147020 576458871 577613413 577653348
1537.9 577653348 576234639 577204645 580339730 583402276 585624099 587152064 588392973 589207709 589064777
1556.2E89064777q96096K444386M233301K506971R96471K14815O93321J236439J94192
1574.6F00688577L934J500010J575649Q78274M88699J89662n7936l31581p58409j038432
1595F03138447j112223j440585j931011k074659k057910k151072j980305j573562j669527
1613.4E87147593k378225j616001L94046M41730K16604R58740J339853J721919J768827
1631.7E89995086Q80718J406968M055798M705608L918707K897561K562582M238666
1648F14661694M348158K760888M817187O800711N217195L414810K757370L294170K698243
1666.4F50770426J227140J585841K435685J848340J883506J962841O72042j129508
1682.7F61256313m41372K260983K038896J082778J69098j639902k111733j229465n0605
$$ plain form
1556.2 589064777 588168681 590613067 594846368 597353339 598349810 598564625 599257946 600494385 600688577
1574.6 600688577 600692511 602192521 603768170 604646444 605135143 605324805 605266869 604935288 604176879 603138447
1595 603138447 602026224 600585639 598654628 596579969 594522059 592370987 590390682 588817120 587147593
1613.4 587147593 584769368 583153367 583547413 583989143 584205747 585164487 586504340 588226259 589995086
1631.7 589995086 590875804 592282772 596338570 601044178 604962885 607860446 610423028 614661694
1648 614661694 619009852 621770740 626587927 633388638 638605833 642020643 644778013 648072183 650770426
1666.4 650770426 651997566 653583407 656019092 657867432 659750938 661713779 662385821 661256313
1682.7 661256313 660814941 663075924 665114820 666197598 666366696 664726794 662615061 661385596 661334991
1701.1F61334991J248003O54757K41577M12643j78873j247347k409935k150893M60565
1719.4F58365488J335502K06053m57227q55029j425922j965344k383470n54443M92990
1737.8F52758598n46038q23915n57005q14557j319707j377165j98007L48270n63323
1756.1F46907151r24170q46923r18984l08752m33445j297474j779139j360357J88172
1774.5F39226079O19709k16245p04467o65486o83606n22792o76275j471996j147211
1792.8F33757710J43171M1783p64191q22187k73228q3148m27365q86143q52286l16620
1813.2F29517496k73228o08504n49674n64873j076520j133561p75277q54850l01898
1831.6F23379111K48850k49267o20484m97699r18210j566231p16388K86996Q2076l07262
$$ plain form
1701.1 661334991 662582994 663237751 663479328 663891971 663713098 662465751 660055816 657904923 658365488
1719.4 658365488 659700990 659907043 659449816 658594787 657168865 655203521 652820051 652265608 652758598
1737.8 652758598 652212560 651388645 650831640 650017083 648697376 647320211 647122204 647470474 646907151
1756.1 646907151 645982981 645136058 644217074 643908322 643474877 642177403 640398264 639037907 639226079
1774.5 639226079 639845788 639629543 638925076 638259590 637575984 637053192 636376917 634904921 633757710
1792.8 633757710 633900881 633942664 633178473 632356286 632083058 631999910 631572545 630686402 629834116 629517496
1813.2 629517496 629244268 628635764 628086090 627521217 626444697 625311136 624535859 623681009 623379111
1831.6 623379111 623627961 623378694 622758210 622260511 621342301 619776070 619059682 619346678 619428754 619121492
1852F19121492m33087n26429o36995n46932m60624p01189j208961j303673l68834L52025
1872.4F13286793N4837m24505n77450n18500m97163n62191o64890q42392o32763l02076
1892.8F08319700l75808m15384l80755m27902m89175n84125o57320o10233m52399l49641
1913.2F03576958n73098r35078p43270l94881l65436k45929k15232l70979n03481n32388
1933.6E98697186m57168m80354o96123q51452n71847k46882k45035l30687m60863n28633
1954E93828142m65930m71115n28634m56512m87744o68168n31435k79606l78251m99725
1974.4E89061022m31359m25994m77255m44293m57406n75602n88596n72443n09977k80738
1994.8E84297359k49803m51148n20229m30047m34340n09977m29392l13639l44634l96431
$$ plain form
1852 619121492 618688405 618161976 617524981 616978049 616517425 615816236 614607275 613303602 612934768 613286793
1872.4 613286793 613341630 612917125 612339675 611821175 611324012 610761821 610096931 609254539 608621776 608319700
1892.8 608319700 607943892 607528508 607147753 606719851 606230676 605646551 604989231 604378998 603926599 603576958
1913.2 603576958 603003860 602068782 601325512 600930631 600565195 600319266 600104034 599733055 599229574 598697186
1933.6 598697186 598240018 597759664 597063541 596212089 595640242 595393360 595148325 594817638 594356775 593828142
1954 593828142 593362212 592891097 592362463 591905951 591418207 590750039 590218604 589938998 589560747 589061022
1974.4 589061022 588629663 588203669 587726414 587282121 586824715 586249113 585660517 585088074 584578097 584297359
1994.8 584297359 584047556 583596408 583076179 582646132 582211792 581701815 581272423 580958784 580614150 580217719
2015.2E80217719l72171l81470m89771o72937p01904k95341R7751j5616k66910k98619
2035.6E76820731k87950m06444m25160k89261k95639l81470l47733l26455l77715l32653
2056E73350251k67387l38077l97623l51608l18586l08812k55704k58982l39747l28660
2076.4E70185065k73645k95818k77519k22861k63751l14355k67267k33770k68697k52724
2096.8E67514658k24113k67566k76565k56598k95639k99752k50816k80381l31282k92480
2117.1E64739466k88904l36766k81394k02894k23041k21550j61350j53363j61409j09255
2137.5E62599540n9545p7188j06573j09375j20461j14441p9214r1136j35183j21475
2157.9E61584949r7990j18374j09256r3758j31786j03652j5974l6001j03295r9004
$$ plain form
2015.2 580217719 579845548 579464078 578974307 578301370 577599466 577304125 577401876 577386260 577119350 576820731
2035.6 576820731 576532781 576126337 575701177 575411916 575116277 574734807 574387074 574060619 573682904 573350251
2056 573350251 573082864 572744787 572347164 571995556 571676970 571368158 571112454 570853472 570513725 570185065
2076.4 570185065 569911420 569615602 569338083 569115222 568851471 568537116 568269849 568036079 567767382 567514658
2096.8 567514658 567290545 567022979 566746414 566489816 566194177 565894425 565643609 565363228 565031946 564739466
2117.1 564739466 564450562 564113796 563832402 563629508 563406467 563184917 563023567 562870204 562708795 562599540
2137.5 562599540 562539995 562462807 562356234 562246859 562126398 562011957 561932743 561841607 561706424 561584949
2157.9 561584949 561486959 561368585 561259329 561165571 561033785 560930133 560914159 560878158 560774863 560675859
2178.3E60675859j06096j52647j48833j46747j90258j89185j47045j51157j89543j98424
2198.7E59055924k08973k51353k37167j69933j64986j98185k02775k20478k52008k25842
2219.1E56924224j91987k15053k24054k09689k25842k26736j85609j83523k18034k18928
2239.5E54824769k29477k70605k47777j90496k03431k31385k29299k46585k52604k05040
2259.9E52518070j87040k20656k08080j81973k09510k16186j82510j81555j99020j90914
2280.3E50540626j75655j73390j63316j62781k13444k50399k33889k31266k50339k47419
2300.7E48438728k35081k42174k54094k77460l20732k95461k02775k17557l52501m46678
2321.1E45594215m40061l18229k14994l24786m29570l50476l54468m45664m31538Tn69105
$$ plain form
2178.3 560675859 560569763 560417116 560268283 560121536 559931278 559742093 559595048 559443891 559254348 559055924
2198.7 559055924 558846951 558595598 558358431 558188498 558023512 557825327 557622552 557402074 557150066 556924224
2219.1 556924224 556732237 556517184 556293130 556083441 555857599 555630863 555445254 555261731 555043697 554824769
2239.5 554824769 554595292 554324687 554076910 553886414 553682983 553451598 553222299 552975714 552723110 552518070
2259.9 552518070 552331030 552110374 551902294 551720321 551510811 551294625 551112115 550930560 550731540 550540626
2280.3 550540626 550364971 550191581 550028265 549865484 549652040 549401641 549167752 548936486 548686147 548438728
2300.7 548438728 548203647 547961473 547707379 547429919 547109187 546813726 546610951 546393394 546040893 545594215
2321.1 545594215 545154154 544835925 544620931 544296145 543866575 543516099 543161631 542715967 542284429 541852891 541283786
2343.5E41283786l06606N22256P54893N7578p52211r52184p96258n56112l68356l04819
2363.9E38581967k01165m0889L278j4663M2916J37925J85788J98304J89722J15573
2384.3E39198756n36r0778j66595k32637k32458j94192j91689j99258j99914k48372
2404.7E37442327k86997k27451j89841k38061k42650k21014k63215k89678k59221k48253
2425.1E34975946k25425j48415j33992j86562j88232j71840j93000k11000k06649j99140
2445.5E33111691j84893j77324k06530k31206k05100j82629k04503k23220k10225k04861
2465.9E31081200k05279j93238k23637k63333k22385j67668j76847j97708k17080k47479
2486.3E28966546k17259j58250j92642k64764k42234j91807k15054k20597j86264k06828
$$ plain form
2343.5 541283786 540977180 541499436 542254329 542311907 541559696 540607512 539811254 539255142 538886786 538581967
2363.9 538581967 538380802 538339913 538343191 538328528 538371444 538509369 538695157 538893461 539083183 539198756
2384.3 539198756 539198220 539107442 538940847 538708210 538475752 538281560 538089871 537890613 537690699 537442327
2404.7 537442327 537155330 536927879 536738038 536499977 536257327 536036313 535773098 535483420 535224199 534975946
2425.1 534975946 534750521 534602106 534468114 534281552 534093320 533921480 533728480 533517480 533310831 533111691
2445.5 533111691 532926798 532749474 532542944 532311738 532106638 531924009 531719506 531496286 531286061 531081200
2465.9 531081200 530875921 530682683 530459046 530195713 529973328 529805660 529628813 529431105 529214025 528966546
2486.3 528966546 528749287 528591037 528398395 528133631 527891397 527699590 527484536 527263939 527077675 526870847
2506.7E26870847k26081j96159j99914k11954j68442j69278k33113k28227j87933k02775
2527.1E24846971k10106k05756k35617k10225j44661j87754k51115j91033j37686j81318
2547.5E22891700k16722k12252k02716j68562j38163j81616k19524j73091j42217j70052
2567.9E21066785j90497j94072k03789j94907j87993k28643k36809j72914j42574j66774
2588.3E19147813j70886j65940k06232k30491k01881k03967k13146j89364j83284j78457
2608.7E17204165j59502j70826k08319k12609j86265j92344k06173j76668j65701k05993
2629.1E15319765k27392k13683j85609j54972j65462k00987k03371j91510j99020k04265
2649.5E13373494j82271j65462j79768j98603j97351k00629k06649j84834j78397j93834
$$ plain form
2506.7 526870847 526644766 526448607 526248693 526036739 525868297 525699019 525465906 525237679 525049746 524846971
2527.1 524846971 524636865 524431109 524195492 523985267 523840606 523652852 523401737 523210704 523073018 522891700
2547.5 522891700 522674978 522462726 522260010 522091448 521953285 521771669 521552145 521379054 521236837 521066785
2567.9 521066785 520876288 520682216 520478427 520283520 520095527 519866884 519630075 519457161 519314587 519147813
2588.3 519147813 518976927 518810987 518604755 518374264 518172383 517968416 517755270 517565906 517382622 517204165
2608.7 517204165 517044663 516873837 516665518 516452909 516266644 516074300 515868127 515691459 515525758 515319765
2629.1 515319765 515092373 514878690 514693081 514538109 514372647 514171660 513968289 513776779 513577759 513373494
2649.5 513373494 513191223 513025761 512845993 512647390 512450039 512249410 512042761 511857927 511679530 511485696
2669.9E11485696j80662j66714j86026j89126j65403j92225k42710k25484k01404k29240
2690.3E09506702k13623j49905j57655k17735k28882k10405k11298k01523j86742j92582
2710.7E07536352j72675j46449j69873j93536j87397j96219k17318k20597k24411k24770
2731.1E05583107j93774j67907j99973k34485k04861j80900j94788k02417k01643j88172
2751.4E03614187j79291k14576k47717j97351j37925j81377k35737k19404k03908j93536
2771.8E01603365j59800j65701k14696k32458k28286k29239j94013j53780j94341k44260
2792.2D99586791k13951j86384k23338k67029k64406k41787k29954k24591k59429k94953
2812.6D97180969k46853k12878k51681k61903k36749k28137k33293k39878k54006k58654
$$ plain form
2669.9 511485696 511305034 511138320 510952294 510763168 510597765 510405540 510162830 509937346 509735942 509506702
2690.3 509506702 509293079 509143174 508985519 508767784 508538902 508328497 508117199 507915676 507728934 507536352
2710.7 507536352 507363677 507217228 507047355 506853819 506666422 506470203 506252885 506032288 505807877 505583107
2731.1 505583107 505389333 505221426 505021453 504786968 504582107 504401207 504206419 504004002 503802359 503614187
2751.4 503614187 503434896 503220320 502972603 502775252 502637327 502455950 502220213 502000809 501796901 501603365
2771.8 501603365 501443565 501277864 501063168 500830710 500602424 500373185 500179172 500025392 499831051 499586791
2792.2 499586791 499372840 499186456 498963118 498696089 498431683 498189896 497959942 497735351 497475922 497180969
2812.6 497180969 496934116 496721238 496469557 496207654 495970905 495742768 495509475 495269597 495015591 494756937
2833D94756937k26766k20895l08513m21286m67896m62830m49598m64946m60476l42846
2853.4D90930885j80244j00822j13844j64897k02417k03908k00927k02924k07662k47151
2873.8D89106089k95043l05236k98023l03238k97994k73883k51770k58595k96831k98560
2894.2D86226916k68221k88456l38733l46691l27170l15428k87801k51114k85447m20332
2914.6D83097523n42104n58466m83781l59058k50608j46925n8800r4265j46419q5652
2935D80371445m2826m8398J2755N6028n2958k10703k58654k22981k35081l10123l39955
2957.4D78718549l22074l24964l44247l72201l87132l67582l19809k49088j88052j07378
2977.8D75736022j6928l6299j19924j45376j20640o0976n5819j63406k47390k81572
$$ plain form
2833 494756937 494530171 494309276 494000763 493579477 493111581 492648751 492199153 491734207 491273731 490930885
2853.4 490930885 490750641 490649819 490535975 490371078 490168661 489964753 489763826 489560902 489353240 489106089
2873.8 489106089 488811046 488505810 488207787 487904549 487606555 487332672 487080902 486822307 486525476 486226916
2894.2 486226916 485958695 485670239 485331506 484984815 484657645 484342217 484054416 483803302 483517855 483097523
2914.6 483097523 482555419 481996953 481513172 481154114 480903506 480756581 480697781 480603516 480457097 480371445
2935 480371445 480328619 480280221 480292976 480349004 480296046 480085343 479826689 479603708 479368627 479058504 478718549
2957.4 478718549 478396475 478071511 477727264 477355063 476967931 476600349 476280540 476031452 475843400 475736022
2977.8 475736022 475719094 475682795 475562871 475417495 475296855 475235879 475180060 475016654 474769264 474487692
2998.2D74487692l10451k90572k57403k41607k07246j52737j59233k63840l55125l66360
3018.6D71883118l60936l41654l04490k97934k90364k59459k20388k38657l09914k83003
3039D68976319k27064k80947l73959m10169l49015k86788l26812l79444l97294l93808
3059.4D65551019l41833k84105k50191k91556m06116m36396l64631k78443k47866l35038
3079.8D62314844m16666m11332m23312m36544m31776m90189n52863n03302l83406l70235
3100.2D57895219m78416n01514l89308l35306m31716m54724l44991l45678m53889n86659
3120.6D53573018p02500o57141n03004m26799m90695n62668n01603m16189m49241n82784
3141D48280394o73383o21587n19485m53084m36217n29706o75351p24226o90133o49929
$$ plain form
2998.2 474487692 474177241 473886669 473629266 473387659 473180413 473027676 472868443 472604603 472249478 471883118
3018.6 471883118 471522182 471180528 470876038 470578104 470287740 470028281 469807893 469569236 469259322 468976319
3039 468976319 468749255 468468308 468094349 467684180 467335165 467048377 466721565 466342121 465944827 465551019
3059.4 465551019 465209186 464925081 464674890 464383334 463977218 463540822 463176191 462897748 462649882 462314844
3079.8 462314844 461898178 461486846 461063534 460626990 460195214 459705025 459152162 458648860 458265454 457895219
3100.2 457895219 457416803 456915289 456525981 456190675 455758959 455304235 454959244 454613566 454159677 453573018
3120.6 453573018 452870518 452213377 451710373 451283574 450792879 450230211 449728608 449312419 448863178 448280394
3141 448280394 447607011 446985424 446465939 446012855 445576638 445046932 444371581 443647355 442957222 442307293
3161.4D42307293o37173o59943o80685o72012o40631o22660o55443o93798o77436o76334
3181.8D35691178p07716p05123p07269p46399p80642p97897q14975q01682p47204p27117
3202.2D28155154p56860p86274q18283q24869p89910p71523q01801q48949q39830q08179
3222.6D20108676q42392q68768q08150p02858o67035q26895r89586r30816q30502p86960
3243D11854714p10487o86735p82907q27909p34090o48499o75976p05213o63131o44118
3263.4D04775649o42150n39691m24981n37783p37190p68363p26194p08311p06882p05957
3283.8C98278147o92427o38217n48899n53370o66082q18341r67235r55701p54803n83649
3304.2C91099423o96301j039118j273185j264006j114189j024813j074761j094669
$$ plain form
3161.4 442307293 441670120 441010177 440329492 439657480 439016849 438394189 437738746 437044948 436367512 435691178
3181.8 435691178 434983462 434278339 433571070 432824671 432044029 431246132 430431157 429629475 428882271 428155154
3202.2 428155154 427398294 426612020 425793737 424968868 424178958 423407435 422605634 421756685 420916855 420108676
3222.6 420108676 419266284 418397516 417589366 416886508 416219473 415392578 414402992 413472176 412641674 411854714
3243 411854714 411144227 410457492 409674585 408846676 408112586 407464087 406788111 406082898 405419767 404775649
3263.4 404775649 404133499 403593808 403168827 402631044 401893854 401125491 400399297 399690986 398984104 398278147
3283.8 398278147 397585720 396947503 396398604 395845234 395179152 394360811 393393576 392437875 391683072 391099423
3304.2 391099423 390403122 389364004 388090819 386826813 385712624 384687811 383613050 382518381
3320.5C82518381j013965j008421j197159j368076j351386j297206j250594j167834
3336.8C72863740j253188j485497j583248j617163j580149j415760j530915j886189
3353.1C60511631j950979j743734j622200j705140j744777j550645j446962j718134
3369.4C47029060k078056k071232j783222j600116j540900j527100j499117j344263
3385.7C33585054j077772q80151r92388j252651j220137q52496o38425r42796j285136
3404.1C24443102j131356q10116p02531p18534p68393p67290o44595n49286m61340
3422.5C17889661k62022o9440J6511J2308J02967K59042J63585o2376k1577K48849
3442.9C18277508M41074N51224O89805P68363Q06004Q97765R81033J011044R76622
$$ plain form
3320.5 382518381 381504416 380495995 379298836 377930760 376579374 375282168 374031574 372863740
3336.8 372863740 371610552 370125055 368541807 366924644 365344495 363928735 362397820 360511631
3353.1 360511631 358560652 356816918 355194718 353489578 351744801 350194156 348747194 347029060
3369.4 347029060 344951004 342879772 341096550 339496434 337955534 336428434 334929317 333585054
3385.7 333585054 332507282 331627131 330634743 329382092 328161955 327309459 326671034 325728238 324443102
3404.1 324443102 323311746 322501630 321799099 321080565 320312172 319544882 318900287 318351001 317889661
3422.5 317889661 317627639 317558199 317574710 317587018 317689985 317949027 318112612 318050236 318028659 318277508
3442.9 318277508 318718582 319269806 319959611 320727974 321533978 322431743 323412776 324423820 325400442
3461.2C25400442J054138J315594J386046J100093Q27253Q96007J157313J342655J254618
3479.6C35734159J037299J100213J287013J265675J231998J304805J313806J292467
3495.9C45567435J279354J243353J181245J154423J210719J247048J343459J553804
3512.2C55780840J560777J345486J252562J339703J434416J384646J283914J369416
3528.5C66751760J610697J739412J699150J603484J572728J641303J572818J378357
3544.8C79569709J454711J717150J692385J671523J865268J874148J767010J749784
3561.1C93361688J524359J065135J420408K576679K842546K341866K070695K127171
3577.5D09330547K290577K427011K218366J607001J610070K612591K814919K262026
$$ plain form
3461.2 325400442 326454580 327770174 329156220 330256313 331083566 331979573 333136886 334479541 335734159
3479.6 335734159 336771458 337871671 339158684 340424359 341656357 342961162 344274968 345567435
3495.9 345567435 346846789 348090142 349271387 350425810 351636529 352883577 354227036 355780840
3512.2 355780840 357341617 358687103 359939665 361279368 362713784 364098430 365382344 366751760
3528.5 366751760 368362457 370101869 371801019 373404503 374977231 376618534 378191352 379569709
3544.8 379569709 381024420 382741570 384433955 386105478 387970746 389844894 391611904 393361688
3561.1 393361688 394886047 395951182 397371590 399948269 402790815 405132681 407203376 409330547
3577.5 409330547 411621124 414048135 416266501 417873502 419483572 422096163 424911082 427173108
3593.8D27173108K245217K514929K484202K506048K424061J854390J578242J932978
3610.1D44713175K149701K272070K118617J660466K112508K763778K238125Q03560
3626.4D60832000m7565J581639K693713K094090J570225J259923J050114R69947M34369
3644.8D72438455p71374j127511R21041K255588J257211N07057R39369Q18283L63648
3663.1D77601767J64091n65558j441420o42240k10434j012623K45124J519412J195073
3681.5D76853192P30365M2081j138568j337140K88009J240075Q77857K13832m43936
3699.8D77325767o15924R8526L17305n22047j402914q78632P37816R87887P9423n82128
3720.2D75545079o05166l93302n7399K71440k76208j390189j543433j64836J217693
$$ plain form
3593.8 427173108 429418325 431933254 434417456 436923504 439347565 441201955 442780197 444713175
3610.1 444713175 446862876 449134946 451253563 452914029 455026537 457790315 460028440 460832000
3626.4 460832000 460784435 462366074 465059787 467153877 468724102 469984025 471034139 472004086 472438455
3644.8 472438455 471667081 470539570 471460611 473716199 474973410 475480467 476419836 477238119 477601767
3663.1 477601767 477765858 477200300 475758880 475116640 474906206 473893583 474138707 475658119 476853192
3681.5 476853192 477583557 477625638 476487070 475149930 475437939 476678014 477555871 477769703 477325767
3699.8 477325767 476709843 476808369 477125674 476603627 475200713 474322081 475059897 476047784 476127207 475545079
3720.2 475545079 474939913 474546611 474489212 474760652 474484444 473094255 471550822 471385986 472603679
3738.6D72603679R20266r60410j794070o3360q2910j021623M12523J395136N10067
3756.9D71919298k60770J90198L96699j92523m85331m72158L457N71609L03357m10884
3777.3D71562952o60300j64479k39j48773N6863J19775n6058l86983p44611o30826
3797.7D68947321r18746r89437K41488K29091l5882P42435N83291o71923j319766o91503
3818.1D66116369p66933k95073Q87901N95897J01388j71334m41968n00769r50605j012921
3838.5D63561952j2159N99682P46310P44253J96189j240224k827048r23157J809389
3856.9D62655187J416742K8283q14974m93348q2195o15895m79310L05831O00129L99590
3877.3D62920040m70668n17994o5625k78026J40876J06841m76241J29700M77403m40091
$$ plain form
3738.6 472603679 473523945 472563535 470769465 470706105 470623195 469601572 470014095 471409231 471919298
3756.9 471919298 471658528 471848726 472245425 472052902 471567571 471095413 471098870 471670479 471973836 471562952
3777.3 471562952 470902652 470738173 470737934 470589161 470646024 470765799 470709741 470322758 469578147 468947321
3797.7 468947321 468028575 467039138 467280626 467509717 467473835 468216270 468799561 468127638 466807872 466116369
3818.1 466116369 465349436 465054363 465942264 466538161 466639549 466468215 466026247 465525478 464574873 463561952
3838.5 463561952 463549793 464149475 464895785 465640038 465836227 464596003 461768955 460845798 462655187
3856.9 462655187 464071929 464100212 463285238 462791890 462709695 462093800 461614490 461920321 462520450 462920040
3877.3 462920040 462449372 461931378 461865753 461587727 461728603 461835444 461359203 461488903 461966306 461526215
3897.7D61526215j148254q89659k11447O46353J001477N37425L3230k83808o50763
3916D60560769n91606k4051J55300q7261o497N9247l07977l62515J01328K93731N7161
3938.5D59847629k85000m00245j45495q1747k23041q6546O0260O914m5955q8632j39534
3960.9D58418608p4446k832p4953j75535j95027j47700n6595j311m2885q3149r5039
3983.3D57469136j26094j29074j23709j48803j35661r1224p6265
3997.6D56638306
$$ plain form
3897.7 461526215 460377961 459488302 459276855 459923208 460924685 461462110 461495340 461211532 460560769
3916 460560769 459969163 459945112 460100412 460013151 460006654 460065901 459757924 459395409 459496737 459790468 459847629
3938.5 459847629 459562629 459162384 459016889 458935142 458712101 458625555 458685815 458692729 458646774 458558142 458418608
3960.9 458418608 458344162 458341330 458266377 458090842 457895815 457748115 457691520 457690209 457647324 457564175 457469136
3983.3 457469136 457343042 457213968 457090259 456941456 456805795 456714571 456638306
3997.6 456638306
##END=$$ End of the data block
