##TITLE=DI16-0360547-0 $$ Begin of the data block
##JCAMP-DX=5.00 $$ ACD/SpecManager v 10.08
##SPECTROMETER/DATA SYSTEM=Alpha
##DATE=17 Mar 2016 10:50:26
##DATA TYPE=INFRARED SPECTRUM
##DATA CLASS=XYDATA
##ORIGIN=
##OWNER=
##NPOINTS=1765
##FIRSTX=399.76428223
##LASTX=3997.64306641
##MAXX=3997.64306641
##MINX=399.76428223
##MAXY=0.77006352
##MINY=0.47336698
##XFACTOR=1.0000000000
##YFACTOR=1.000000000000000e-9
##FIRSTY=0.72610253
##DELTAX=2.03961372
##XUNITS=1/CM
##YUNITS=ARBITRARY UNITS
##XYDATA=(X++(Y..Y))
399.8 726102531 726937532 725942910 725250840 725512564 724665880 722721040 721677601 720898509 718367398
418.1 718367398 715926468 715964556 716538072 716141820 715599120 716074705 716515720 715566456 714704096 715177298
438.5 715177298 715186656 713850021 713222146 714035928 714108586 712623954 711568654 711526513 710980833 710516393
458.9 710516393 711681068 713237941 713021994 711498380 710866034 710870206 710022032 709105253 709386170 709814429
479.3 709814429 708745420 707340300 707460463 707707286 706449866 705279887 705515146 705361784 703758180
497.7 703758180 702476025 702617586 702668250 701688647 701274037 701953530 701875567 700637162 699865103 699851453
518.1 699851453 699108362 697403431 695879042 694447458 691478848 686311364 680522680 677507758 680405676
536.4 680405676 688063502 695662141 699885964 700789571 700504661 700716078 700548112 698505223 695896089
554.8 695896089 694417715 693475783 695013821 701731920 709781468 713993490 714501798 714138329 714239776
573.1 714239776 714064717 713221550 712656856 712927818 712982237 712130368 711380780 711351275 711108446 710205078
593.5 710205078 709691763 709928811 709744751 708770752 708170176 708178103 707701921 706489801 705543756 704857469
613.9 704857469 703337908 701311290 700190246 699722052 698539734 696995854 696405351 696454465 695902944
632.3 695902944 695099831 695294380 696205139 696609914 696621299 697056174 697281182 696173966 693982601 691372573
652.7 691372573 687534094 681502163 673840821 665631056 657213688 648947656 639225662 628773689
669 628773689 624697983 626254201 632314086 641045511 648386061 652327895 654272795 656499088 660515785
687.3 660515785 667934895 680166900 696120679 712256849 725773633 736558318 745233119 751478791
703.7 751478791 755224884 757675469 759739995 760912836 761105537 761319220 761958361 762274444 762076855
722 762076855 762091100 762527823 762629867 762187779 762065053 762475193 762546241 762064517 761950433 762333214
742.4 762333214 762363851 761977494 761989713 762369335 762334704 762041748 762282968 762869775 762988389 762819350
762.8 762819350 763065100 763502181 763378143 762875140 762699425 762744486 762490153 762230158 762581825 763177037
783.2 763177037 763294160 763107061 763201773 763364494 763072252 762626886 762579978 762630105 762288749 761914074
803.6 761914074 761990786 762128711 761776686 761322200 761311591 761421084 761121631 760662377 760568202 760644674
824 760644674 760377645 760003328 760055184 760225952 759983599 759607732 759581029 759667397 759501874 759332120 759465635
846.4 759465635 759522676 759086609 758582830 758383512 758039653 757198870 756304622 755732894 755038083 753858626
866.8 753858626 752648711 751707196 750580668 749090731 747882724 747362614 747021675 746465981 746043980
885.2 746043980 745945334 745708883 745116889 744640946 744463563 744110465 743461847 742999077 742814124 742452383
905.6 742452383 741838336 741432130 741311789 741015017 740474403 740109026 739943504 739545643 738842607 738224745
926 738224745 737752318 737021506 735963702 734961271 734036446 732822835 731323838 729920626 728733122
944.3 728733122 727512956 726227582 725186408 724401951 723520517 722494543 721586168 720695853 719407737
962.7 719407737 717662454 715770066 713751316 711257339 708220065 704910100 701233685 696701527
979 696701527 691128433 684587359 676767826 667210221 656098247 644232273 632285893 620624542
995.3 620624542 609671175 599688530 590880632 584914029 585003138 592030346 602027357 610346794 616442442
1013.7 616442442 622890115 631963611 644035578 657880366 671568155 683459342 693010986 700729430
1030 700729430 707199037 712269843 715527356 717208207 717873335 717620313 716471672 715003312 713806331
1048.4 713806331 712768316 711575508 710409105 709491789 708521843 707197905 705806494 704638004 703359425
1066.7 703359425 701632440 699739277 697941005 695898235 693379462 690742850 688170791 685274482
1083 685274482 681802332 678026795 674164832 670000672 665415168 660679579 655837119 650465429 644469380
1101.4 644469380 638377070 632412314 626115084 619231641 612194061 605534375 599340081 593246818
1117.7 593246818 586914062 580541074 574548781 569106817 564377844 560738385 558522105 557867944
1134 557867944 558669269 560482323 562921762 566245377 571096659 577614665 585253596 593264699 600744009
1152.4 600744009 606490493 609928548 612479508 617160976 626187265 639065921 653284550 666445613
1168.7 666445613 677317202 685594082 691571891 695862949 698944867 700987875 702172399 702844203
1185 702844203 703211904 703209400 702838361 702354908 701890826 701312900 700613976 700034559 699683487 699383855
1205.4 699383855 699068427 698906422 698923349 698886871 698692501 698537290 698512971 698441088 698284566 698278069 698503375
1227.9 698503375 698757231 698961735 699283779 699790657 700343728 700871050 701516986 702371418 703259647 704051077
1248.2 704051077 704875946 705794930 706563890 707001328 707279325 707567692 707682550 707442939 707052827 706693709
1268.6 706693709 706237674 705667138 705207109 704896033 704496026 703905523 703333735 702886522 702337146 701584399
1289 701584399 700862348 700273633 699597061 698757946 698018253 697501063 696971834 696286917 695707142 695354342
1309.4 695354342 694905519 694291413 693845689 693662226 693604767 693623185 693836451 694285095 694685102 694959462
1329.8 694959462 695405722 695988297 696272194 696365416 697145104 698689342 699972749 700637579 701185465
1348.2 701185465 701828659 702224970 702273190 702339947 702304661 701653242 700885773 700949490 701239347 700973451
1368.6 700973451 700339794 699647069 699456096 699848890 700056434 699775636 699427903 699901521 702022791
1386.9 702022791 705324709 707959235 709135413 709883630 711313784 713336468 715274036 716496408
1403.3 716496408 717583120 718966544 719889998 720279872 720532894 720184267 718899488 718167543 718740761
1421.6 718740761 719215035 719163537 718636155 718038082 717887342 717297316 716131091 716364384 717622578
1440 717622578 718156397 718002558 717687070 717742622 718293965 718549967 717755675 716321290 717202246 720032275
1460.4 720032275 721760273 722504973 723698378 724697709 724362671 723846316 725014865 727106452 728856206
1478.7 728856206 729853928 730209529 729809225 728495300 727163315 727202773 727673769 726824760 725316167
1497.1 725316167 724955797 725154698 724128425 720761061 717970669 719375074 721258819 721531630 720374882
1515.4 720374882 718977094 717950284 717420757 718085527 719149530 720361114 721380591 721236110 721062839
1533.8 721062839 721579909 720576048 718381941 719277263 722446620 725343943 726978540 727679551 728174686
1552.2 728174686 728118718 726670027 724905670 727805674 732034028 733890951 734172583 733808875 734123945
1570.5 734123945 734775960 734136045 733621240 734827638 735873759 736060619 735928893 735611379 734996319
1588.9 734996319 734123290 733066022 731855690 730504096 728883147 726953983 724915445 722779095
1605.2 722779095 720451951 718243718 716316998 714006722 710882425 708788276 708648682 708214343 707465470
1623.5 707465470 707583189 708159983 708973467 709494591 709064543 709654808 713183105 717096508 719961822
1641.9 719961822 721595764 722988069 726257861 729371548 731015325 735558927 741896808 746222496
1658.2 746222496 748832822 751022696 753723443 755667925 756394506 757776439 759844482 761550784
1674.5 761550784 763610482 765332460 765363693 763939083 764114618 766836464 768878102 769934237 769905627
1692.9 769905627 768232286 766292453 765361369 766167998 767830074 768524528 769174874 770063519 770015478
1711.3 770015478 768623888 766355157 765120387 766454160 768099070 768626273 768551886 767888248 766485393
1729.6 766485393 764543176 762897551 763296902 763978422 763677120 763489962 763419271 762753963 761633337
1748 761633337 761012793 761619747 762262702 762084782 761720598 761204720 760723591 760849833 760593474 759380639
1768.4 759380639 757732928 756890595 757716179 758588493 758434653 757984817 757843018 757677734 757394969
1786.7 757394969 756722748 755357146 754464209 754754543 754985571 754550040 754060090 754132628 754423440 754276514
1807.1 754276514 753583968 753027439 753100097 753189266 752849758 752430975 752002895 751215160 750304937 749573350
1827.5 749573350 749120712 749437571 749853551 749685228 749448955 749168515 748131216 746809483 746735811
1845.9 746735811 747381747 747607410 747488856 747318864 747067809 746645689 746248484 745986581 745478809 744328797
1866.3 744328797 743247628 743416786 744129717 744227588 743908644 743658960 743425071 743043721 742607355 742130756
1886.7 742130756 741535425 741173565 741068304 740913928 740772188 740575194 740270436 740010440 739701807 739162683
1907.1 739162683 738655090 738514304 738417923 737843573 737055898 736734986 736619651 736373067 736297548 736300170
1927.5 736300170 736113548 735766888 735428989 735198855 734907806 734295130 733558655 733300328 733376622 733249128
1947.9 733249128 732996583 732793212 732509851 732111990 731774747 731543005 731271327 730822146 730340898 730132461
1968.3 730132461 730050683 729782104 729448497 729224563 728996098 728659213 728332281 728091717 727771997 727270484
1988.7 727270484 726758480 726535261 726511359 726318181 726031601 725848496 725621223 725226402 724835157 724617779
2009 724617779 724451959 724159539 723818362 723600388 723409414 722996056 722328484 721753895 721676826 721884966
2029.4 721884966 721973240 721956074 721833229 721555769 721262753 721085191 720934510 720691442 720466971 720356464
2049.8 720356464 720215142 719948113 719722211 719620109 719456017 719139516 718864322 718773603 718681157 718439996
2070.2 718439996 718222499 718119681 717954040 717691302 717534840 717503905 717379868 717126846 716946423 716884136
2090.6 716884136 716747642 716509998 716374695 716351271 716232359 715988636 715810776 715728998 715570152 715327322
2111 715327322 715163052 715072513 714884996 714614987 714437127 714339674 714176655 713982344 713906765 713901997 713795066
2133.5 713795066 713610888 713524640 713540435 713499844 713397682 713379085 713420510 713353515 713196158 713121712 713135302
2155.9 713135302 713087201 712979972 712955654 712992787 712919950 712744832 712682307 712780476 712833405 712759376 712705672
2178.3 712705672 712702692 712603152 712428749 712360322 712371588 712293804 712153614 712097049 712094307 711985528 711790621
2200.8 711790621 711671770 711626351 711507857 711319625 711215615 711182117 711062968 710868895 710750639 710701704
2221.2 710701704 710571885 710377872 710284293 710269094 710153818 709946573 709812701 709760129 709634542 709437132
2241.6 709437132 709323049 709281683 709153056 708935857 708787203 708703876 708542824 708338380 708247244 708227038
2262 708227038 708087921 707850695 707726836 707702875 707570255 707353234 707243621 707222223 707108974 706909180
2282.3 706909180 706779897 706717134 706564605 706321955 706154227 706057608 705864727 705562413 705315530 705147743
2302.7 705147743 704885900 704503477 704180956 703947961 703640580 703257561 702908576 702512741 701963067 701429248
2323.1 701429248 701126039 700896859 700471461 699985266 699695349 699457943 699083984 698703825 698527992 698543549
2343.5 698543549 698788524 699244618 699435115 698945224 697876573 696803689 696099937 695737123 695602357
2361.9 695602357 695675671 695989907 696447730 696891189 697373211 697984278 698574722 699002326 699358106 699741900
2382.3 699741900 700045705 700111926 700034380 700002015 699961662 699791372 699578047 699469328 699407816 699244976
2402.7 699244976 699026704 698899984 698832512 698676467 698462605 698369563 698350608 698203504 697980046 697845042
2423.1 697845042 697738767 697544634 697337151 697241127 697204411 697066247 696853042 696730018 696661890 696490645
2443.5 696490645 696244478 696105003 696058929 695904374 695673227 695570648 695550561 695417523 695197880 695045412
2463.9 695045412 694947898 694795370 694616795 694518447 694435477 694242895 694010794 693870187 693795621 693662107
2484.3 693662107 693476379 693385184 693362832 693207741 692936182 692773700 692723393 692582607 692354321 692222416
2504.7 692222416 692175984 692016721 691762328 691632152 691607296 691476583 691269398 691171587 691124141 690952182
2525.1 690952182 690717161 690594196 690536797 690378547 690185905 690117836 690077364 689878643 689621270 689528227
2545.5 689528227 689534605 689406157 689176202 689058125 689006448 688846350 688652277 688586593 688536644 688332319
2565.8 688332319 688119650 688077927 688067853 687896132 687677860 687601089 687547684 687353492 687158346 687112510
2586.2 687112510 687068105 686858714 686613023 686507344 686431289 686241925 686055303 685993016 685926557 685738146
2606.6 685738146 685547411 685468793 685412824 685266733 685107112 685021162 684923410 684746802 684576869 684474945
2627 684474945 684362590 684179485 684016287 683961093 683909893 683744252 683543384 683428347 683336914 683153033
2647.4 683153033 682973385 682921708 682857037 682639360 682412148 682310164 682219684 682052195 681909204 681853473
2667.8 681853473 681777358 681593597 681411147 681347728 681284547 681102514 680905938 680804193 680712998 680516779
2688.2 680516779 680312753 680217505 680109084 679899752 679729521 679667652 679575205 679387569 679226577 679143965
2708.6 679143965 679022372 678808331 678628385 678573549 678522885 678352058 678163171 678074658 677974582 677765846
2729 677765846 677578092 677484334 677371740 677184224 677006245 676894128 676777959 676631272 676546752 676508248
2749.4 676508248 676379800 676147878 675932944 675805032 675693214 675529301 675382376 675305784 675205350 675021231
2769.8 675021231 674862981 674778163 674621463 674352825 674138427 674035132 673918307 673755169 673648655 673568726
2790.2 673568726 673389494 673153996 672990203 672876477 672675312 672374249 672112763 671955049 671805799 671578050
2810.6 671578050 671335161 671163440 670998275 670763254 670525491 670346260 670172393 669959068 669744074 669547200
2831 669547200 669298470 668975830 668701887 668467879 668091357 667587936 667134464 666730642 666243374 665741384
2851.4 665741384 665435553 665336013 665300965 665243685 665150404 665029645 664864779 664648175 664474130 664407849
2871.8 664407849 664278150 663958251 663633049 663426101 663228095 662978113 662719071 662482142 662260890 662042558
2892.2 662042558 661845744 661638856 661330462 660959423 660640419 660366595 660081863 659816504 659626007 659411550
2912.6 659411550 658969820 658300459 657630324 657110572 656773090 656611741 656626999 656804144 656963944 656996012
2933 656996012 657055914 657219648 657368183 657501698 657667816 657755554 657649100 657406211 657214761 657069445
2953.4 657069445 656829417 656547964 656335473 656173348 655961514 655674458 655400336 655202329 655079544 655018389
2973.8 655018389 655012071 655090392 655232072 655295670 655257404 655244172 655291796 655375481 655448020 655409038 655277491
2996.2 655277491 655091643 654838681 654611886 654443920 654285371 654186308 654197991 654191911 654002607 653671682
3016.6 653671682 653344929 653055787 652770698 652503371 652255416 652012348 651785553 651621044 651452899 651175797
3037 651175797 650929868 650807440 650647938 650306344 649844825 649490178 649267852 648992896 648654938 648333430
3057.4 648333430 648014963 647670627 647344410 647139013 646965325 646628737 646192193 645854175 645684719 645557344
3077.8 645557344 645280242 644883394 644515336 644127488 643683851 643258393 642790914 642236173 641743600 641414344
3098.2 641414344 641094804 640638709 640157163 639818251 639551342 639148176 638697982 638410211 638166547 637785316
3118.6 637785316 637218177 636512518 635840893 635291517 634803355 634299576 633783519 633322120 632930994 632527292
3139 632527292 631948352 631203890 630513966 629961252 629504561 629090667 628543556 627802312 627046824 626338482
3159.4 626338482 625625670 624932885 624265969 623581409 622876406 622168958 621445954 620686591 619907260 619154572
3179.8 619154572 618414044 617644608 616871178 616118491 615342081 614465773 613497376 612543523 611663520 610812366
3200.1 610812366 609937727 609046221 608143806 607200384 606256485 605379939 604517639 603591621 602633417 601702511
3220.5 601702511 600783050 599812686 598790050 597832561 597042561 596284032 595288754 594142795 593125522
3238.9 593125522 592187703 591231108 590369523 589569986 588643909 587673187 586855412 586135626 585330963 584433794
3259.3 584433794 583584189 582816958 582097411 581475616 580972850 580348253 579426229 578385055 577414632
3277.7 577414632 576549828 575726807 574895740 574070573 573273003 572546303 571818292 570945382 569920480
3296 569920480 568763614 567564964 566577852 565840364 564952135 563608587 561998665 560424447 558988571
3314.4 558988571 557621896 556252182 554877579 553506851 552122772 550576568 548823774 547052860
3330.7 547052860 545342982 543701589 542153120 540500045 538597107 536606848 534593523 532597125
3347 532597125 530760765 528862059 526614726 524211466 521952510 519872308 517789423 515639365 513642371
3365.4 513642371 511795938 509708285 507218838 504720449 502573490 500651538 498759240 496865541
3381.7 496865541 495045722 493420154 492031932 490862012 489661247 488169312 486661851 485585302
3398 485585302 484769881 483617544 482097030 480757117 479770631 478898406 477996856 477022976 476039916
3416.3 476039916 475210160 474552751 474001914 473601550 473416924 473387212 473366976 473412186 473630190 473793954
3436.7 473793954 473695219 473582923 473767579 474229187 474866748 475631773 476453841 477300078 478201866 479228556
3457.1 479228556 480362445 481434852 482536882 483958781 485555202 486842245 487720609 488615364 489817917
3475.5 489817917 491252124 492625386 493811101 495070815 496492803 497884691 499239832 500653982
3491.8 500653982 502105653 503594220 505060554 506426513 507767379 509135008 510487974 511862457
3508.1 511862457 513420045 515214980 516950667 518410802 519785583 521268070 522885442 524478018
3524.4 524478018 525940597 527533650 529412687 531334400 533160210 534948826 536708891 538441479
3540.8 538441479 540111363 541784108 543608963 545499802 547325790 549232900 551297367 553347111
3557.1 553347111 555312753 557169914 558624506 559731305 561668277 564833760 567887902 570297480
3573.4 570297480 572529256 574872196 577339709 579786301 581830204 583409548 585466146 588497996
3589.7 588497996 591364443 593728423 596269190 599036932 601725459 604388237 606761575 608500242
3606 608500242 610216439 612445652 614793777 617085457 619101822 621009588 623721480 626673222 628493130
3624.4 628493130 628902912 629437208 631878197 634734213 636911213 638657928 640076518 641229391 641988993
3642.7 641988993 641848505 640733778 640362501 642392576 644765496 645925939 646905005 648296058 649282396
3661.1 649282396 649648905 649457991 648399353 647041976 646638453 646322072 645954072 647139728 648890913
3679.4 648890913 650054097 650493205 649986148 648776531 648246288 649268746 650683701 651501000 651565552
3697.8 651565552 651064515 650749564 651071727 651103854 650120139 648766816 648698688 649968684 650852442 650738716
3718.2 650738716 650088966 649502575 649258673 649407268 649537325 648785353 647115588 645967782 646626472
3736.5 646626472 648056865 648325086 646940470 645632148 645627201 645271719 644935191 646194935 647617161
3754.9 647617161 647942483 647886455 648310065 648615658 648326933 647853971 647647858 648111403 648852170 649002612
3775.3 649002612 648449242 647920787 647891760 647905707 647909939 648116171 648245454 648061872 647413909 646479428
3795.7 646479428 645620406 644627929 644125581 644602239 644957542 645464957 646359921 646439016 645274699 643957257
3816.1 643957257 643212497 642606378 642980754 644073904 644575417 644543648 644141793 643534184 642885387 642013013
3836.5 642013013 641442239 641804218 642700434 643673897 644183397 643559456 641484797 639188111 639720738
3854.8 639720738 641800463 642784715 642419994 641498566 641086459 640929103 640410066 640302122 640904427
3873.2 640904427 641649306 641838431 641190052 640715718 640734673 640867174 641171098 641088128 640835345 641161740
3893.6 641161740 641298652 640487015 639302135 638648510 638894856 639943302 640996039 641415477 641344786
3912 641344786 640951157 640322506 639982581 640100658 640140712 640031219 640106022 640086889 639743149 639624119
3932.3 639624119 639971972 640274346 640232205 639890015 639517307 639416635 639360249 639201403 639230013 639445782
3952.7 639445782 639570832 639504790 639340878 639202893 639186144 639224231 639171481 639084101 639036179 638966322 638926327
3975.2 638926327 638958156 638924003 638822556 638768792 638706744 638560176 638396025 638301611 638250649 638170004 638090014
3997.6 638090014
##END=$$ End of the data block
