##TITLE=DI1401696-6AD03 $$ Begin of the data block
##JCAMP-DX=5.00 $$ ACD/SpecManager v 10.08
##DATE=14 Aug 2014 15:15:32
##DATA TYPE=INFRARED SPECTRUM
##DATA CLASS=XYDATA
##ORIGIN=Marcelo Quint
##OWNER=
##NPOINTS=1667
##FIRSTX=599.63549805
##LASTX=3997.56909180
##MAXX=3997.56909180
##MINX=599.63549805
##MAXY=1.10881114
##MINY=0.21724142
##XFACTOR=1.0000000000
##YFACTOR=0.000000010000000
##FIRSTY=1.01103556
##DELTAX=2.03957605
##XUNITS=1/CM
##YUNITS=ARBITRARY UNITS
##XYDATA=(X++(Y..Y))
599.6 101103556 100976801 100823998 100584114 100256777 99908918 99578381 99323374 99190348 99043882 98853219
620 98853219 98826104 99039376 99461758 100099325 100865841 101595759 102129209 102412617 102540815 102674174
640.4 102674174 103027797 103756607 104736924 105638039 106263697 106692278 107001472 107190812 107270718 107241690
660.8 107241690 107173991 107536387 108904016 109697473 108633792 107833827 107657516 107588875 107421112 107149923
681.2 107149923 106793475 106403184 106061792 105780399 105539429 105387604 105330276 105305803 105295599 105302691 105312550
703.7 105312550 105318439 105343509 105422187 105520761 105551517 105505633 105458677 105351579 105076027 104761994 104568005
726.1 104568005 104501355 104521143 104589641 104676771 104723179 104661727 104459918 104082358 103494382 102713764 101823568
748.5 101823568 100953639 100300324 100096500 100439417 101150823 101869428 102339542 102596617 102840137 103187084
768.9 103187084 103563142 103809536 103829122 103627753 103299356 102965593 102703536 102500439 102246809 101775336
789.3 101775336 100845790 99031639 95769370 90971667 86021191 83412498 84133023 86237115 87137449
807.7 87137449 86143041 84224272 82612121 82005084 82470483 83694309 85291153 87009186 88771647
826 88771647 90579593 92404836 94179904 95815247 97202224 98254210 98956311 99356645 99481905
844.4 99481905 99262214 98596001 97498298 96237046 95263374 94876665 95020223 95412099 95832533 96307594
864.8 96307594 97038305 98162478 99552631 100888765 101932251 102653229 103142035 103480446 103726518
883.1 103726518 103941846 104142654 104303074 104415751 104479611 104488027 104448307 104368794 104247928 104079008 103848553
905.6 103848553 103530335 103069234 102403617 101608932 100995219 100907171 101367891 102040064 102588880 102920008
926 102920008 103095019 103186953 103224051 103203118 103119934 102992082 102838719 102681911 102558219 102483320 102448463
948.4 102448463 102432513 102406001 102349889 102256083 102129912 102003694 101932096 101959109 102081466 102273285 102519095
970.8 102519095 102798307 103071117 103307045 103495157 103606880 103618157 103547919 103423643 103260410 103084219
991.2 103084219 102915049 102763116 102639997 102556396 102514470 102492356 102444613 102267540 101832914 100951338
1011.6 100951338 98915631 95295310 92352825 93131447 96562022 99300778 100327206 100441611 100277567
1030 100277567 100031531 99741828 99428236 99124938 98853058 98608327 98378050 98148090 97907650 97637260
1050.4 97637260 97325456 96980357 96613628 96224463 95795780 95322675 94857407 94474036 94184673 93946213
1070.8 93946213 93725508 93517107 93340713 93243253 93272454 93459255 93796647 94219249 94609255 94806385
1091.2 94806385 94615054 93848783 92430836 90481418 88259459 85999662 83934504 82489437 82204616
1109.5 82204616 83219337 84970307 86645174 87786263 88336784 88370329 87915850 86961156 85521632
1127.9 85521632 83654940 81452399 79029185 76527709 74136484 72062439 70458275 69382882
1144.2 69382882 68802047 68623495 68735337 69036478 69461197 69965208 70518523 71105278 71710831 72320539
1164.6 72320539 72932011 73555881 74199188 74831939 75379711 75792974 76138419 76568043 77154100 77816701
1185 77816701 78434789 78957468 79395652 79776102 80097628 80301398 80313033 80137426 79918438 79875994
1205.4 79875994 80132735 80566388 80884874 80906695 80722511 80558574 80585480 80869806 81407082 82130390
1225.8 82130390 82911873 83627731 84200627 84599280 84843451 85001159 85159129 85375625 85658979 85980600
1246.2 85980600 86308950 86642706 86997455 87392968 87851834 88367891 88899350 89383543 89770341 90029353
1266.6 90029353 90132040 90081990 89952415 89854145 89855814 89948952 90068352 90158713 90269959 90561092 91105378
1289 91105378 91741437 92229635 92584920 93102854 93855739 94485891 94665247 94385266 93826592 93209350
1309.4 93209350 92712259 92455804 92542201 93055534 93977863 95138806 96312755 97307885 98007709 98380738
1329.8 98380738 98459488 98333454 98137653 97977686 97868705 97766161 97639042 97497690 97395414 97381282
1350.2 97381282 97454953 97591656 97745806 97865665 97902578 97774154 97433513 96963060 96417874 95844084
1370.6 95844084 95266944 94638157 94033998 93596756 93420875 93585783 94136518 95042038 96073365 96967846
1391 96967846 97694874 98215991 98486328 98584586 98572463 98450100 98036861 97083557 95425320 93149018
1411.4 93149018 91035396 90114707 90849370 92869890 94820720 96152878 96941739 97097129 96583235
1429.7 96583235 95574129 94560426 93761414 93268925 93178409 93404013 93828499 94314921 94696510 94867009
1450.1 94867009 94963557 95174485 95631570 96230805 96852160 97741336 99019361 100315905 101293457 102095497
1470.5 102095497 102704692 102943265 102956069 102964211 103003144 103040802 103076708 103108430 103009534 102651060 102222478
1493 102222478 101758945 101009667 99850887 98501778 97107065 95178121 91766042 88334602 85546350
1511.3 85546350 82622331 79080850 74746597 70302367 65972614 62962347 62055713 62738746 64539856
1529.7 64539856 67404753 71550095 75664204 79556304 84772289 89853477 93232775 95841753
1546 95841753 97957343 99742961 101196074 102358449 103357577 104243529 104531038 104390192 104249942
1564.3 104249942 104013741 103293896 101588249 99286211 96904218 95099294 95348775 97407049 100039065
1582.7 100039065 102009857 102865100 102862453 102281225 101317990 100152147 98961365 97806817 96498281
1601.1 96498281 94692320 92326975 90163821 89520752 90994769 93759131 97010493 100106013 102059925
1619.4 102059925 103284180 104259574 104882336 105230355 105443013 105627179 105903769 106109333 105999780
1637.8 105999780 105836403 105802822 105922961 106104243 106129289 106115758 106258845 106179488 105875313 105749214
1658.2 105749214 105792546 105859578 105828524 105814993 105859542 105789006 105601406 105403495 105130219 104868901 104722929
1680.6 104722929 104622567 104229164 103591228 103041446 102519238 102081203 101656258 101129806 100406325 99242258
1701 99242258 97964245 96541280 94647890 92539340 90343392 88001615 85313964 81735510 77749532
1719.3 77749532 74026310 69844931 64959210 59862220 54892504 50549746 46707079 44076538
1735.7 44076538 43302849 43907690 45791364 48907238 53271395 58948755 66066068 73623270 80049664
1754 80049664 85624295 90469003 94115394 96911615 98849344 100160110 101221883 102071059 102638721
1772.4 102638721 102883053 103029275 103263569 103588998 103899693 104181254 104430974 104687476 104975593 105219996
1792.8 105219996 105358601 105513430 105739629 105948782 106098747 106224787 106376529 106537199 106661189 106721890
1813.2 106721890 106778169 106853247 106927478 107007492 107110274 107216835 107309198 107394326 107398629 107366347 107375538
1835.6 107375538 107407320 107443380 107526374 107623136 107622194 107567430 107531011 107522357 107527876 107534063 107524753 107505596 107487667
1862.1 107487667 107490087 107520211 107519472 107425117 107292199 107196295 107134795 107093561 107060158 107033014 107006574 106980574
1886.6 106980574 106940424 106845284 106713772 106585395 106459653 106348002 106278181 106248176 106259704 106318843 106419182
1909 106419182 106539750 106677616 106847811 107033288 107182491 107293677 107398534 107487798 107568336 107646024
1929.4 107646024 107717788 107781482 107843876 107908762 107971752 108029783 108054292 108051169 108053470 108068132 108083522 108094978
1953.9 108094978 108104551 108109021 108103216 108092630 108094907 108112311 108125412 108125675 108128381 108138287 108152401 108164096 108170056
1980.4 108170056 108176339 108186567 108201933 108222103 108241510 108242857 108229899 108228123 108235431 108236516 108239090 108247101 108251905
2006.9 108251905 108252084 108248281 108249283 108260727 108266366 108254874 108239245 108230388 108221388 108203709 108183074 108169436 108158326
2033.4 108158326 108135593 108101535 108063126 108015931 107958770 107892716 107812154 107716930 107616735 107511342 107389855
2055.9 107389855 107253885 107109356 106958115 106803739 106653786 106525087 106423461 106350124 106320071 106337702
2076.3 106337702 106389070 106456232 106530929 106609702 106684875 106751549 106811833 106866252 106914842 106958532 106996822
2098.7 106996822 107028186 107047617 107047212 107019615 106969452 106901312 106810391 106688416 106525898 106319666 106071675
2121.1 106071675 105783367 105449581 105063367 104624712 104136443 103598499 103019500 102421522 101825547 101239097
2141.5 101239097 100674975 100161946 99715793 99332076 99001902 98705989 98411924 98094529 97729343 97306436
2161.9 97306436 96851069 96388453 95931292 95495224 95095932 94732612 94381076 94007623 93585861 93099183
2182.3 93099183 92535806 91891956 91173142 90380198 89516789 88603657 87664354 86709154 85742426 84768879
2202.7 84768879 83784920 82784915 81761450 80703700 79597938 78423923 77153480 75743139 74127764
2221.1 74127764 72228456 69965053 67265379 64082944 60415006 56324172 51941842 47454324
2237.4 47454324 43083844 39058793 35564032 32695413 30452842 28749433 27457142 26448107
2253.7 26448107 25611070 24866067 24174519 23535477 22974475 22516640 22163516 21914171 21769117 21724142
2274.1 21724142 21765098 21882775 22092132 22425801 22921608 23614460 24542034 25739491 27246895 29108363
2294.5 29108363 31359163 34009331 37037739 40387136 43986005 47762674 51602000 55358601
2310.8 55358601 58900124 62161845 65215671 68157142 70906925 73312914 75380570 77272093
2327.1 77272093 79093355 80758429 82210374 83607173 85050529 86465251 87706274 88473797 88462734
2345.5 88462734 88255411 88907635 90834993 93627053 96397173 98679000 100333309 101360297 101870501
2363.8 101870501 101935589 101647210 101193750 100719631 100295770 99944276 99657542 99434727 99340153 99461097
2384.2 99461097 99811214 100316787 100881338 101442826 101972783 102459121 102899349 103306270 103685629 104031014
2404.6 104031014 104342985 104629588 104900002 105156183 105398202 105617714 105807507 105983198 106158090 106320393
2425 106320393 106464922 106603122 106737757 106868172 106993735 107113147 107232869 107351005 107455015 107546222
2445.4 107546222 107636869 107729280 107818580 107901192 107975113 108047557 108128369 108207953 108266342 108309734 108361185
2467.9 108361185 108418179 108473086 108531892 108588946 108635831 108671951 108701122 108731043 108759737 108783388 108805144
2490.3 108805144 108824825 108841658 108858109 108874404 108891928 108914888 108937562 108952665 108960664 108963299 108964384 108966851
2514.8 108966851 108971429 108978701 108991039 109008443 109029102 109050965 109065592 109070480 109076548 109087014 109090209 109088433 109093940
2541.3 109093940 109103668 109113300 109123898 109126985 109116542 109105515 109100413 109097719 109098971 109101748 109101713 109096599 109085691 109071791
2569.8 109071791 109057617 109038186 109012842 108993602 108976686 108949018 108917391 108883739 108836794 108783424 108743274
2592.3 108743274 108724260 108731902 108773208 108837366 108901048 108950746 108986044 109011400 109034705 109056938 109072590 109082711
2616.8 109082711 109088862 109095109 109104598 109114397 109126294 109138167 109142375 109139311 109132445 109123075 109118569 109121835 109117281 109099019
2645.3 109099019 109083498 109075665 109068871 109066653 109063888 109049046 109030545 109016502 109002948 108988082 108976936 108974755
2669.8 108974755 108975470 108969545 108958614 108952439 108956409 108970273 108989453 109003294 109003258 108996367 108988643 108975363 108960438
2696.3 108960438 108951724 108945215 108928049 108902097 108880222 108864784 108854985 108845639 108830607 108814967 108800769 108785045
2720.8 108785045 108767080 108747315 108745074 108772838 108802915 108811462 108804202 108800519 108815849 108838189 108848202 108840656
2745.2 108840656 108823693 108824980 108852637 108875167 108876097 108876503 108893955 108917642 108930123 108936679 108947396 108951247 108935595
2771.8 108935595 108910728 108908355 108930027 108938420 108925402 108911633 108893681 108864069 108843589 108846188 108857942 108852601
2796.2 108852601 108830118 108814371 108802831 108786535 108765006 108725667 108682358 108659565 108631933 108580017 108522248
2818.7 108522248 108462870 108394408 108318114 108230913 108119404 107971334 107788217 107581472 107369065 107215297
2839.1 107215297 107166874 107155132 107112336 107052612 106988227 106898510 106776309 106644917 106515980 106405091 106342053
2861.5 106342053 106310022 106272662 106226659 106154740 106045735 105968785 105962431 105958164 105907238 105816364 105698478
2883.9 105698478 105568719 105430341 105278015 105107677 104912663 104706395 104512203 104311860 104081023 103837669
2904.3 103837669 103598702 103352010 103083062 102817655 102607465 102462232 102358890 102281809 102217829 102158475
2924.7 102158475 102091730 102014291 101944780 101874363 101767015 101605988 101393926 101132679 100833893 100531256
2945.1 100531256 100257206 100018299 99809247 99655950 99599600 99647355 99788231 100012970 100300169 100621891
2965.5 100621891 100958312 101292503 101599061 101872575 102130389 102361226 102560973 102765846 103007936 103293765
2985.9 103293765 103594518 103855288 104060268 104239047 104382551 104480922 104556096 104608202 104663289 104757845
3006.3 104757845 104866171 104943144 104989481 105032516 105057001 105024636 104929149 104778457 104632151 104592967 104665923
3028.7 104665923 104773510 104877222 104993987 105094314 105071378 104952526 104901266 104988265 105163074 105333900
3049.1 105333900 105490088 105666661 105823445 105957162 106082046 106140006 106120110 106077754 106103921 106261337
3069.5 106261337 106479299 106656158 106763065 106847763 106989908 107187450 107381511 107554150 107695651 107806396
3089.9 107806396 107928693 108052790 108125651 108154964 108187354 108246231 108306682 108326447 108321762 108349049 108385181
3112.4 108385181 108372116 108342826 108343863 108378029 108444035 108510351 108538187 108546603 108583999 108648849 108698571 108721924
3136.8 108721924 108753598 108835876 108955944 109059322 109122014 109141970 109133244 109162593 109260571 109352171 109386063
3159.3 109386063 109387136 109390032 109403241 109407568 109403312 109404278 109400165 109387696 109370887 109346604 109333789 109340870 109341550
3185.8 109341550 109331775 109338427 109370005 109415388 109462202 109495962 109513974 109527862 109547746 109581244 109634137 109691525
3210.3 109691525 109726357 109739685 109742737 109732294 109733081 109755886 109756541 109725881 109684932 109613335 109525180 109509921
3234.7 109509921 109564590 109597695 109597313 109572196 109515440 109477866 109488785 109500372 109475613 109431291 109410715 109416604
3259.2 109416604 109404707 109365690 109320724 109263039 109184015 109135866 109147453 109170318 109170496 109147167 109110451 109068286
3283.7 109068286 109030771 108994770 108917904 108796263 108693540 108653688 108656287 108633232 108526278 108364320 108234918
3306.1 108234918 108169627 108135366 108094823 108029687 107953846 107878423 107788312 107668626 107529712 107413399 107334936
3328.6 107334936 107256854 107150733 107013488 106851351 106703746 106586742 106472325 106371331 106287062 106187403
3348.9 106187403 106111455 106112611 106139565 106137347 106133783 106167316 106215060 106219733 106193697 106199670 106250417 106302667
3373.4 106302667 106313396 106278431 106218445 106144941 106061673 105979943 105884743 105769932 105704486 105730057 105791008
3395.9 105791008 105822420 105839539 105934680 106127489 106320095 106464958 106598878 106763577 106987154 107233810
3416.3 107233810 107441199 107634187 107843840 108026218 108143449 108221841 108319569 108427322 108507717 108629525
3436.7 108629525 108846414 109064984 109193265 109250486 109294975 109351301 109413397 109478319 109545517 109577668 109568965
3459.1 109568965 109611058 109674060 109600651 109451044 109492147 109781229 110060871 110160089 110115337 110062814 110149229
3481.5 110149229 110265732 110265803 110263181 110311306 110306573 110239232 110174596 110141301 110114682 110076058 110092604 110166585
3506 110166585 110200882 110164011 110081732 110015845 110006046 110014272 109999132 109958112 109944522 109990251 110025823 110006309
3530.5 110006309 109961998 109914851 109881961 109871888 109859920 109837663 109830999 109861791 109911025 109941649 109947217 109938109
3554.9 109938109 109932566 109945083 109980667 110055792 110155213 110170090 110053337 109950674 109947062 109993482 110019433
3577.4 110019433 110001528 109972024 109990537 110099792 110226560 110244405 110223889 110242820 110242498 110207415 110184288
3599.8 110184288 110168171 110163033 110182941 110178447 110119808 110057068 110033894 110083950 110170066 110170996 110112917 110129678
3624.3 110129678 110268068 110383272 110245430 110015023 109846127 109708130 109582758 109481812 109438658 109503365
3644.7 109503365 109674323 109742284 109522009 109281790 109161615 109022379 108843851 108743417 108712876 108711731
3665.1 108711731 108792078 108922863 108942747 108931434 108941817 108804607 108612823 108507991 108500075 108578861 108721805
3687.5 108721805 108835745 108813620 108727062 108700705 108759081 108855462 108921075 108909762 108903241 108994699 109103513
3710 109103513 109025431 108830714 108791554 108966541 109238946 109485507 109669089 109765470 109790277 109863067 110015786
3732.4 110015786 110104024 110005760 109823227 109753752 109862471 109984100 109994674 110062265 110122955 109998417 109858251
3754.8 109858251 109834802 109851587 109811974 109773409 109794927 109851015 109893334 109850490 109757960 109726143 109771144
3777.3 109771144 109803951 109778523 109760809 109748495 109706593 109673774 109699416 109793210 109904909 109991848 110097635
3799.7 110097635 110162997 110098672 110019600 109946823 109881568 109908640 110038841 110179663 110264015 110331953 110295331
3822.1 110295331 110176742 110135007 110167980 110236359 110313284 110383940 110491574 110594141 110562515 110427582 110301769
3844.6 110301769 110263848 110361850 110617232 110881114 110785341 110519731 110403252 110446370 110543942 110572708 110583186
3867 110583186 110648108 110670519 110617149 110548115 110520518 110566545 110594988 110567546 110533798 110500491 110506046 110521889
3891.5 110521889 110489917 110491705 110588813 110716605 110780609 110743737 110636067 110543728 110505438 110500300 110528922
3913.9 110528922 110584295 110621309 110623801 110617125 110614634 110615826 110636437 110664356 110650933 110595310 110553026 110559523
3938.4 110559523 110606456 110648179 110649288 110641015 110649145 110642219 110610187 110585713 110573936 110566807 110567462 110564601 110554349
3964.9 110554349 110552180 110569000 110589206 110592341 110584557 110570288 110551429 110547948 110557973 110560906 110565591 110584664 110588133
3991.4 110588133 110559034 110532928 110523653
3997.5 110523653
##END=$$ End of the data block
