##TITLE=DI1401696-6AD02 $$ Begin of the data block
##JCAMP-DX=5.00 $$ ACD/SpecManager v 10.08
##DATE=14 Aug 2014 15:15:18
##DATA TYPE=INFRARED SPECTRUM
##DATA CLASS=XYDATA
##ORIGIN=Marcelo Quint
##OWNER=
##NPOINTS=1667
##FIRSTX=599.63549805
##LASTX=3997.56909180
##MAXX=3997.56909180
##MINX=599.63549805
##MAXY=1.13539147
##MINY=0.02409991
##XFACTOR=1.0000000000
##YFACTOR=0.000000010000000
##FIRSTY=0.99743605
##DELTAX=2.03957605
##XUNITS=1/CM
##YUNITS=ARBITRARY UNITS
##XYDATA=(X++(Y..Y))
$$ plain form
599.6 99743605 99587828 99334264 98994958 98591447 98144424 97659868 97213662 96910399 96623427 96299154
620 96299154 96205372 96470398 97037828 97881460 98885363 99828738 100503874 100854576 100993395 101117635
640.4 101117635 101510775 102362680 103512955 104594731 105373418 105891299 106228399 106387627 106405580 106324720
660.8 106324720 106211150 106618655 108315802 109374082 108082080 107098854 106915534 106853008 106639922
679.2 106639922 106304491 105869138 105369806 104916167 104560363 104284608 104099214 104014838 104013932 104055130 104090357
701.6 104090357 104108202 104127133 104182827 104300869 104421675 104461372 104424369 104380047 104253232 103930175 103577948
724 103577948 103366709 103284073 103301978 103395665 103524280 103616726 103598785 103408635 102977848 102266204 101290751
746.5 101290751 100178313 99146503 98445302 98328644 98886526 99863547 100808561 101455843 101835215
$$ packed form
599.6I9743605j55777k53564l39306m03511m47023m84556m46206l03263k86972l24273
620I6299154r3782K65026N67430Q43632J003903R43375O75136L50702J38819J24240
640.4A01117635L93140Q51905J150275J081776P78687N17881L37100J59228J7953q0860
660.8A06324720j13570M07505J697147J058280j292002r83226j83320o2526k13086
679.2A06639922l35431m35353m99332m53639l55804k75755j85394q4376r06M1198L5227
701.6A04090357J7845J8931N5694J18042J20806L9697l7003m4322j26815l23057l52227
724A03577948k11239q2636J7905R3687J28615R2446j7941j90150m30787p11644r75453
746.5A01290751j112438j031810p01201j16658N57882R77021R45014O47282L79372
$$ plain form
764.8 101835215 102095783 102372301 102691042 102963877 103085446 103019702 102804661 102505159 102189195 101863801
785.2 101863801 101430082 100693405 99338067 96844262 92487168 86038870 79217434 75369745 75915146
803.6 75915146 78336257 79197800 77586961 74867266 72728229 72081846 72951859 74799120 77014935
821.9 77014935 79253656 81444132 83635730 85833627 87948847 89844924 91393089 92523819 93277222
840.3 93277222 93763417 93992281 93801409 93012369 91651869 90114546 89000231 88656300 88957655
858.7 88957655 89525449 90125495 90857738 91991550 93640935 95615202 97587931 99318933 100705886
877 100705886 101737428 102452028 102918053 103212154 103384721 103442657 103371561 103155100 102778757 102226138
897.4 102226138 101498318 100657737 99810356 99041122 98364508 97680312 96805912 95713264 94731098 94292575
$$ packed form
764.8A01835215K60568K76518L18741K72835J21569o5744k15041k99502l15964l25394
785.2A01863801m33719p36677j355338k493805m357094o448298o821436l847689N45401
803.6G5915146K421111Q61543j610839k719695k139037o46383Q70013J847261K215815
821.9G7014935K238721K190476K191598K197897K115220J896077J548165J130730P53403
840.3I3277222M86195K28864j90872p89040j360500j537323j114315l43931L01355
858.7H8957655N67794O00046P32243J133812J649385J974267J972729J731002J386953
877A00705886J031542P14600M66025K94101J72567N7936p1096k16461l76343n52619
897.4A02226138p27820q40581q47381p69234o76614o84196q74400j092648r82166m38523
$$ plain form
917.8 94292575 94443232 94824946 95136756 95342952 95508635 95663124 95813197 95964783 96136475 96397340
938.2 96397340 96828264 97464150 98287493 99221736 100138187 100934398 101577389 102069759 102431917 102707708
958.6 102707708 102958512 103218222 103487515 103751934 103997779 104226112 104434788 104613793 104761136 104870689
979 104870689 104916668 104885089 104778910 104600501 104352081 104048097 103698719 103288198 102775812 102118003
999.4 102118003 101280749 100225496 98945946 97469413 95847827 94034654 91254759 86849976 83505917
1017.7 83505917 85211748 90690804 95413518 97837907 98902559 99370301 99491894 99336886 98937267
1036.1 98937267 98329252 97542375 96601427 95533967 94368964 93143773 91869491 90530908 89126390
1054.5 89126390 87654155 86077732 84367049 82518607 80545491 78482783 76347011 74142718
$$ packed form
917.8I4292575J50657L81714L11810K06196J65683J54489J50073J51586J71692K60865
938.2I6397340M30924O35886Q23343R34243R16451P96211O42991M92370L62158K75791
958.6A02707708K50804K59710K69293K64419K45845K28333K08676J79005J47343J09553
979A04870689M5979l1579j06179j78409k48420l03984l49378m10521n12386o57809
999.4A02118003q37254j055253j279550j476533j621586j813173k779895m404783l344059
1017.7H3505917J705831N479056M722714K424389J064652M67742J21593j55008l99619
1036.1I8937267o08015p86877r40948j067460j165003j225191j274282j338583j404518
1054.5H9126390j472235j576423j710683j848442j973116k062708k135772k204293
$$ plain form
1070.8 74142718 71904838 69668669 67453754 65267605 63086057 60872060 58606243 56280178
1087.1 56280178 53884763 51431715 48937929 46396175 43818575 41278923 38890868 36768103
1103.4 36768103 35050663 34001163 33952239 35020545 36951232 39333802 41884762 44479668 47022787
1121.8 47022787 49357423 51304120 52755058 53734517 54374200 54820913 55177587 55519605 55937475
1140.1 55937475 56544101 57450318 58726966 60395026 62439132 64814872 67443949 70207107 72987652
1158.5 72987652 75712061 78331953 80803019 83081907 85135663 86951363 88492054 89650279
1174.8 89650279 90378726 90935224 91784871 93142742 94796461 96381539 97673196 98634756 99315196
1193.1 99315196 99741942 99854428 99535441 98764431 97750819 96911389 96639556 96912217 97189289 96907467
$$ packed form
1070.8G4142718k237880k236169k214915k186149k181548k213997k265817k326065
1087.1E6280178k395415k453048k493786k541754k577600k539652k388055k122765
1103.4C6768103j717440j049500m8924J068306J930687K382570K550960K594906K543119
1121.8D7022787K334636J946697J450938R79459O39683M46713L56674L42018M17870
1140.1E5937475O06626R06217J276648J668060K044106K375740K629077K763158K780545
1158.5G2987652K724409K619892K471066K278888K053756J815700J540691J158225
1174.8H9650279P28447N56498Q49647J357871J653719J585078J291657R61560O80440
1193.1I9315196M26746J12486l18987p71010j013612q39430k71833K72661K77072k81822
$$ plain form
1213.5 96907467 95941997 94517738 92969656 91663092 90926021 90919977 91552311 92532170 93526936 94309413
1233.9 94309413 94819725 95139855 95385617 95620853 95868176 96121836 96367162 96609592 96862507 97144395
1254.3 97144395 97469288 97817844 98149699 98438823 98692638 98910743 99062347 99119884 99078441 98946381
1274.7 98946381 98727781 98419422 98006082 97484452 96930397 96444505 95927525 95086980 93826592 92602754
1295.1 92602754 92162138 92681766 93576616 94282484 94676197 94864023 94992143 95182765 95506167 96007955
1315.5 96007955 96722609 97589952 98458350 99209011 99752003 99986821 99855435 99393296 98696601 97856557
1335.9 97856557 96900129 95855135 94871020 94116932 93712950 93764997 94262522 95056456 95944965 96677351
1356.3 96677351 97023845 96794254 95662147 93423635 90261018 86434346 82835156 80771983 81171757
$$ packed form
1213.5I6907467r65470j424259j548082j306564p37071o044O32334R79859R94766P82477
1233.9I4309413N10312L20130K45762K35236K47323K53660K45326K42430K52915K81888
1254.3I7144395L24893L48556L31855K89124K53815K18105J51604N7537m1443j32060
1274.7I8946381k18600l08359m13340n21630n54055m85892n16980q40545j260388j223838
1295.1I2602754m40616N19628Q94850P05868L93713J87826J28120J90622L23402N01788
1315.5I6007955P14654Q67343Q68398P50661N42992K34818j31386m62139o96695q40044
1335.9I7856557r56428j044994r84115p54088m03982N2047M97525P93934Q88509P32386
1356.3I6677351L46494k29591j132107k238512l162617l826672l599190k063173L99774
$$ plain form
1374.7 81171757 83830357 87449986 90809238 93311405 95104396 96517402 97603089 98420250 99190289
1393 99190289 99893892 100351739 100568485 100611377 100552273 100288320 99615782 98439032 96827406 95424294
1413.4 95424294 95214009 96692795 99235064 101108849 101894546 101916647 101283503 99989164 98244506
1431.8 98244506 96666241 95405895 94313872 93422902 92661750 91985095 91431600 90969044 90622848
1450.1 90622848 90514183 90698785 91194028 91655517 91886830 92353433 93293357 94390374 95316046 96241909
1470.5 96241909 97122580 97653288 98081428 98795164 99766874 100712681 101447749 102042091 102432263 102375114
1490.9 102375114 102052450 101626301 100821006 99382067 97568792 95625359 92964906 88355458 83740038
1509.3 83740038 80150098 76655722 72589058 67560941 62257516 57007873 53348637 52306902
$$ packed form
1374.7H1171757K658600L619629L359252K502167J792991J413006J085687Q17161P70039
1393I9190289P03603M57847K16746M2892n9104k63953o72538j176750j611626j403112
1413.4I5424294k10285J478786K542269J873785P85697K2101o33144j294339j744658
1431.8I8244506j578265j260346j092023q90970p61152o76655n53495m62556l46196
1450.1I0622848j08665J84602M95243M61489K31313M66603R39924J097017R25672R25863
1470.5I6241909Q80671N30708M28140P13736R71710R45807P35068N94342L90172n7149
1490.9A02375114l22664m26149q05295j438939j813275j943433k660453m609448m615420
1509.3H3740038l589940l494376m066664n028117n303425n249643l659236j041735
$$ plain form
1525.6 52306902 53322303 55755794 59557348 65005893 70235252 74938405 81052601 86833751
1541.9 86833751 90586901 93563974 96170777 98593205 100691259 102430701 103964806 105381656
1558.2 105381656 105890250 105651164 105428565 105126011 104216290 102017236 98970735 95702976 93059534
1576.6 93059534 93162537 95856017 99512535 102390587 103804457 104108429 103708923 102839100 101606190
1594.9 101606190 100086188 98325831 96197629 93382561 89795524 86365402 84978825 86705196
1611.3 86705196 90502626 95192337 99715006 102500284 104175949 105498910 106324673 106779885 107058477
1629.6 107058477 107316160 107738066 108087790 107960844 107731652 107704854 107932150 108304548 108454335 108521104
1650 108521104 108872330 108961284 108607042 108477366 108621764 108819830 108876920 108954000 109157562 109220040 109095776
$$ packed form
1525.6E2306902J015401K433491L801554N448545N229359M703153O114196N781150
1541.9H6833751L753150K977073K606803K422428K098054J739442J534105J416850
1558.2A05381656N08594k39086k22599l02554r09721k199054l046501l267759k643442
1576.6I3059534J03003K693480L656518K878052J413870L03972l99506q69823j232910
1594.9A01606190j520002j760357k128202k815068l587037l430122j386577J726371
1611.3H6705196L797430M689711M522669K785278J675665J322961Q25763M55212K78592
1629.6A07058477K57683M21906L49724j26946k29192k6798K27296L72398J49787O6769
1650A08521104L51226Q8954l54242j29676J44398J98066N7090P7080K03562O2478j24264
$$ plain form
1672.4 109095776 108954096 108725679 108527780 108542299 108699155 108528244 108003056 107620668 107377458 107293820
1692.8 107293820 107364798 107388818 107198656 106593966 105818987 105022323 103974879 102817249 101737773
1711.2 101737773 100781643 99835187 98480171 96743077 95168287 93732804 92467630 91690528 91596162
1729.5 91596162 92311996 94087130 96325779 98331517 100576413 102773297 104500639 105915582 107080972
1747.9 107080972 107940018 108408296 108667874 108912623 109108877 109246433 109306228 109260905 109254885 109324193
1768.3 109324193 109364605 109154725 108674717 108281493 108155692 108261311 108476162 108717775 108936501 109174585
1788.7 109174585 109473658 109665406 109677899 109719503 109848499 109937680 109931850 109921527 109972060 110054600 110088968
1811.1 110088968 110051000 110018170 110020459 110029590 110064399 110148191 110222852 110271561 110294318 110200131 110077405 110039842
$$ packed form
1672.4A09095776j41680k28417j97899J4519J56856j70911n25188l82388k43210q3638
1692.8A07293820P0978K4020j90162o04690p74979p96664j047444j157630j079476
1711.2A01737773r56130r46456j355016j737094j574790j435483j265174p77102r4366
1729.5I1596162P15834J775134K238649K005738K244896K196884J727342J414943J165390
1747.9A07080972Q59046M68278K59578K44749J96254J37556N9795m5323o020O9308
1768.3A09324193M0412k09880m80008l93224j25801J05619K14851K41613K18726K38084
1788.7A09174585K99073J91748J2493M1604J28996Q9181n830j0323N0533Q2540L4368
1811.1A10088968l7968l2830K289R131L4809Q3792P4661M8709K2757r4187j22726l7563
$$ plain form
1835.6 110039842 110030472 110031033 110119510 110230076 110183227 110045516 109941483 109880960 109847248 109825230 109793711
1858 109793711 109736693 109671187 109648883 109692824 109690201 109513605 109273601 109101367 108994293 108920801 108855796
1880.5 108855796 108791649 108731055 108682597 108618522 108466339 108264899 108085489 107908952 107748663 107652915
1900.9 107652915 107630014 107675326 107787657 107943237 108097124 108251274 108450592 108672321 108830190 108943462
1921.3 108943462 109050500 109121454 109184241 109261549 109335411 109397602 109450567 109503543 109576559 109657431 109681165
1943.7 109681165 109650934 109625804 109624434 109634352 109639359 109641623 109648442 109647095 109636235 109644783 109678018 109698820 109697795
1970.2 109697795 109700203 109712470 109732795 109754002 109771883 109791517 109813142 109837115 109870231 109909487 109921324 109904540
1994.7 109904540 109900868 109910822 109914279 109916794 109923339 109932554 109941876 109944642 109950840 109970963 109985280 109977055 109963048
$$ packed form
1835.6A10039842r370N61Q8477J10566m6849j37711j04033o0523l3712k2018l1519
1858A09793711n7018o5506k2304M3941k623j76596k40004j72234j07074p3492o5005
1880.5A08855796o4147o0594m8458o4075j52183k01440j79410j76537j60289r5748
1900.9A07652915k2901M5312J12331J55580J53887J54150J99318K21729J57869J13272
1921.3A08943462J07038P0954O2787P7308P3862O2191N2965N2976P3016Q0872K3734
1943.7A09681165l0231k5130j370R918N007K264O819j347j0860Q548L3235K0802j025
1970.2A09697795K408J2267K0325K1207J7881J9634K1625K3973L3116L9256J1837j6784
1994.7A09904540l672R954L457K515O545R215R322K766O198K0123J4317q225j4007
$$ plain form
2021.2 109963048 109958076 109958529 109958589 109952688 109942210 109931850 109913051 109878337 109831595 109774220 109703493 109615922 109513962
2047.7 109513962 109404182 109285271 109149063 108991086 108811724 108611655 108404183 108202291 108000362 107808995
2068.1 107808995 107651639 107540762 107491279 107503402 107559395 107644224 107743990 107848942 107951558 108046103 108134401
2090.5 108134401 108215249 108286989 108352804 108414578 108470249 108511138 108526731 108506215 108448756 108362818 108245242
2113 108245242 108083105 107863915 107588303 107265306 106890213 106449473 105936337 105348527 104683638 103953767
2133.4 103953767 103183377 102387440 101575220 100763452 99980754 99263597 98638195 98102492 97635025 97204316
2153.8 97204316 96768934 96296102 95767593 95179266 94547123 93897045 93258983 92660636 92115790 91619319
2174.2 91619319 91142541 90647089 90100682 89475977 88748854 87906891 86954051 85896134 84746975
$$ packed form
2021.2A09963048m972M53O0n901j0478j0360j8799l4714m6742n7375p0727q7571j01960
2047.7A09513962j09780j18911j36208j57977j79362k00069k07472k01892k01929j91367
2068.1A07808995j57356j10877m9483J2123N5993Q4829R9766J04952J02616R4545Q8298
2090.5A08134401Q0848P1740O5815O1774N5671M0889J5593k0516n7459q5938j17576
2113A08245242j62137k19190k75612l22997l75093m40740n13136n87810o64889p29871
2133.4A03953767p70390p95937q12220q11768p82698p17157o25402n35703m67467m30709
2153.8I7204316m35382m72832n28509n88327o32143o50078o38062n98347n44846m96471
2174.2I1619319m76778m95452n46407o24705p27123q41963r52840j057917j149159
$$ plain form
2192.5 84746975 83532745 82275963 80999112 79720330 78437799 77148682 75855845 74548185
2208.8 74548185 73203832 71799827 70317501 68724287 66959381 64937168 62553895 59709334
2225.2 59709334 56318885 52322626 47715664 42579174 37085000 31487107 26084459 21166660
2241.5 21166660 16961840 13585189 11017063 9131324 7759786 6730404 5902065 5185315 4536983
2259.8 4536983 3951763 3449680 3050620 2755232 2557644 2445187 2409991 2451754 2572383 2780205
2280.2 2780205 3101205 3583387 4285268 5278192 6633542 8421223 10707682 13529654 16875768
2298.6 16875768 20705669 24934049 29442859 34115183 38805625 43354526 47609097 51484197
2314.9 51484197 55064428 58482838 61674631 64468420 66852516 69013894 71102101 73020315
$$ packed form
2192.5H4746975j214230j256782j276851j278782j282531j289117j292837j307660
2208.8G4548185j344353j404005j482326j593214j764906k022213k383273k844561
2225.2E9709334l390449l996259m606962n136490n494174n597893n402648m917799
2241.5B1166660m204820l376651k568126j885739j371538j029382q28339p16750o48332
2259.8D536983n85220n02083l99060k95388j97588j12457l5196M1763J20629K07822
2280.2B780205L21000M82182P01881R92924J355350J787681K286459K821972L346114
2298.6A6875768L829901M228380M508810M672324M690442M548901M254571L875100
2314.9E1484197L580231L418410L191793K793789K384096K161378K088207J918214
$$ plain form
2331.2 73020315 74689031 76296842 77966583 79621446 81118494 82140362 82320291 82205647 82967442
2349.6 82967442 85166287 88419265 91728133 94531882 96686530 98210084 99142772 99522233 99496269
2367.9 99496269 99274796 99002552 98753035 98550475 98395669 98292464 98313218 98560536 99064469 99749851
2388.3 99749851 100503588 101250255 101954389 102600610 103184378 103716636 104201972 104641354 105038989 105400527
2408.7 105400527 105736983 106058228 106367397 106647480 106888247 107106364 107313871 107507551 107690287 107865834
2429.1 107865834 108035028 108199131 108360076 108520210 108678138 108827090 108960009 109087634 109216642 109339261
2449.5 109339261 109452891 109559965 109662795 109760261 109851325 109935439 110011637 110083306 110160017 110237002 110301602
2471.9 110301602 110360003 110423803 110489225 110544157 110585129 110621500 110657871 110686910 110705614 110719991 110739434 110766804
$$ packed form
2331.2G3020315J668716J607811J669741J654863J497048J021868J79929j14644P61795
2349.6H2967442K198845L252978L308868K803749K154648J523554R32688L79461k5964
2367.9I9496269k21473k72244k49517k02560j54806j03205K0754K47318N03933O85382
2388.3I9749851P53737P46667P04134O46221N83768N32258M85336M39382L97635L61538
2408.7A05400527L36456L21245L09169K80083K40767K18117K07507J93680J82736J75547
2429.1A07865834J69194J64103J60945J60134J57928J48952J32919J27625J29008J22619
2449.5A09339261J13630J07074J02830R7466R1064Q4114P6198P1669P6711P6985O4600
2471.9A10301602N8401O3800O5422N4932M0972L6371TK9039J8704J4377J9443K7370
$$ plain form
2496.4 110766804 110793436 110812461 110831904 110858703 110884333 110902083 110909605 110910380 110914505 110921204 110926819 110936570 110951388
2522.9 110951388 110969949 110992169 111010897 111020517 111026871 111031866 111027062 111016548 111010718 111007309 110999048 110986567 110975003
2549.4 110975003 110963142 110950398 110939777 110931170 110915422 110887623 110855830 110821784 110780418 110727811 110667360 110604215
2573.9 110604215 110530734 110452104 110381353 110311031 110241067 110177732 110111487 110039353 109980059 109956288 109976554
2596.4 109976554 110033810 110114121 110198033 110266316 110315216 110353422 110386693 110408294 110411429 110401106 110383391 110362339
2620.8 110362339 110335195 110300851 110266256 110229850 110190642 110152221 110112894 110076070 110051155 110039282 110026860
2643.3 110026860 110006392 109991610 109985530 109975588 109960592 109939742 109905672 109862173 109818220 109772432 109719157 109662628
2667.7 109662628 109614801 109581006 109555185 109526229 109498966 109493566 109502518 109497607 109473312 109434867 109386218 109332824
$$ packed form
2496.4A10766804K6632J9025J9443K6799K5630J7750P522P75M125O699N615R751J4818
2522.9A10951388J8561K2220J8728R620O354M995m804j0514n830l409q261j2481j1564
2549.4A10975003j1861j2744j0621q607j5748k7799l1793l4046m1366n2607o0451o3145
2573.9A10604215p3481p8630p0751p0322o9964o3335o6245p2134n9294k3771K0266
2596.4A09976554N7256Q0311Q3912O8283M8900L8206L3271K1601L135j0323j7715k1052
2620.8A10362339k7144l4344l4595l6406l9208l8421l9327l6824k4915j1873j2422
2643.3A10026860k0468j4782o080r942j4996k0850l4070m3499m3953m5788n3275n6529
2667.7A09662628m7827l3795k5821k8956k7263n400Q952m911k4295l8445m8649n3394
$$ plain form
2692.2 109332824 109275723 109218037 109164989 109116364 109066987 109016263 108961892 108899629 108835995 108769703 108695686
2714.6 108695686 108620822 108539116 108445907 108356237 108276379 108219600 108195484 108177686 108149457 108114147 108081174
2737.1 108081174 108065069 108052814 108017921 107947981 107849801 107756913 107679343 107582867 107454884 107318163 107186294
2759.5 107186294 107056487 106927478 106799877 106672406 106542468 106403756 106262040 106141496 106044769 105943823
2779.9 105943823 105827951 105717719 105619109 105521691 105441368 105393457 105359924 105316126 105265033 105221343 105169165
2802.4 105169165 105090475 104985952 104847097 104676640 104488409 104269826 104003263 103690934 103336895 102926207
2822.7 102926207 102428091 101816952 101069927 100157607 99056876 97771823 96341330 94832641 93294144
2841.1 93294144 91712207 90058154 88330138 86532748 84672183 82789260 80952805 79217130
$$ packed form
2692.2A09332824n7101n7686n3048m8625m9377n0724n4371o2263o3634o6292p4017
2714.6A08695686p4864q1706r3209q9670p9858n6779k4116j7798k8229l5310l2973
2737.1A08081174j6105j2255l4893o9940r8180r2888p7570r6476j27983j36721j31869
2759.5A07186294j29807j29009j27601j27471j29938j38712j41716j20544r6727j00946
2779.9A05943823j15872j10232r8610r7418q0323m7911l3533m3798n1093m3690n2178
2802.4A05169165p8690j04523j38855j70457j88231k18583k66563l12329l54039m10688
2822.7A02926207m98116o11139p47025r12320j100731j285053j430493j508689j538497
2841.1I3294144j581937j654053j728016j797390j860565j882923j836455j735675
$$ plain form
2857.4 79217130 77634615 76265550 75147915 74299860 73747939 73510242 73569071 73879421 74368840
2875.8 74368840 74947417 75519991 75993991 76309818 76445210 76403302 76221824 75959933 75675201 75431597
2896.2 75431597 75291616 75296015 75461763 75779235 76220983 76754117 77332497 77908593 78447872 78901815
2916.6 78901815 79214209 79353452 79308385 79102218 78815919 78600210 78677505 79260010 80422109 82061058
2937 82061058 83966625 85903668 87682086 89210260 90462667 91410142 92017913 92271513 92114282
2955.3 92114282 91394126 89961022 87778765 84995347 82011920 79422641 77753401 77213180 77679724
2973.7 77679724 78857672 80437011 82195061 84050149 86026651 88160199 90414292 92666453
2990 92666453 94802701 96765453 98482305 99899745 101034260 101915097 102605152 103188550 103677487
$$ packed form
2857.4G9217130j582515j369065j117635q48055n51921k37697N8829L10350M89419
2875.8G4368840N78577N72574M74000L15827J35392m1908j81478k61891k84732k43604
2896.2G5431597j39981M399J65748L17472M41748N33134N78380N76096N39279M53943
2916.6G8901815L12394J39243m5067k06167k86299k15709P7295N82505J162099J638949
2937H2061058J905567J937043J778418J528174J252407R47475O07771K53600j57231
2955.3I2114282p20156j433104k182257k783418k983427k589279j669240n40221M66544
2973.7G7679724J177948J579339J758050J855088J976502K133548K254093K252161
2990I2666453K136248J962752J716852J417440J134515Q80837O90055N83398M88937
$$ plain form
3008.3 103677487 104038143 104277575 104436159 104510832 104471231 104317200 104068410 103831422 103759229 103867698
3028.7 103867698 104068005 104274035 104456770 104580736 104528868 104345548 104256368 104373956 104642868 104931879
3049.1 104931879 105195642 105460525 105678356 105833614 105946851 105984187 105954695 105920470 105981791 106223440
3069.5 106223440 106572711 106893766 107138085 107351732 107618630 107933223 108225799 108491969 108727574 108915484
3089.9 108915484 109099019 109277427 109392405 109444487 109490681 109560835 109618676 109629059 109626770 109668529 109716511
3112.4 109716511 109705150 109675765 109680104 109722281 109804344 109896898 109954965 109986484 110046530 110145259 110235953 110292625
3136.8 110292625 110345137 110455573 110610831 110741043 110832000 110872233 110859406 110887790 111006618 111119390
3157.2 111119390 111161160 111158407 111144483 111135352 111127591 111114728 111094499 111065304 111026955 110980821 110929477 110882831
$$ packed form
3008.3A03677487L60656K39432J58584P4673l9601j54031k48790k36988p2193J08469
3028.7A03867698K00307K06030J82735J23966n1868j83320q9180J17588K68912K89011
3049.1A04931879K63763K64883K17831J55258J13237L7336k9492l4225O1321K41649
3069.5A06223440L49271L21055K44319K13647K66898L14593K92576K66170K35605J87910
3089.9A08915484J83535J78408J14978N2082M6194P0154N7841J0383k289M1759M7982
3112.4A09716511j1361k9385M339M2177Q2063R2554N8067L1519O0046R8729R0694N6672
3136.8A10292625N2512J10436J55258J30212R0957M0233j2827K8384J18828J12772
3157.2A11119390M1770k753j3924r131p761j2863k0229k9195l8349m6134n1344m6646
$$ plain form
3181.7 110882831 110851514 110829926 110814416 110819459 110855651 110918701 110994434 111063337 111118829 111166513 111210346 111262596
3206.2 111262596 111328709 111386073 111418676 111441422 111464000 111472845 111473310 111463857 111416483 111342764 111266851 111161065
3230.7 111161065 111034334 110982823 111003053 110996032 110954106 110895181 110804474 110715008 110667884 110634363 110574591
3253.1 110574591 110495448 110439825 110420907 110391605 110328698 110254884 110171819 110067761 109991205 109974706 109977365
3275.5 109977365 109967589 109933937 109883690 109837997 109804261 109768951 109701169 109611666 109561396 109579694 109640539 109687018
3300 109687018 109669185 109604728 109573078 109615684 109705377 109797418 109854722 109892583 109936166 109967041 109969604 109948266
3324.5 109948266 109941602 109965849 109976351 109958172 109918404 109847045 109783387 109761584 109747279 109729540 109710395 109653807
3348.9 109653807 109585977 109579504 109607959 109593403 109536207 109493124 109459293 109361780 109199297 109057593 108979845
$$ packed form
3181.7A10882831l1317k1588j5510N043L6192O3050P5733O8903N5492M7684M3833N2250
3206.2A11262596O6113N7364L2603K2746K2578Q845M65r453m7374p3719p5913j05786
3230.7A11161065j26731n1511K0230p021m1926n8925r0707q9466m7124l3521n9772
3253.1A10574591p9143n5623j8918k9302o2907p3814q3065j04058p6556j6499K659
3275.5A09977365r776l3652n0247m5693l3736l5310o7782q9503n0270J8298O0845M6479
3300A09687018j7833o4457l1650M2606Q9693R2041N7304L7861M3583L0875K563k1338
3324.5A09948266o664K4247J0502j8179l9768p1359o3658k1803j4305j7739j9145n6588
3348.9A09653807o7830o473K8455j4556n7196m3083l3831r7513j62483j41704p7748
$$ plain form
3371.4 108979845 108903241 108758211 108564997 108361089 108150446 107935643 107721543 107502544 107295907 107161379
3391.8 107161379 107123601 107136834 107144451 107166231 107294428 107526481 107756424 107948339 108135855 108331740
3412.2 108331740 108551955 108802545 109043312 109257770 109449172 109602308 109719169 109824705 109943092 110062313
3432.6 110062313 110159993 110279012 110460591 110649824 110781026 110863984 110922992 110953820 110978854 111024296 111070871
3455 111070871 111083150 111059391 111053538 111049068 110958362 110821509 110780096 110862267 110945332 110945749 110875571 110790598
3479.5 110790598 110765147 110772538 110743761 110708106 110680199 110633564 110592604 110566390 110537851 110521901 110520315 110530174
3504 110530174 110561812 110597360 110599005 110551989 110510159 110524428 110568094 110603046 110630059 110680091 110749650 110784352
3528.4 110784352 110771298 110752320 110742688 110731637 110733974 110757935 110798645 110851085 110896039 110925162 110939443 110927951
$$ packed form
3371.4A08979845p6604j45030j93214k03908k10643k14803k14100k18999k06637j34528
3391.8A07161379l7778J3233P617K1780J28197K32053K29943J91915J87516J95885
3412.2A08331740K20215K50590K40767K14458J91402J53136J16861J05536J18387J19221
3432.6A10062313R7680J19019J81579J89233J31202Q2958N9008L0828K5034M5442M6575
3455A11070871J2279k3759n853m470r0706j36853m1413Q2171Q3065M17p0178q4973
3479.5A10790598k5451P391k8777l5655k7907m6635m0960k6214k8539j5950j586R859
3504A10530174L1638L5548J645m7016m1830J4269M3666L4952K7013N0032O9559L4702
3528.4A10784352j3054j8978r632j1051K337K3961M0710N2440M4954K9123J4281j1492
$$ plain form
3552.9 110927951 110901403 110908103 110957122 111019361 111123693 111294699 111367679 111200094 111006546 110959458 110990763
3575.3 110990763 111009049 111005402 111010039 111080396 111258090 111443412 111484957 111482275 111536026 111570501 111560380 111552298
3599.8 111552298 111541998 111561847 111657369 111735392 111702740 111653876 111681962 111808801 111967075 111989415 111917460
3622.2 111917460 111959898 112192321 112404871 112246561 111936247 111717045 111550343 111419344 111330509 111291134
3642.6 111291134 111388230 111668324 111834407 111550403 111173236 110976708 110799563 110552466 110373616 110288775
3663 110288775 110270357 110392892 110598207 110651457 110655892 110668790 110456359 110173523 110017443 109993386 110095274
3685.5 110095274 110301399 110472035 110440993 110310304 110260129 110326123 110444117 110518336 110500383 110517550 110686398
3707.9 110686398 110888004 110833204 110587263 110514212 110719776 111083865 111442542 111707413 111844611 111896420
$$ packed form
3552.9A10927951k6548O700M9019O2239J04332J71006P2980j67585j93548m7088L1305
3575.3A10990763J8286l647M637P0357J77694J85322M1545k682N3751L4475j0121q082
3599.8A11552298j0300J9849R5522P8023l2652m8864K8086J26839J58274K2340p1955
3622.2A11917460M2438K32423K12550j58310l10314k19202j66702j30999q8835l9375
3642.6A11291134R7096K80094J66083k84004l77167j96528j77145k47097j78850q4841
3663A10288775j8418J22535K05315N3250M435J2898k12431k82836j56080k4057J01888
3685.5A10095274K06125J70636l1042j30689n0175O5994J17994P4219j7953J7167J68848
3707.9A10686398K01606n4800k45941p3051K05564L64089L58677K64871J37198N1809
$$ plain form
3728.3 111896420 112019682 112273133 112448537 112307286 112022090 111927652 112096882 112283576 112317228 112416136
3748.7 112416136 112480295 112268996 112047827 112008035 112024367 111959827 111915934 111967754 112037992 112067604 111999631
3771.1 111999631 111878049 111842835 111906540 111950731 111928225 111903465 111868751 111804533 111759198 111783469 111898685
3793.6 111898685 112058246 112203276 112358797 112426901 112333870 112251556 112151277 112023067 112044442 112254679
3814 112254679 112494171 112647688 112752545 112676775 112489986 112427843 112482846 112593222 112716568 112835717
3834.4 112835717 112989807 113107347 113060999 112894583 112706828 112622285 112766016 113163495 113539147 113371611
3854.8 113371611 112994838 112842000 112902355 113026226 113059449 113093197 113192344 113186789 113072491 112958956 112927794
3877.2 112927794 113014209 113066208 113030744 112982702 112927985 112926352 112941635 112892067 112899363 113052988 113241565
$$ packed form
3728.3A11896420J23262K53451J75404j41251k85196r4438J69230J86694L3652R8908
3748.7A12416136O4159k11299k21169l9792J6332o4540m3893N1820P0238K9612o7973
3771.1A11999631j21582l5214O3705M4191k2506k4760l4714o4218m5335K4271J15216
3793.6A11898685J59561J45030J55521O8104r3031q2314j00279j28210K1375K10237
3814A12254679K39492J53517J04857p5770j86789o2143N5003J10376J23346J19149
3834.4A12835717J54090J17540m6348j66416j87755q4543J43731L97479L75652j67536
3854.8A13371611l76773j52838O0355J23871L3223L3748R9147n555j14298j13535l1162
3877.2A12927794Q6415N1999l5464m8042n4717j633J5283m9568P296J53625J88577
$$ plain form
3899.6 113241565 113315535 113229370 113030159 112849438 112763667 112762344 112833023 112922311 112937939 112892461 112874663
3922.1 112874663 112885666 112877858 112883186 112911105 112876749 112774539 112702024 112706637 112770414 112818766 112792659 112749076
3946.5 112749076 112735975 112717390 112677324 112636769 112604952 112585449 112566507 112535620 112512672 112507486 112506890 112502062
3971 112502062 112490296 112469351 112433195 112399042 112384343 112367952 112346494 112333608 112329257 112329602 112325180 112309301 112282503
3997.5 112282503
$$ packed form
3899.6A13241565P3970q6165j99211j80721q5771j323P0679Q9288J5628m5478j7798
3922.1A12874663J1003p808N328K7919l4356j02210p2515M613O3777M8352k6107m3583
3946.5A12749076j3101j8585m0066m0555l1817j9503j8942l0887k2948n186n96m828
3971A12502062j1766k0945l6156l4153j4699j6391k1458j2886m351L45m422j5879k6798
3997.5A12282503
##END=$$ End of the data block
