##TITLE=$$ Begin of the data block
##JCAMP-DX=5.00 $$ ACD/DocManager Library v 5.00
##SPECTROMETER/DATA SYSTEM=Alpha
##DATE=23 Feb 2017 11:46:40
##DATA TYPE=INFRARED SPECTRUM
##DATA CLASS=XYDATA
##ORIGIN=
##OWNER=
##NPOINTS=1667
##FIRSTX=599.65832520
##LASTX=3997.72216797
##MAXX=3997.72216797
##MINX=599.65832520
##MAXY=1.03244984
##MINY=0.43728888
##XFACTOR=1.0000000000
##YFACTOR=0.0000322641
##FIRSTY=0.91776681
##DELTAX=2.03965425
##XUNITS=1/CM
##YUNITS=ARBITRARY UNITS
##XYDATA=(X++(Y..Y))
599.7B8445l39l51l50l12k17r8K3J36K19K60K75K64K18J67J20P5L3j3o0j05j60k20
$$ 28445 28106 27755 27405 27093 26876 26778 26801 26937 27156 27416 27691 27955 28173 28340 28460 28535 28568 28555 28495 28390 28230 28010
644.5B8010k74k99k78k16j48j03q6p7n9l0J9R6J28J34J44J39J32J28J14Q9O7N9O2O4
$$ 28010 27736 27437 27159 26943 26795 26692 26606 26529 26470 26440 26459 26555 26683 26817 26961 27100 27232 27360 27474 27563 27630 27689 27751 27815
693.5B7815N6M5N3O7N4Po1j40k08k62l21l88m19l60k26j03j9L9R1J42J89K14J94J34
$$ 27815 27871 27916 27969 28036 28090 28097 28036 27896 27688 27426 27105 26717 26298 25938 25712 25609 25590 25629 25720 25862 26051 26265 26459 26593
742.4B6593P1M3O0J01J41J77J99J98J81J53J17Q2N8M8M6M7M5L6K9L1L3L0TK9K5K9L5
$$ 26593 26664 26707 26767 26868 27009 27186 27385 27583 27764 27917 28034 28116 28174 28222 28268 28315 28360 28396 28425 28456 28489 28519 28549 28578 28603 28632 28667
797.5B8667K8RnkQJ3J4Rj6n0n5oO4J06J02P6N4M4M1L6K9K1J6J8K2K1J7RKjMKmrj3j5
$$ 28667 28695 28704 28699 28697 28705 28718 28732 28741 28725 28675 28620 28614 28678 28784 28886 28962 29016 29060 29101 29137 29166 29187 29203 29221 29243 29264 29281 29290 29292 29291 29295 29297 29293 29284 29271 29256
870.9B9256k2l5l9l7k7j1%ONjj2k3m0n2n6n4n5n8o0n1l5k2pJ6M5O1N9N3M9VM6M1L3
$$ 29256 29234 29199 29160 29123 29096 29085 29085 29091 29096 29095 29083 29060 29020 28968 28912 28858 28803 28745 28685 28634 28599 28577 28570 28586 28631 28692 28751 28804 28853 28902 28951 29000 29046 29087 29120
942.3B9120K2J0Jnj1j4j7k6l6l9l2k5j3%Ljk%J%NJ5K0J9J4J3ROkj5l1m7n9n5k5RL0
$$ 29120 29142 29152 29153 29148 29137 29123 29106 29080 29044 29005 28973 28948 28935 28935 28938 28937 28935 28935 28936 28936 28941 28956 28976 28995 29009 29022 29031 29037 29035 29020 28989 28942 28883 28828 28803 28812 28842
1017.8B8842L9M6N5N6N2N8O2N3L7K8K3J6Pjj0j8k3l1m1n0n8o4o1m7k7lK3M1M4L6J4
$$ 28842 28881 28927 28982 29038 29090 29148 29210 29263 29300 29328 29351 29367 29374 29373 29363 29345 29322 29291 29250 29200 29142 29078 29017 28970 28943 28940 28963 29004 29048 29084 29098
1081B9098j0k6l5m0m6n9o7p2p9r5j11j29j41Tj27r9n4%N4J01J30J33J19R1N8K4qm0
$$ 29098 29088 29062 29027 28987 28941 28882 28815 28743 28664 28569 28458 28329 28188 28047 27920 27821 27767 27767 27821 27922 28052 28185 28304 28395 28453 28477 28469 28429
1138.1B8429o5q0r0r9j12j29j51j72j88k03k25k51k66k53k02j16qJ02J90K44K33J40
$$ 28429 28364 28284 28194 28095 27983 27854 27703 27531 27343 27140 26915 26664 26398 26145 25943 25827 25819 25921 26111 26355 26588 26728
1183B6728j8j83k77k69j95j05j5O2J13J37J30J06P4M5J6j0l6p2j18j72k27k72k98l03
$$ 26728 26710 26527 26250 25981 25786 25681 25666 25728 25841 25978 26108 26214 26288 26333 26349 26339 26303 26231 26113 25941 25714 25442 25144 24841
1232B4841k83k48k06j70j31q2k3K9O3P6Q0P8P1N8M5L5L9N3P1Q1P8O4N2N7Q2J12J28
$$ 24841 24558 24310 24104 23934 23803 23721 23698 23727 23790 23866 23946 24024 24095 24153 24198 24233 24272 24325 24396 24477 24555 24619 24671 24728 24810 24922 25050
1287B5050J14P9M3J2j4l4m0l6k6mL0P2J08J34J51J78K16K53K82K91K71K18J46P6K4
$$ 25050 25164 25243 25286 25298 25284 25250 25210 25174 25148 25144 25174 25246 25354 25488 25639 25817 26033 26286 26568 26859 27130 27348 27494 27570 27594
1338B7594jMQ%j9l6n1p4j20j98l12m07l00o0K1j45m51o65m68O5O11R23R93R61P26L70
$$ 27594 27593 27597 27605 27605 27586 27550 27499 27425 27305 27107 26795 26388 26088 26028 26049 25904 25453 24788 24320 24385 24996 25919 26912 27873 28599 28969
1391.1B8969J72J27J30J20R7P7M5k0j12k10k86l15l31l38l21m38o56q56j070j048p37
$$ 28969 29141 29268 29398 29518 29615 29692 29737 29717 29605 29395 29109 28794 28463 28125 27804 27366 26710 25854 24784 23736 22999
1433.9B2999m37j92j51k58k54j27j03k67m44m90m86l36l1J14K92P13J184J634K020
$$ 22999 22562 22370 22219 21961 21707 21580 21477 21210 20766 20276 19790 19454 19423 19537 19829 20542 21726 23360 25380
1472.6B5380J626R41O14M43L27K26J53R2K4l0p3p1J1Q7R1K5j72l26l87m14k96l9K66
$$ 25380 27006 27947 28561 29004 29331 29557 29710 29802 29826 29796 29723 29652 29663 29750 29841 29866 29694 29368 28981 28567 28271 28232 28498
1519.6B8498N29N46M10L45K57J89J66J25Q6Q0N2K8K7J9J8K5K7K1K0Ok%mj7k7Tk5k7
$$ 28498 29027 29573 29983 30328 30585 30774 30940 31065 31151 31231 31283 31311 31338 31357 31375 31400 31427 31448 31468 31474 31472 31472 31468 31451 31424 31397 31372 31345
1576.7C1345k2j4j9l7o6r7j39k05k79k67j16O3J26Q0N3R9J44J40J29J27R0O7O6O0M6
$$ 31345 31323 31309 31290 31253 31187 31090 30951 30746 30467 30200 30084 30147 30273 30353 30406 30505 30649 30789 30918 31045 31135 31202 31268 31328 31374
1627.7C1374L1K1J8Rj0k0k6k8k2j3nTj2jJ3K3K7K1J0%j3j6j9l1l6l7m3n4n2m5m9m8
$$ 31374 31405 31426 31444 31453 31443 31423 31397 31369 31347 31334 31329 31324 31312 31311 31324 31347 31374 31395 31405 31405 31392 31376 31357 31326 31290 31253 31210 31156 31104 31059 31010 30962
1692.9C0962o6q2q7j06j02j27j87k33k88l74n21p77q17o82p27p82p49p25o88p65o16
$$ 30962 30896 30814 30727 30621 30519 30392 30205 29972 29684 29310 28789 28012 27195 26513 25786 25004 24255 23530 22842 22077 21461
1735.8B1461k64p0J68M73P75J083J404J438J101Q64P08N09M03L00K08J72J52J36J02
$$ 21461 21197 21127 21295 21768 22543 23626 25030 26468 27569 28433 29141 29650 30053 30353 30561 30733 30885 31021 31123
1774.5C1123P7O9O3N1N0M5L6L2L4L0K6K4J9K1K2K1J7J5J2J1RQTPMTPTLKJTLT%KMK%
$$ 31123 31200 31269 31332 31383 31433 31478 31514 31546 31580 31610 31636 31660 31679 31700 31722 31743 31760 31775 31787 31798 31807 31815 31823 31830 31834 31838 31845 31852 31855 31857 31858 31859 31862 31865 31865 31867 31871 31873 31873
1854.1C1873%lmljnpKNL%jTLJklLRQNKLTKTLNLjkmTJL%lkJTjmTkKLKLJjkT%TmjJ%Uk
$$ 31873 31873 31870 31866 31863 31862 31857 31850 31852 31857 31860 31860 31859 31858 31861 31862 31860 31857 31860 31869 31877 31882 31884 31887 31890 31892 31894 31897 31902 31905 31904 31902 31898 31894 31895 31898 31898 31895 31893 31894 31895 31894 31890 31886 31884 31886 31889 31891 31894 31895 31894 31892 31890 31890 31890 31886 31885 31886 31886 31886 31886 31884
1978.5C1884k%jlTkjJTkUlmoTmopqnmTj%TjkU%MK%j%LKULJ%k%JLMLTKJj%MPLk%J%j
$$ 31884 31882 31882 31881 31878 31875 31873 31872 31873 31874 31872 31870 31868 31865 31861 31855 31849 31845 31839 31832 31824 31819 31815 31811 31810 31810 31810 31809 31807 31805 31803 31803 31807 31809 31809 31808 31808 31811 31813 31815 31817 31820 31821 31821 31819 31819 31820 31823 31827 31830 31833 31835 31836 31835 31835 31839 31846 31849 31847 31847 31848 31848 31847
2104.9C1847JKJKLTK%JLJk%Tj%KknlTkmkj%TkjlTj%TKJTKUjT%TKMTLKjljLNjk%J%K
$$ 31847 31848 31850 31851 31853 31856 31859 31861 31861 31862 31865 31866 31864 31864 31864 31863 31863 31865 31863 31858 31855 31852 31850 31846 31844 31843 31843 31843 31841 31840 31837 31834 31833 31833 31833 31835 31836 31837 31839 31841 31843 31842 31841 31841 31841 31843 31847 31851 31854 31856 31855 31852 31851 31854 31859 31858 31856 31856 31857 31857 31859
2227.3C1859KJjT%JUjk%J%jUlTkjnTlknmToqolnonkUlnpmjMJ2TP%k%MONOQKmnj2j5
$$ 31859 31861 31862 31861 31860 31860 31861 31862 31863 31862 31860 31860 31861 31861 31860 31859 31858 31855 31852 31850 31849 31844 31839 31836 31834 31829 31825 31821 31815 31807 31801 31798 31793 31787 31782 31780 31778 31776 31773 31768 31761 31757 31756 31760 31772 31784 31791 31791 31789 31789 31793 31799 31804 31810 31818 31820 31816 31811 31799 31784
2347.6C1784mJ2K0K4J0j1j3rTlTj1TqpmkJMNKlmkULT%kJUKLTMLJ%LNLK%jkJTKTLNL
$$ 31784 31780 31792 31812 31836 31846 31835 31822 31813 31804 31801 31798 31787 31776 31768 31761 31757 31755 31756 31760 31765 31767 31764 31760 31758 31756 31754 31757 31760 31760 31758 31759 31760 31761 31763 31766 31769 31773 31776 31777 31777 31780 31785 31788 31790 31790 31789 31787 31788 31789 31791 31793 31796 31801 31804
2457.8C1804%jkTjkTJ%mTlknolklmopToqrqTj0j2j1j0rj1j2j1ojlmlnTlklTmnpqTj0
$$ 31804 31804 31803 31801 31799 31798 31796 31794 31795 31795 31791 31787 31784 31782 31777 31771 31768 31766 31763 31759 31753 31746 31739 31733 31725 31716 31708 31700 31690 31678 31667 31657 31648 31637 31625 31614 31608 31607 31604 31600 31597 31592 31587 31584 31582 31579 31576 31572 31567 31560 31552 31544 31534
2563.8C1534rprj3j6j5j3j2Uj4j3j2Vqopj1TrqTj0romqj3Tj1Uj0Tj1rTj0j3j6j5j7
$$ 31534 31525 31518 31509 31496 31480 31465 31452 31440 31428 31416 31402 31389 31377 31365 31353 31341 31333 31327 31320 31309 31298 31289 31281 31273 31263 31254 31248 31244 31236 31223 31210 31199 31188 31177 31167 31157 31146 31137 31128 31118 31105 31089 31074 31057
2653.6C1057k0k1j9k2k3j9j5j4qlnrmORPMLMNKkoTj1j7k3l0l4Tk9k6k5k2j7pQJ7K2
$$ 31057 31037 31016 30997 30975 30952 30933 30918 30904 30896 30893 30888 30879 30875 30881 30890 30897 30901 30904 30908 30913 30915 30913 30907 30901 30890 30873 30850 30820 30786 30752 30723 30697 30672 30650 30633 30626 30634 30651 30673
2733.1C0673K4K6L1L0K3J2OJ2J8J6Noj1j6j9k3k8l7m9n6Uo6p7q2q8r4r8r9j02j09j14
$$ 30673 30697 30723 30754 30784 30807 30819 30825 30837 30855 30871 30876 30870 30859 30843 30824 30801 30773 30736 30687 30631 30575 30519 30453 30376 30294 30206 30112 30014 29915 29813 29704 29590
2798.4B9590j15j28j47j65j80j93k10k32k57k88l24l71m39n30o44p73q92r85j042j060
$$ 29590 29475 29347 29200 29035 28855 28662 28452 28220 27963 27675 27351 26980 26541 26011 25367 24594 23702 22717 21675 20615
2839.2B0615j039r85r03p97o62m83k58l2J59K88L46L39K84K14J89K41L34L82L41K14
$$ 20615 19576 18591 17688 16891 16229 15746 15488 15456 15615 15903 16249 16588 16872 17086 17275 17516 17850 18232 18573 18787
2880A8787M8j12k37l21l62l72l63l45l28l06k87k69k55k43k39k35k32k26k08j73j17
$$ 18787 18835 18723 18486 18165 17803 17431 17068 16723 16395 16089 15802 15533 15278 15035 14796 14561 14329 14103 13895 13722 13605
2922.8A3605n2J6P3J13J45J78K05K10J95J54R2K2k4k2J1O4J45K42L48M64N93P31Q57
$$ 13605 13553 13569 13642 13755 13900 14078 14283 14493 14688 14842 14934 14956 14932 14910 14921 14985 15130 15372 15720 16184 16777 17508 18365
2969.7A8365R50R92R82R37Q59P62O63N76M98M25L51K81K06J28N2j3m8l4K7J25K32L19
$$ 18365 19315 20307 21289 22226 23085 23847 24510 25086 25584 26009 26360 26641 26847 26975 27027 27014 26966 26932 26959 27084 27316 27635
3014.6B7635L67L75L51L07K60K23J86J54J38J31J20R4P3O4O0N1L7L2L5L4L7M3L9L2
$$ 27635 28002 28377 28728 29035 29295 29518 29704 29858 29996 30127 30247 30341 30414 30478 30538 30589 30626 30658 30693 30727 30764 30807 30846 30878
3063.5C0878L0M0M9TM2L1K5K8L1K8K7K6K4K6K7K1J4TK2K3J4J1K0J4jTJ2K1K4K0R%M
$$ 30878 30908 30948 30997 31046 31088 31119 31144 31172 31203 31231 31258 31284 31308 31334 31361 31382 31396 31410 31432 31455 31469 31480 31500 31514 31513 31512 31524 31545 31569 31589 31598 31598 31602
3130.8C1602J1PlTQJ3RLoj2nJ0J6J2NLknkKJKMOPNOQOQJ4J2POQRQJ1J3J0LKMNOQPj
$$ 31602 31613 31620 31617 31614 31622 31635 31644 31647 31641 31629 31624 31634 31650 31662 31667 31670 31668 31663 31661 31663 31664 31666 31670 31676 31683 31688 31694 31702 31708 31716 31730 31742 31749 31755 31763 31772 31780 31791 31804 31814 31817 31819 31823 31828 31834 31842 31849 31848
3228.7C1848pnRJ8J3PKnjJ0R%lMPNJjj0j5mRTMK%kTmj1j4pMJ4J3lj8j5JJ5J6J0P%n
$$ 31848 31841 31836 31845 31863 31876 31883 31885 31880 31879 31889 31898 31898 31895 31899 31906 31911 31912 31911 31901 31886 31882 31891 31900 31904 31906 31906 31904 31902 31898 31887 31873 31866 31870 31884 31897 31894 31876 31861 31862 31877 31893 31903 31910 31910 31905
3320.5C1905j1j0KJ0Kpj1j5j1mKQMj6j3ORqj6rpk0k7j5%Joporj1j2j6j9j0PTqj4KJ7
$$ 31905 31894 31884 31886 31896 31898 31891 31880 31865 31854 31850 31852 31860 31864 31848 31835 31841 31850 31842 31826 31817 31810 31790 31763 31748 31748 31749 31743 31736 31730 31721 31710 31698 31682 31663 31653 31660 31667 31659 31645 31647 31664
3404.1C1664Rnr%J2K1J5J0J4TPKMN%J2L6TJ9J0TJ3J1RLj0j7lMk1l3NM9N2K1pj1J5K3
$$ 31664 31673 31668 31659 31659 31671 31692 31707 31717 31731 31745 31752 31754 31758 31763 31763 31775 31811 31847 31866 31876 31886 31899 31910 31919 31922 31912 31895 31892 31896 31875 31842 31847 31896 31948 31969 31962 31951 31966 31989
3483.7C1989jTJ0Lj4k0j0mnQK0Qj3k1pJ0Pkj3j0MPLjrj2J%j4j8%J5J1PQMonPLj7pJ7
$$ 31989 31988 31987 31997 32000 31986 31966 31956 31952 31947 31955 31975 31983 31970 31949 31942 31952 31959 31957 31944 31934 31938 31945 31948 31947 31938 31926 31927 31927 31913 31895 31895 31910 31921 31928 31936 31940 31934 31929 31936 31939 31922 31915 31932
3571.4C1932J6jqpmklJPNlnkjJOLj%JkToj0kJ6K4%k2oON%k%Lkk4k2J0J3j1j6JJ0J2
$$ 31932 31948 31947 31939 31932 31928 31926 31923 31924 31931 31936 31933 31928 31926 31925 31926 31932 31935 31934 31934 31935 31933 31931 31925 31915 31913 31929 31953 31953 31931 31925 31931 31936 31936 31934 31934 31937 31935 31911 31889 31899 31912 31901 31885 31886 31896 31908
3665.2C1908Qpj0Loj2MPNTnj4MJ4J2J5J2JkPJ3Mj9j4QRkplmKPnk7k5jJ9K4RJ1J8lj5
$$ 31908 31916 31909 31899 31902 31896 31884 31888 31895 31900 31905 31900 31886 31890 31904 31916 31931 31943 31944 31942 31949 31962 31966 31947 31933 31941 31950 31948 31941 31938 31934 31936 31943 31938 31911 31886 31885 31904 31928 31937 31948 31966 31963 31948
3752.9C1948JJ1NmjTlk%OTmj2nK%jTJOML%j2mQmnQOlUpJOLJmj2j0mlmjJ0K1J9j0l9
$$ 31948 31949 31960 31965 31961 31960 31959 31956 31954 31954 31960 31966 31962 31950 31945 31947 31947 31946 31945 31946 31952 31956 31959 31959 31947 31943 31951 31947 31942 31950 31956 31953 31950 31947 31940 31941 31947 31950 31951 31947 31935 31925 31921 31918 31914 31913 31923 31944 31963 31953 31914
3854.9C1914j0J5TNjkrj8rNJ3Lrj2TQJ5jmRToj4j2lKTMLmoKjoLOlj2oLKkmlTnlKNj
$$ 31914 31904 31919 31934 31939 31938 31936 31927 31909 31900 31905 31918 31921 31912 31900 31888 31896 31911 31910 31906 31915 31924 31918 31904 31892 31889 31891 31893 31897 31900 31896 31890 31892 31891 31885 31888 31894 31891 31879 31873 31876 31878 31876 31872 31869 31866 31861 31858 31860 31865 31864
3956.8C1864pkN%pTnmjnj3j0JPLoj4j0%K
$$ 31864 31857 31855 31860 31860 31853 31846 31841 31837 31836 31831 31818 31808 31809 31816 31819 31813 31799 31789 31789 31791
3997.6C1791
$$ 31791
##END=$$ End of the data block
