##TITLE=DI-16-0443334-7 Polimero acrilico $$ Begin of the data block
##JCAMP-DX=5.00 $$ ACD/SpecManager v 10.08
##SPECTROMETER/DATA SYSTEM=Alpha
##DATE=01 Apr 2016 08:35:22
##DATA TYPE=INFRARED SPECTRUM
##DATA CLASS=XYDATA
##ORIGIN=
##OWNER=
##NPOINTS=1765
##FIRSTX=399.76428223
##LASTX=3997.64306641
##MAXX=3997.64306641
##MINX=399.76428223
##MAXY=0.73731369
##MINY=0.35172155
##XFACTOR=1.0000000000
##YFACTOR=1.000000000000000e-9
##FIRSTY=0.58989114
##DELTAX=2.03961372
##XUNITS=1/CM
##YUNITS=ARBITRARY UNITS
##XYDATA=(X++(Y..Y))
$$ plain form
399.8 589891136 588793218 586196125 583213568 580305934 577414513 575089335 572248459 568787932
416.1 568787932 565696299 563434362 561756372 559387028 556603849 554119885 551225543 548290372
432.4 548290372 545541406 542641521 540067554 537120938 533840477 531241655 528700471 526040316
448.7 526040316 523250461 520270407 517639577 514991164 512710631 511152148 509269238 507092595
465 507092595 504890740 502535462 500329673 498380601 496780127 495391607 493827939 492330164 491111875
483.4 491111875 490157992 489626795 489156663 488521457 487955749 487387151 486795664 486037552 485133082 484558791
503.8 484558791 484224796 483946860 483767331 483449429 482920676 482340336 481906414 481771827 481571347 480988055
524.2 480988055 480368763 479914904 479417682 478865743 478403628 478084266 477855772 477593899 477187634 476742029
$$ packed form
399.8E89891136j097918k597093k982557k907634k891421k325178k840876l460527
416.1E68787932l091633k261937j677990k369344k783179k483964k894342k935171
432.4E48290372k748966k899885k573967k946616l280461k598822k541184k660155
448.7E26040316k789855k980054k630830k648413k280533j558483j882910k176643
465E07092595k201855k355278k205789j949072j600474j388520j563668j497775j218289
483.4D91111875r53883n31197m70132o35206n65708n68598n91487p58112r04470n74291
503.8D84558791l33995k77936j79529l17902n28753n80340m33922j34587k00480n83292
524.2D80988055o19292m53859m97222n51939m62115l19362k28494k61873m06265m45605
$$ plain form
544.6 476742029 476400793 476124495 475908905 475672781 475432366 475348711 475382417 475562602 475715101 475579679
565 475579679 475420922 475313574 475183159 475193501 475160807 475051284 474940121 474715114 474655509 474699825 474557906
587.4 474557906 474408686 474309415 474338800 474469244 474269599 473826706 473270684 472475767 471798331 471206218
607.8 471206218 470630288 470446825 470445424 470529497 470879614 471350640 472116262 473032355 473761439 474537075
628.2 474537075 475223988 475791126 476470232 477130681 478006274 479142278 480190903 481423020 482857645
646.6 482857645 484316468 485886842 487348884 488876373 490498692 491827518 493172199 494356811
662.9 494356811 494997591 496760607 499636382 500438869 500769675 501707256 502859116 504020810 504947722
681.2 504947722 505919814 506891727 507630646 508380115 508884490 508951664 508591890 507452846 506001472 505083442
$$ packed form
544.6D76742029l41236k76298k15590k36124k40415q3655L3706J80185J52499j35422
565D75579679j58757j07348j30415J0342l2694j09523j11163k25007n9605M4316j41919
587.4D74557906j49220r9271K9385J30444j99645m42893n56022p94917o77436n92113
607.8D71206218n75930j83463j401Q4073L50117M71026P65622R16093P29084P75636
628.2D74537075O86913N67138O79106O60449Q75593J136004J048625J232117J434625
646.6D82857645J458823J570374J462042J527489J622319J328826J344681J184612
662.9D94356811O40780J763016K875775Q02487L30806R37581J151860J161694R26912
681.2E04947722R72092R71913P38919P49469N04375O7174l59774j139044j451374r18030
$$ plain form
701.6 505083442 505007088 505630612 505998671 505612373 504916012 504187584 503991127 504840076 506636083 509414017
722 509414017 512960970 516946316 521219790 525244534 528842330 532202363 535237134 538165808 541025043
740.4 541025043 543513000 545753777 547605634 548944950 549891651 550106943 549509764 547957778 544930220
758.7 544930220 540606856 535548329 530790925 527766466 526978076 528659880 532778740 538392127 544742644
777.1 544742644 551048577 556618512 561605215 565938413 569620132 573064506 576119781 578952014
793.4 578952014 581792712 584325850 586735606 589012086 590947270 592741549 594222307 595597565
809.7 595597565 597392797 599562287 602416873 605935812 609575152 613379240 617067635 620479286
826 620479286 623950958 627166510 630183339 633227170 635979891 638817072 641751289 644268453 646338165
$$ packed form
701.6E05083442p6354O23524L68059l86298o96361p28428j96457Q48949J796007K777934
722E09414017L546953L985346M273474M024744L597796L360033L034771K928674K859235
740.4E41025043K487957K240777J851857J339316R46701K15292n97179j551986l027558
758.7E44930220m323364n058527m757404l024459p88390J681804M118860N613387O350517
777.1E44742644O305933N569935M986703M333198L681719L444374L055275K832233
793.4E78952014K840698K533138K409756K276480J935184J794279J480758J375258
809.7E95597565J795232K169490K854586L518939L639340L804088L688395L411651
826F20479286L471672L215552L016829L043831K752721K837181K934217K517164K069712
$$ plain form
844.4 646338165 647433937 647314250 646113575 643458843 639867604 636125267 632659197 630535424 630182326
862.8 630182326 631566763 634794235 639056146 643736720 648455143 652404189 655580282 657955110
879.1 657955110 659255087 659916461 659824133 658881366 657475889 655341566 652786851 650500894 648694813
897.4 648694813 648119748 649101079 651426315 655131221 659367442 663240433 666301250 667781413 667771935
915.8 667771935 666712999 664811134 662970483 661622822 660749555 660713017 661398113 662871361 665252209
934.1 665252209 667928040 670672953 673140526 674645066 675187588 674575031 672637045 669781208 666109681
952.5 666109681 662117183 658644736 656012416 654570639 653988421 653339982 652302146 650508165 647916555
970.9 647916555 644951940 641422093 637345850 633030236 628683805 625212610 623341203 623236656 624955893
$$ packed form
844.4F46338165J095772j19687j200675k654732l591239l742337l466070k123773l53098
862.8F30182326J384437L227472M261911M680574M718423L949046L176093K374828
879.1F57955110J299977O61374r2328r42767j405477k134323k554715k285957j806081
897.4F48694813n75065R81331K325236L704906M236221L872991L060817J480163r478
915.8F67771935j058936j901865j840651j347661q73267l6538O85096J473248K380848
934.1F65252209K675831K744913K467573J504540N42522o12557j937986k855837l671527
952.5F66109681l992498l472447k632320j441777n82218o48439j037836j793981k591610
970.9F47916555k964615l529847m076243m315614m346431l471195j871407j04547J719237
$$ plain form
989.2 624955893 627733469 630679011 633149922 634233713 633643329 631792009 629930437 629517555 629681110
1007.6 629681110 628776252 626773357 623812675 620108843 616023958 611372530 606345832 600966394
1023.9 600966394 594868898 588528156 582505405 577308357 573171556 569093585 564517200 559610009
1040.2 559610009 554319799 549230814 544772267 540942848 538099825 535941064 534022808 532371163
1056.5 532371163 530690908 529048622 527461231 525476038 523477018 521775782 520186901 518902421
1072.8 518902421 517529488 515645444 513411045 510842025 508631766 507225335 506051123 505015850
1089.2 505015850 503958285 502790332 501998067 501369655 500856817 500675917 500364184 500044942 499825358
1107.5 499825358 499324471 498895824 498573691 498276055 498454720 498872519 499565542 500913382 502619326
$$ packed form
989.2F24955893K777576K945542K470911J083791n90384j851320j861572m12882J63555
1007.6F29681110r04858k002895k960682l703832m084885m651428n026698n379438
1023.9F00966394o097496o340742o022751n197048m136801m077971m576385m907191
1040.2E59610009n290210n088985m458547l829419k843023k158761j918256j651645
1056.5E32371163j680255j642286j587391j985193j999020j701236j588881j284480
1072.8E18902421j372933j884044k234399k569020k210259j406431j174212j035273
1089.2E05015850j057565j167953p92265o28412n12838j80900l11733l19242k19584
1107.5D99825358n00887m28647l22133k97636J78665M17799O93023J347840J705944
$$ plain form
1125.9 502619326 504940569 508072793 511561573 515353501 518889785 521604657 523593545 524315715
1142.2 524315715 523609638 521773934 518655658 514832854 510775685 506526589 502750635 499567538
1158.5 499567538 497011662 495488316 494707793 494749516 495762378 497234702 499229103 501581728 503823161
1176.9 503823161 506172895 508405149 510345936 512318969 514112055 515880227 517857313 519707024
1193.2 519707024 521573484 523331881 524655819 525835752 526653707 526940346 526912212 526304066 525297344
1211.5 525297344 524256289 523421705 523738384 525501788 528143644 531220078 533949316 536020219 537658513
1229.9 537658513 538668811 539194703 539341450 538857341 537971258 536705375 535047054 533357322 531561613
1248.2 531561613 529805541 528362274 526921570 525505900 524218857 522956967 521937072 521021783
$$ packed form
1125.9E02619326K321243L132224L488780L791928L536284K714872J988888P22170
1142.2E24315715p06077j835704l118276l822804m057169m249096l775954l183097
1158.5D99567538k555876j523346p80523M1723J012862J472324J994401K352625K241433
1176.9E03823161K349734K232254J940787J973033J793086J768172J977086J849711
1193.2E19707024J866460J758397J323938J179933Q17955K86639k8134o08146j006722
1211.5E25297344j041055q34584L16679J763404K641856L076434K729238K070903J638294
1229.9E37658513J010298N25892J46747m84109q86083j265883j658321j689732j795709
1248.2E31561613j756072j443267j440704j415670j287043j261890j019895r15289
$$ plain form
1264.6 521021783 520063281 519271731 518505931 517809868 517273903 516615272 515939236 515261233 514365256 513402581
1285 513402581 512292624 510995626 509706259 508225620 506584585 504927158 503063798 501157701 499287635
1303.3 499287635 497359246 495665312 494185567 492873192 491963714 491263241 490849704 491045982 491627008
1321.7 491627008 492596865 493984997 495618194 497579634 499488235 500795782 501339376 501133025 500703037
1340 500703037 500231385 499423891 498812109 498854876 499560624 501127422 503397524 506084859 508907139
1358.4 508907139 511621714 514798224 518224716 520790160 522761285 524109840 524549365 524605632 523878634
1376.7 523878634 521749794 518252194 513594329 508990049 505441070 502140999 498195142 493552297
1393.1 493552297 488669872 484236449 480065286 475903213 471866041 468191743 465264797 463031441
$$ packed form
1264.6E21021783r58502p91550p65800o96063n35965o58631o76036o78003q95977r62675
1285E13402581j109957j296998j289367j480639j641035j657427j863360j906097j870066
1303.3D99287635j928389j693934j479745j312375r09478p00473m13537J96278N81026
1321.7D91627008R69857J388132J633197J961440J908601J307547N43594k06351m29988
1340E00703037m71652q07494o11782M2767P05748J566798K270102K687335K822280
1358.4E08907139K714575L176510L426492K565444J971125J348555M39525N6267p26998
1376.7E23878634k128840l497600m657865m604280l548979l300071l945857m642845
1393.1D93552297m882425m433423m171163m162073m037172l674298k926946k233356
$$ plain form
1409.4 463031441 461349398 460316628 459618390 459996581 462952882 466473401 469539106 472558022 474469483
1427.7 474469483 475288302 474858642 472559154 469503701 466589570 463188350 459261447 454962671 450733632
1446.1 450733632 447287560 444540113 442038924 440323204 442414731 450555772 458953291 466590226
1462.4 466590226 476484478 486755669 493442357 497689188 501887679 505641103 508052111 509684324
1478.7 509684324 511677980 514505446 517995179 523118258 531728864 542967796 552108765 558813572
1495 558813572 566377699 575321794 583268404 588586509 592354834 597565889 602273405 604561746 605442464
1513.4 605442464 605500400 605161607 604583800 604323089 604282379 603920281 603185296 601621270 599248171 596764743
1533.8 596764743 594011068 590042651 585682571 583187044 581452250 578989148 575525403 571095049
$$ packed form
1409.4D63031441j682043j032770o98238L78191K956301L520519L065705L018916J911461
1427.7D74469483Q18819m29660k299488l055453k914131l401220l926903m298776m229039
1446.1D50733632l446072k747447k501189j715720K091527Q141041Q397519P636935
1462.4D66590226R894252J0271191O686688M246831M198491L753424K411008J632213
1478.7E09684324J993656K827466L489733N123079Q610606J1238932R140969O704807
1495E58813572P564127Q944095P946610N318105L768325N211055M707516K288341Q80718
1513.4F05442464N7936l38793n77807k60711m0710l62098p34985j564026k373099k483428
1533.8E96764743k753675l968417m360080k495527j734794k463102l463745m430354
$$ plain form
1550.1 571095049 566106081 560391784 553643048 546658099 541584253 537185371 531343639 524192929
1566.4 524192929 516323566 508232236 500273943 491775960 482682735 474370360 466409892 458168834
1582.8 458168834 450199664 442892164 436019361 429396480 423246086 417647004 412710994 408372372
1599.1 408372372 404503047 401260346 398587793 396345645 394686729 393246263 391494215 390377879
1615.4 390377879 390747339 390883982 390468508 390649557 390949607 390802830 390081048 388168931 385408491
1633.7 385408491 382893801 380416781 376874954 372392029 367520154 363158911 359854251 356708586
1650.1 356708586 354510665 355113477 355444133 354620785 353967696 354181290 354782373 354661554 354768485
1668.4 354768485 355920494 356867462 358072847 359907389 360818326 360628277 361241847 364799887 368348658
$$ packed form
1550.1E71095049m988968n714297o748736o984949n073846m398882n841732p150710
1566.4E24192929p869363q091330p958293q497983r093225q312375p960468q241058
1582.8D58168834p969170p307500o872803o622881o150394n599082m936010m338622
1599.1D08372372l869325l242701k672553k242148j658916j440466j752048j116336
1615.4C90377879L69460J36643m15474J81049L00050j46777p21782j912117k760440
1633.7C85408491k514690k477020l541827m482925m871875m361243l304660l145665
1650.1C56708586k197921O02812L30656q23348o53089K13594O01083j20819J06931
1668.4C54768485J152009R46968J205385J834542R10937j90049O13570L558040L548771
$$ plain form
1686.8 368348658 370606661 372896165 374824315 377838522 382493675 389049739 399297863 408403546
1703.1 408403546 416995198 426978350 435469866 441621333 445640028 448393643 451523513 453911901
1719.4 453911901 454018056 452942669 451437712 449588716 447510034 445846349 446633279 449211717 451294512
1737.8 451294512 454789728 460351050 467011750 475000978 484944850 498461962 514278531 528481007
1754.1 528481007 542018116 555481195 567404807 578837872 588453889 595539629 601454437 606742680
1770.4 606742680 612841964 619243264 624205470 628298521 632345796 636366725 640385687 644091785
1786.7 644091785 646822691 649308562 652998209 656994224 660055339 662688494 665735543 669085145
1803 669085145 672006249 674386919 676531017 678930581 681471169 683667362 685628414 687466085 688872039
$$ packed form
1686.8C68348658K258003K289504J928150L014207M655153O556064J0248124R105683
1703.1D08403546Q591652R983152Q491516O151467M018695K753615L129870K388388
1719.4D53911901J06155j075387j504957j848996k078682j663685P86930K578438K082795
1737.8D51294512L495216N561322O660700P989228R943872J3517112J5816569J4202476
1754.1E28481007J3537109J3463079J1923612J1433065R616017P085740N914808N288243
1770.4F06742680O099284O401300M962206M093051M047275M020929M018962L706098
1786.7F44091785K730906K485871L689647L996015L061115K633155L047049L349602
1803F69085145K921104K380670K144098K399564K540588K196193J961052J837671J405954
$$ plain form
1821.4 688872039 689955771 691151738 692290723 693722427 695829391 697761476 699154258 700392306
1837.7 700392306 701390207 701846123 702608466 704412580 706300020 707839727 709192991 710359097 711434364
1856.1 711434364 712436020 713386416 714288116 714817166 714872956 715336263 716800153 718364835 719422281
1874.4 719422281 720148563 720804393 721388757 721871436 722325027 722579420 722755909 723250270 723758936 724087179
1894.8 724087179 724513650 724943221 725259364 725471914 725575447 725651443 725842595 726282239 726722956 726801872
1915.2 726801872 726872981 727354646 727901697 728542805 729368269 730041385 730559886 731062293 731607854 732175052
1935.6 732175052 732609749 732781827 732949138 733529329 734347165 734964907 735354006 735649586 735863924 736052632
1956 736052632 736201704 736210227 736107528 735894501 735631526 735565305 735585153 735471964 735320926 735199809 735111535
$$ packed form
1821.4F88872039J083732J195967J138985J431704K106964J932085J392782J238048
1837.7G00392306R97901M55916P62343J804114J887440J539707J353264J166106J075267
1856.1G11434364J001656R50396R01700N29050N5790M63307J463890J564682J057446
1874.4G19422281P26282O55830N84364M82679M53591K54393J76489M94361N08666L28243
1894.8G24087179M26471M29571L16143K12550J03533P5996J91152M39644M40717P8916
1915.2G26801872P1109M81665N47051O41108Q25464O73116N18501N02407N45561N67198
1935.6G32175052M34697J72078J67311N80191Q17836O17742L89099K95580K14338J88708
1956G36052632J49072Q523j02699k13027k62975o6221J9848j13189j51038j21117q8274
$$ plain form
1978.5 735111535 735032499 734941840 734854281 734740376 734557211 734402359 734446049 734653413 734839261 734982967
1998.8 734982967 735163033 735328972 735445976 735545456 735632837 735733509 735813618 735750735 735609889 735458970
2019.2 735458970 735209227 734826386 734515429 734734297 735306144 735603988 735598624 735497773 735304654 735057294
2039.6 735057294 734841049 734648883 734429240 734118342 733773828 733463407 733124077 732752025 732360244 731931090
2060 731931090 731484175 731028378 730616868 730271399 729873121 729419112 728979170 728537619 728124022 727744222
2080.4 727744222 727348089 726964176 726598680 726234019 725917995 725614071 725291073 724977314 724671185 724409223
2100.8 724409223 724170864 723893762 723629653 723391831 723159254 722988367 722827971 722633719 722481012 722363412
2121.2 722363412 722261071 722168922 722025812 721871734 721758366 721650541 721575081 721498251 721385896 721307635
$$ packed form
1978.5G35111535p9036r0659q7559j13905j83165j54852M3690K07364J85848J43706
1998.8G34982967J80066J65939J17004R9480Q7381J00672Q0109o2883j40846j50919
2019.2G35458970k49743l82841l10957K18868N71847K97844n364j00851j93119k47360
2039.6G35057294k16245j92166k19643l10898l44514l10421l39330l72052l91781m29154
2060G31931090m46915m55797m11510l45469l98278m54009m39942m41551m13597l79800
2080.4G27744222l96133l83913l65496l64661l16024l03924l22998l13759l06129k61962
2100.8G24409223k38359k77102k64109k37822k32577j70887j60396j94252j52707j17600
2121.2G22363412j02341r2149j43110j54078j13368j07825p5460p6830j12355p8261
$$ plain form
2141.6 721307635 721251130 721210837 721198797 721167028 721163809 721198976 721211791 721267104 721352100 721425533 721541345
2164.1 721541345 721617997 721642137 721783459 722039580 722310126 722560525 722768426 722978115 723179460 723352253
2184.5 723352253 723560452 723775268 723974347 724177957 724341512 724514008 724731863 724922001 725099444 725247443
2204.8 725247443 725348055 725488484 725636601 725763619 725902081 726002216 726097226 726232827 726359427 726503909
2225.2 726503909 726652920 726763129 726877868 726988673 727137268 727357745 727568567 727816582 728156269 728531957
2245.6 728531957 728950858 729355216 729706645 730083585 730439782 730771363 731116176 731387198 731610358 731824458
2266 731824458 731994271 732182741 732389569 732589126 732835531 733088553 733320177 733544171 733736157 733933032
2286.4 733933032 734133542 734296322 734459639 734592497 734665930 734743297 734799325 734851301 734959781 735081017
$$ packed form
2141.6G21307635n6505m0293j2040l1769l219L5167J2815N5313Q4996P3433J15812
2164.1G21541345P6652K4140J41322K56121K70546K50399K07901K09689K01345J72793
2184.5G23352253K08199K14816J99079K03610J63555J72496K17855J90138J77443J47999
2204.8G25247443J00612J40429J48117J27018J38462J00135R5010J35601J26600J44482
2225.2G26503909J49011J10209J14739J10805J48595K20477K10822K48015L39687L75688
2245.6G28531957M18901M04358L51429L76940L56197L31581L44813K71022K23160K14100
2266G31824458J69813J88470K06828J99557K46405K53022K31624K23994J91986J96875
2286.4G33933032K00510J62780J63317J32858P3433P7367N6028N1976J08480J21236
$$ plain form
2306.8 735081017 735236466 735433578 735581160 735677361 735763609 735886872 736095726 736313522 736489236 736638546
2327.2 736638546 736749351 736832082 736786902 736547887 736281157 736125529 736098766 736152351 735897005 735202909
2347.6 735202909 734726906 734941661 735669315 736468315 737064362 737313688 737217486 736852944 736319363 735694230
2368 735694230 735051334 734354019 733570635 732792318 732060373 731402516 730885744 730481505 730166554 729964614
2388.4 729964614 729812205 729690373 729596257 729468584 729330838 729192019 729036868 728902042 728738248 728539646
2408.8 728539646 728392661 728260338 728121579 727986872 727793097 727569759 727372706 727207243 727094769 726967216
2429.2 726967216 726803124 726714611 726696670 726684928 726658523 726590157 726517141 726467729 726412952 726350069 726251185
2451.6 726251185 726121962 726051509 726037860 726031542 726014137 725962937 725915551 725913048 725934505 725947917 725925863 725869417
$$ packed form
2306.8G35081017J55449J97112J47582R6201Q6248J23263K08854K17796J75714J49310
2327.2G36638546J10805Q2731m5180k39015k66730j55628k6763N3585k55346o94096
2347.6G35202909m76003K14755P27654P99000N96047K49326r6202l64542n33581o25133
2368G35694230o42896o97315p83384p78317p31945o57857n16772m04239l14951k01940
2388.4G29964614j52409j21832r4116j27673j37746j38819j55151j34826j63794j98602
2408.8G28539646j46985j32323j38759j34707j93775k23338j97053j65463j12474j27553
2429.2G26967216j64092q8513j7941j1742k6405o8366p3016m9412n4777o2883r8884
2451.6G26251185j29223p0453j3649o318j7405n1200m7386k503K1457J3412k2054n6446
$$ plain form
2476.1 725869417 725815535 725770772 725713015 725625217 725518227 725408912 725275040 725112259 724931479 724717081
2496.5 724717081 724469185 724212408 723950684 723679602 723387957 723055780 722717881 722402513 722064435 721680164
2516.9 721680164 721286595 720902920 720521033 720150352 719797730 719448745 719084620 718725264 718398571 718084812
2537.3 718084812 717770338 717459738 717148542 716859758 716611981 716369450 716112614 715855420 715592563 715351462
2557.7 715351462 715137720 714873374 714556277 714236915 713931978 713653862 713351130 712988138 712591350 712156415
2578.1 712156415 711708426 711284995 710868716 710439146 709981978 709533989 709120631 708657622 708114743 707543671
2598.5 707543671 706963718 706392050 705833256 705269277 704713643 704152107 703549445 702930272 702310205 701665103
2618.9 701665103 700985789 700277805 699564457 698854029 698091924 697273672 696462214 695667684 694857717 694028437
$$ packed form
2476.1G25869417n3882m4763n7757q7798j06990j09315j33872j62781j80780k14398
2496.5G24717081k47896k56777k61724k71082k91645l32177l37899l15368l38078l84271
2516.9G21680164l93569l83675l81887l70681l52622l48985l64125l59356l26693l13759
2537.3G18084812l14474l10600l11196k88784k47777k42531k56836k57194k62857k41101
2557.7G15351462k13742k64346l17097l19362l04937k78116l02732l62992l96788m34935
2578.1G12156415m47989m23431m16279m29570m57168m47989m13358m63009n42879n71072
2598.5G07543671n79953n71668n58794n63979n55634n61536o02662o19173o20067o45102
2618.9G01665103o79314p07984p13348p10428p62105q18252q11458p94530q09967q29280
$$ plain form
2639.3 694028437 693197012 692345738 691456556 690548599 689621508 688626468 687555611 686474383 685406625
2657.6 685406625 684320331 683198988 682020783 680767298 679464459 678136945 676795721 675423622
2673.9 675423622 673978090 672467887 670927227 669383824 667874634 666364014 664795280 663216174
2690.3 663216174 661672235 660135448 658568740 656986356 655443907 653924048 652392805 650881112
2706.6 650881112 649367213 647836924 646350980 644919038 643519521 642112911 640657306 639213324
2722.9 639213324 637827873 636459291 635082126 633673966 632255554 630876780 629495323 628089726
2739.2 628089726 626673043 625230670 623797953 622374952 620936811 619524062 618126810 616732121
2755.5 616732121 615373373 614045441 612784207 611583889 610366881 609201312 608158410 607196987
$$ packed form
2639.3F94028437q31425q51274q89182r07957r27091r95040j070857j081228j067758
2657.6F85406625j086294j121343j178205j253485j302839j327514j341224j372099
2673.9F75423622j445532j510203j540660j543403j509190j510620j568734j579106
2690.3F63216174j543939j536787j566708j582384j542449j519859j531243j511693
2706.6F50881112j513899j530289j485944j431942j399517j406610j455605j443982
2722.9F39213324j385451j368582j377165j408160j418412j378774j381457j405597
2739.2F28089726j416683j442373j432717j423001j438141j412749j397252j394689
2755.5F16732121j358748j327932j261234j200318j217008j165569j042902r61423
$$ plain form
2771.8 607196987 606318712 605491936 604691267 603980243 603351533 602784216 602272630 601802409 601432860 601155281
2792.2 601155281 600914657 600733578 600587547 600456834 600366890 600277483 600193977 600140929 600054801 599906802
2812.6 599906802 599685609 599388361 599036157 598557949 597925723 597203612 596352696 595310211 594058990
2831 594058990 592572927 590857923 588896334 586634815 584064126 581169784 577977657 574609876 571217597
2849.3 571217597 568020582 565255702 563040197 561393082 560214698 559352517 558745503 558339894 558106780
2867.7 558106780 558082879 558213294 558397889 558545649 558555186 558378935 557928383 557111681 555945456 554418206
2888.1 554418206 552506983 550244391 547624886 544638455 541282594 537532747 533443928 529070318
2904.4 529070318 524391353 519468427 514411211 509346902 504445195 499817610 495592952 491961449
$$ packed form
2771.8F07196987q78275q26776q00669p11024o28710n67317n11586m70221l69549k77579
2792.2F01155281k40624j81079j46031j30713q9944q9407q3506n3048q6128j47999
2812.6E99906802k21193k97248l52204m78208o32226p22111q50916j042485j251221
2831E94058990j486063j715004j961589k261519k570689k894342l192127l367781l392279
2849.3E71217597l197015k764880k215505j647115j178384q62181o07014m05609k33114
2867.7E58106780k3901J30415J84595J47760R537j76251m50552q16702j166225j527250
2888.1E54418206j911223k262592k619505k986431l355861l749847m088819m373610
2904.4E29070318m678965m922926n057216n064309m901707m627585m224658l631503
$$ plain form
2920.7 491961449 489058256 486939430 485543579 484715462 484335601 484295249 484491676 484871477 485361248
2939.1 485361248 485888183 486398607 486876011 487396657 488065749 488991529 490283430 491973996 494075000
2957.4 494075000 496629953 499560297 502675951 505849898 509006858 512076855 514990091 517625332
2973.8 517625332 519865811 521693468 523121178 524116158 524657071 524843693 524789453 524506271 523964405
2992.1 523964405 523121476 522038937 520810187 519413948 517905891 516405463 514920056 513501525
3008.4 513501525 512241244 511054635 509835958 508557379 507176936 505695224 504113197 502391398
3024.7 502391398 500575185 498804986 497203767 495809823 494550526 493420988 492516279 491767675 491006523
3043.1 491006523 490151793 489257753 488442540 487630457 486668378 485585779 484422863 483179361 481913269
$$ packed form
2920.7D91961449k903193k118826j395851q28117l79861m0352J96427L79801M89771
2939.1D85361248N26935N10424M77404N20646O69092R25780J291901J690566K101004
2957.4D94075000K554953K930344L115654L173947L156960L069997K913236K635241
2973.8E17625332K240479J827657J427710R94980N40913J86622n4240k83182n41866
2992.1E23964405q42929j082539j228750j396239j508057j500428j485407j418531
3008.4E13501525j260281j186609j218677j278579j380443j481712j582027j721799
3024.7E02391398j816213j770199j601219j393944j259297j129538r04709p48604p61152
3043.1D91006523q54730q94040q15213q12083r62079j082599j162916j243502j266092
$$ plain form
3061.5 481913269 480688632 479514569 478294730 476974338 475646079 474355012 473087609 471805036
3077.8 471805036 470363528 468728125 467002988 465217143 463410169 461599588 459704250 457778782
3094.1 457778782 455963939 454241484 452489734 450622112 448680997 446797639 444954723 443005711
3110.4 443005711 441041231 439241260 437498093 435632050 433608741 431500971 429446667 427523494
3126.7 427523494 425664842 423794240 421921432 420081437 418310612 416554809 414733887 412918031
3143 412918031 411164373 409445733 407802939 406260908 404715478 403112054 401552618 400094390 398708284
3161.4 398708284 397400796 396172166 394984365 393836766 392762452 391763359 390855759 390058666 389346838
3179.8 389346838 388697386 388100684 387605399 387260973 387003213 386787504 386654377 386645347 386742711 386901468
$$ packed form
3061.5D81913269j224637j174063j219839j320392j328259j291067j267403j282573
3077.8D71805036j441508j635403j725137j785845j806974j810581j895338j925468
3094.1D57778782j814843j722455j751750j867622j941115j883358j842916j949012
3110.4D43005711j964480j799971j743167j866043k023309k107770k054304j923173
3126.7D27523494j858652j870602j872808j839995j770825j755803j820922j815856
3143D12918031j753658j718640j642794j542031j545430j603424j559436j458228j386106
3161.4C98708284j307488j228630j187801j147599j074314r99093r07600p97093p11828
3179.8C89346838o49452n96702m95285l44426k57760k15709j33127r030R7364J58757
$$ plain form
3200.1 386901468 387153774 387512058 387911946 388378292 388940483 389523149 390094638 390652508 391219437 391820639
3220.5 391820639 392382830 392864168 393303812 393715203 394085169 394377142 394524515 394574821 394604266 394548953
3240.9 394548953 394414186 394276112 394086719 393763989 393348008 392954975 392580986 392124534 391613901 391111463
3261.3 391111463 390589863 390051991 389498562 388896048 388253361 387603641 386974543 386347324 385691077 385038286
3281.7 385038286 384397149 383753777 383143723 382590413 382062703 381507725 380916744 380332083 379769355 379218370
3302.1 379218370 378684729 378128529 377482355 376767486 376061678 375387549 374731779 374071628 373392671 372715235
3322.5 372715235 372024268 371316284 370640457 369975030 369278520 368606061 367978185 367330015 366645575 365981251
3342.9 365981251 365358502 364760637 364199489 363629609 362998277 362376004 361817032 361289412 360774696 360273987
$$ packed form
3200.1C86901468K52306L58284L99888M66346N62191N82666N71489N57870N66929O01202
3220.5C91820639N62191M81338M39644M11391L69966K91973J47373N0306K9445n5313
3240.9C94548953j34767j38074j89393l22730m15981l93033l73989m56452n10633n02438
3261.3C91111463n21600n37872n53429o02514o42687o49720o29098o27219o56247o52791
3281.7C85038286o41137o43372o10054n53310n27710n54978n90981n84661n62728n50985
3302.1C79218370n33641n56200o46174p14869p05808o74129o55770o60151o78957o77436
3322.5C72715235o90967p07984o75827o65427o96510o72459o27876o48170o84440o64324
3342.9C65981251o22749n97865n61148n69880o31332o22273n58972n27620n14716n00709
$$ plain form
3363.3 360273987 359791160 359302700 358782977 358224958 357649237 357121676 356650621 356186181 355743974 355367899
3383.7 355367899 355014265 354672104 354379088 354087055 353764892 353493065 353309333 353149056 352969527 352753311
3404.1 352753311 352534920 352364510 352248281 352151155 352027982 351873159 351742387 351721555 351805240 351924360
3424.5 351924360 352076799 352297217 352548778 352812946 353093505 353342235 353563607 353845388 354200035 354671061
3444.9 354671061 355370075 356145918 356867939 357631832 358493656 359438270 360432416 361481994 362634420
3463.2 362634420 363933116 365384072 366868079 368279964 369745374 371358961 373064727 374892473
3479.6 374892473 376896828 378953725 381003857 383131176 385305345 387438089 389602870 391933858
3495.9 391933858 394254893 396467000 398855537 401349425 403570890 405731708 408141583 410628289
$$ packed form
3363.3C60273987m82827m88460n19723n58019n75721n27561m71055m64440m42207l76075
3383.7C55367899l53634l42161k93016k92033l22163k71827j83732j60277j79529k16216
3404.1C52753311k18391j70410j16229r7126j23173j54823j30772k0832Q3685J19120
3424.5C51924360J52439K20418K51561K64168K80559K48730K21372K81781L54647M71026
3444.9C54671061O99014P75843P22021P63893Q61824R44614R94146J049578J152426
3463.2C62634420J298696J450956J484007J411885J465410J613587J705766J827746
3479.6C74892473K004355K056897K050132K127319K174169K132744K164781K330988
3495.9C91933858K321035K212107K388537K493888K221465K160818K409875K486706
$$ plain form
3512.2 410628289 412957758 415080369 417078078 419097692 421314269 423584372 425759196 428053111
3528.5 428053111 430409461 432601035 434812516 437153310 439334720 441296875 443339556 445817858
3544.8 445817858 448517889 450875521 453178316 455808461 458357185 460701108 463115543 465329587
3561.1 465329587 467031181 469235897 473089993 477161080 480127782 482756466 485637188 488692880
3577.5 488692880 491802812 494632363 496951252 499719352 503861606 507934272 510976493 514131665
3593.8 514131665 517757714 521379292 525098026 528728724 531654418 534375191 537900269 541755557
3610.1 541755557 545396030 548881471 552137792 556333959 561594188 565679431 567929149 570111275
3626.4 570111275 575007737 581198931 585680068 589748800 594001412 598144650 602154255 605456650
$$ packed form
3512.2D10628289K329469K122611J997709K019614K216577K270103K174824K293915
3528.5D28053111K356350K191574K211481K340794K181410J962155K042681K478302
3544.8D45817858K700031K357632K302795K630145K548724K343923K414435K214044
3561.1D65329587J701594K204716L854096M071087K966702K628684K880722L055692
3577.5D88692880L109932K829551K318889K768100M142254M072666L042221L155172
3593.8E14131665L626049L621578L718734L630698K925694K720773L525078L855288
3610.1E41755557L640473L485441L256321M196167N260229M085243K249718K182126
3626.4E70111275M896462O191194M481137M068732M252612M143238M009605L302395
$$ plain form
3642.7 605456650 607691348 610300064 615818977 622780204 627653360 631830990 637040317 641989470
3659 641989470 646075189 649612784 652240634 654257298 657146513 660384834 662740290 666226625 670669556
3677.4 670669556 674107492 676733315 678390920 679154158 680292606 682693005 685432076 687618911
3693.7 687618911 689141572 690028131 690704882 691839874 692963779 693131208 692513645 692429423 693930924
3712.1 693930924 695725679 696621776 696895659 696959555 697030544 697433710 698143780 698295474 697464943 696407914
3732.5 696407914 696570098 698273182 699447393 698917866 698098719 698375046 698556781 698384762 699478328
3750.8 699478328 701394439 702389657 702669442 703262448 704079449 704357743 704172730 704015434 704476058
3769.2 704476058 705454230 706027627 705905795 705642283 705806792 706136227 706294239 706553519 706899524 707065046
$$ packed form
3642.7F05456650K234698K608716N518913O961227M873156M177630N209327M949153
3659F41989470M085719L537595K627850K016664K889215L238321K355456L486335M442931
3677.4F70669556L437936K625823J657605P63238J138448K400399K739071K186835
3693.7F87618911J522661Q86559O76751J134992J123905J67429o17563q4222J501501
3712.1F93930924J794755Q96097K73883O3896P0989M03166P10070J51694q30531j057029
3732.5F96407914J62184J703084J174211n29527q19147K76327J81735j72019J093566
3750.8F99478328J916111R95218K79785N93006Q17001K78294j85013j57296M60624
3769.2G04476058R78172N73397j21832k63512J64509L29435J58012K59280L46005J65522
$$ plain form
3789.6 707065046 706891716 706301868 705505431 704603791 704011679 704306006 704819024 705449045 706484497
3807.9 706484497 706903815 706221581 705202579 704528153 703857243 703763127 704819441 705659091 705854058
3826.3 705854058 705708265 705279171 704639673 703854203 703326404 703478098 704142928 705069602 705913007 705869675
3846.7 705869675 704373538 702173471 701776922 703756690 704955816 704932272 704364240 703853965 703589797
3865 703589797 703105032 702850580 703255117 703866124 704241931 703925908 703325093 702969134 702857852 703158438
3885.4 703158438 703298569 703055918 703168035 703343093 702760756 701551020 700420976 700113773 700868547
3903.8 700868547 701998472 702638030 702703178 702347696 701677978 701098919 700948715 700924516 700717211 700594306
3924.2 700594306 700570822 700264752 699917734 700003326 700266421 700250745 699897289 699435592 699158967 699007690
$$ packed form
3789.6G07065046j73330n89848p96437r01640n92112K94327N13018O30021J035452
3807.9G06484497M19318o82234j019002o74426o70910r4116J056314Q39650J94967
3826.3G05854058j45793m29094o39498p85470n27799J51694O64830R26674Q43405m3332
3846.7G05869675j496137k200067l96549J979768J199126k3544n68032n10275k64168
3865G03589797m84765k54452M04537O11007L75807l16023o00815l55959j11282L00586
3885.4G03158438J40131k42651J12117J75058n82337j209736j130044l07203P54774
3903.8G00868547J129925O39558O5148l55482o69718n79059j50204k4199k07305j22905
3924.2G00594306k3484l06070l47018Q5592K63095j5676l53456m61697k76625j51277
$$ plain form
3944.6 699007690 698827624 698777139 698865056 698862970 698731363 698552370 698366582 698236704 698198617 698157787 698023498
3967 698023498 697838008 697662354 697512567 697398007 697280288 697142303 697070181 697046816 696939766 696727753
3987.4 696727753 696492016 696325064 696265757 696277976 696251988
3997.6 696251988
$$ packed form
3944.6F99007690j80066n0485Q7917k086j31607j78993j85788j29878l8087m0830j34289
3967F98023498j85490j75654j49787j14560j17719j37985p2122k3365j07050k12013
3987.4F96727753k35737j66952n9307J2219k5988
3997.6F96251988
##END=$$ End of the data block
