##TITLE=DI 6-0656093-1 $$ Begin of the data block
##JCAMP-DX=5.00 $$ ACD/SpecManager v 10.08
##SPECTROMETER/DATA SYSTEM=Alpha
##DATE=16 May 2016 12:16:04
##DATA TYPE=INFRARED SPECTRUM
##DATA CLASS=XYDATA
##ORIGIN=
##OWNER=
##NPOINTS=1765
##FIRSTX=399.76428223
##LASTX=3997.64306641
##MAXX=3997.64306641
##MINX=399.76428223
##MAXY=0.89494616
##MINY=0.18199332
##XFACTOR=1.0000000000
##YFACTOR=1.000000000000000e-9
##FIRSTY=0.84221590
##DELTAX=2.03961372
##XUNITS=1/CM
##YUNITS=ARBITRARY UNITS
##XYDATA=(X++(Y..Y))
$$ plain form
399.8 842215896 842190027 842148066 843033254 843827248 843630672 844340622 845589817 846118808 847222805 847671509
420.2 847671509 846242249 845663428 845662117 845212102 845592201 846350372 846648097 847526968 848385274 848698199
440.6 848698199 849560320 849953294 849380076 849661410 850209415 850063682 850643694 851483762 851205468 851170659
461 851170659 851230025 850708127 850986540 851679623 851739585 851973057 851810038 850845098 850764811 851334989 851143360
483.4 851143360 850992382 850974679 850365639 850198865 850343585 849763751 849486768 849801600 849571228 849201143
503.8 849201143 849039078 848373652 847863138 847793937 847393155 847257972 847412884 846778929 846225739 846292317
524.2 846292317 845856547 845241666 844996274 844356477 843815863 843890071 843615472 843192637 843089104 842535675
544.6 842535675 841981173 841984034 841568172 841031969 841033399 840604901 839964688 840049624 840031743 839818835 840092480
$$ packed form
399.8H42215896k5869m1961Q85188P93994j96576P09950J249195N28991J103997M48704
420.2H47671509j429260n78821j311m50015L80099P58171K97725Q78871Q58306L12925
440.6H48698199Q62121L92974n73218K81334N48005j45733N80012Q40068k78294l4809
461H51170659N9366n21898K78413O93083N9962K33472j63019r64940q0287N70178j91629
483.4H51143360j50978j7703o09040j66774J44720n79834k76983L14832k30372l70085
503.8H49201143j62065o65426n10514o9201m00782j35183J54912o33955n53190O6578
524.2H46292317m35770o14881k45392o39797n40614P4208k74599m22835j03533n53429
544.6H42535675n54502K861m15862n36203J430m28498o40213Q4936j7881k12908K73645
$$ plain form
567 840092480 840006113 839549184 839635134 839572191 839218020 839443624 839582920 839365482 839531422 839566886 839358091
589.4 839358091 839683831 839859068 839557827 839734137 839928150 839669704 839769125 839961469 839758635 839874029
609.8 839874029 840120614 839887798 839825571 840080321 840332687 841144860 842206180 842638075 843067586 843706608
630.2 843706608 843906462 844154835 844646454 844773531 844974816 845408440 845315337 845107675 845235467 845071554
650.6 845071554 844711065 844492137 843898594 843068838 842382610 841379285 840103030 838266373 835554242
669 835554242 833635509 831865549 828527689 823597252 817871153 809609473 795263231 769419730
685.3 769419730 714581370 613330960 507305026 496754169 612678170 758474112 841303289
699.6 841303289 865860641 871212184 873823345 874691725 874177814 873480797 872494102 871614695 871101558
$$ packed form
567H40092480q6367m56929Q5950o2943l54171K25604J39296k17438J65940L5464k08795
589.4H39358091L25740J75237l01241J76310J94013k58446R9421J92344k02834J15394
609.8H39874029K46585k32816o2227K54750K52366Q12173J061320M31895M29511O39022
630.2H43706608J99854K48373M91619J27077K01285M33624r3103k07662J27792j63913
650.6H45071554l60489k18928n93543q29756o86228j003325j276255j836657k712131
669H35554242j918733j769960l337860m930437n726099q261680j4346242k5843501
685.3G69419730n4838360j01250410j06025934j0550857J15924001J45795942Q2829177
699.6H41303289K4557352N351543K611161Q68380n13911o97017r86695q79407n13137
$$ plain form
717.9 871101558 870344639 869423330 868543983 867703378 867449760 867588222 867201805 866589248 866326749 865874469
738.3 865874469 865154147 864727020 864257574 863600612 863149524 862596154 861795306 861244321 860717237 859962285
758.7 859962285 859432101 858950973 858240187 857747197 857384980 856711268 856106639 855732858 855295062 854935288
779.1 854935288 854630888 854070187 853499055 853025913 852309227 851558864 850863099 849886894 848772287 847734451
799.5 847734451 846465647 845050395 843725204 842201352 840465307 838674307 836537659 833922088
815.8 833922088 830995142 827396095 822888672 817365706 810112476 800406873 788458586 773971498
832.2 773971498 753230453 720964491 685304284 665649295 653933465 621263862 562930226
846.4 562930226 492173940 422139436 371203899 359749645 393804789 457375497 526809633
$$ packed form
717.9H71101558p56919r21309q79347q40605k53618J38462l86417o12557k62499m52280
738.3H65874469p20322m27127m69446o56962m51088n53370q00848n50985n27084p54952
758.7H59962285n30184m81128p10786m92990l62217o73712o04629l73781m37796l59774
779.1H54935288l04400n60701n71132m73142p16686p50363o95765r76205j114607j037836
799.5H47734451j268804j415252j325191j523852j736045j791000k136648k615571
815.8H33922088k926946l599047m507423n522966p253230r705603j1948287j4487088
832.2G73971498k0741045l2265962l5660207j9654989j1715830l2669603n8333636
846.4E62930226p0756286p0034504n0935537j1454254L4055144O3570708O9434136
$$ plain form
860.7 526809633 587671041 635702729 671613812 698352098 718816519 734905005 747613728
875 747613728 757338583 764712811 770409167 774810612 779059291 783976614 788461506 791658282 794063449
893.4 794063449 796099067 797951758 799923599 801984966 803926766 805753350 807289898 808284640 808926761
911.7 808926761 809269249 809078038 808559299 808000982 807339489 806680560 806235492 805912971 805710495 805594146
932.1 805594146 805298686 804848433 804436743 803892434 803139389 802352905 801408231 800239682 799003363
950.5 799003363 797566056 795735598 793854237 792380929 791493773 791108847 790851116 790284812 789398313
968.8 789398313 788324058 786967218 785498857 784002304 782364666 780675054 779045284 777351022
985.1 777351022 775654018 774114430 772648990 771284819 770018637 768679678 767191827 765783846
$$ packed form
860.7E26809633O0861408M8031688L5911083K6738286K0464421J6088486J2708723
875G47613728R724855P374228N696356M401445M248679M917323M484892L196776K405167
893.4G94063449K035618J852691J971841K061367J941800J826584J536548R94742O42121
911.7H08926761L42488j91211n18739n58317o61493o58929m45068l22521k02476j16349
932.1H05594146k95460m50253m11690n44309p53045p86484r44674j168549j236319
950.5G99003363j437307j830458j881361j473308q87156l84926k57731n66304q86499
968.8G89398313j074255j356840j468361j496553j637638j689612j629770j694262
985.1G77351022j697004j539588j465440j364171j266182j338959j487851j407981
$$ plain form
1001.4 765783846 764447689 763124287 761828661 760529757 759256482 758000791 756691098 755221546
1017.8 755221546 753736436 752221286 750679672 749123335 747602224 746058285 744537830 743009210
1034.1 743009210 741330504 739986181 739166439 738318086 737004519 735410273 733557820 731333494 727777421
1052.4 727777421 715701938 679902554 639374316 644752026 684819639 709951043 715400457 715642750
1068.8 715642750 714930713 713840246 712487876 711105406 709701061 708231211 706709206 705175757
1085.1 705175757 703496516 701866984 700268865 698615253 696891010 695152700 693272829 691254497
1101.4 691254497 689234316 687114775 684947968 682860434 680968940 679322660 677973151 676660120
1117.7 676660120 675244689 673770249 672213078 670618534 669081151 667541265 665856421 664142430
$$ packed form
1001.4G65783846j336157j323402j295626j298904j273275j255691j309693j469552
1017.8G55221546j485110j515150j541614j556337j521111j543939j520455j528620
1034.1G43009210j678706j344323q19742q48353j313567j594246j852453k224326l556073
1052.4G27777421j2075483l5799384m0528238N377710M0067613K5131404N449414K42293
1068.8G15642750p12037j090467j352370j382470j404345j469850j522005j533449
1085.1G05175757j679241j629532j598119j653612j724243j738310j879871k018332
1101.4F91254497k020181k119541k166807k087534j891494j646280j349509j313031
1117.7F76660120j415431j474440j557171j594544j537383j539886j684844j713991
$$ plain form
1134 664142430 662437201 660679460 658764541 656597197 654173136 651694596 649340093 647105753 644882739
1152.4 644882739 642497063 640034676 637656868 635223448 632494032 629604995 626718104 623834789
1168.7 623834789 621027410 618395269 615962029 613678634 611429095 609008908 606421053 603749871
1185 603749871 600991249 598148584 595257640 592305541 589299738 586272478 583132029 579850078 576500356
1203.4 576500356 573137045 569832981 566725552 563806057 560976207 558180034 555260301 552080512
1219.7 552080512 548708618 545247853 541652322 537863970 533841133 529599130 525265098 520972669
1236 520972669 516772807 512662590 508603513 504514396 500388205 496230602 492023230 487757027 483405739
1254.4 483405739 478935868 474398732 470496058 467910707 465463549 461733341 457131118 452373207
$$ packed form
1134F64142430j705229j757741j914919k167344k424061k478540k354503k234340k223014
1152.4F44882739k385676k462387k377808k433420k729416k889037k886891k883315
1168.7F23834789k807379k632141k433240k283395k249539k420187k587855k671182
1185F03749871k758622k842665k890944k952099l005803l027260l140449l281951l349722
1203.4E76500356l363311l304064l107429k919495k829850k796173k919733l179789
1219.7E52080512l371894l460765l595531l788352m022837m242003m334032m292429
1236E20972669m199862m110217m059077m089117m126191m157603m207372m266203m351288
1254.4D83405739m469871m537136l902674k585351k447158l730208m602223m757911
$$ plain form
1270.7 452373207 447597265 442805976 438000888 433252454 428688854 424448878 420537800 416767955
1287 416767955 412926137 409003198 405090034 401242226 397421777 393575102 389692158 385782212 381858706
1305.4 381858706 377890021 373938054 370027125 366082340 362142444 358205408 354175419 350184500
1321.7 350184500 346368581 342655599 338967443 335277021 331692934 328370959 325221062 321866721
1338 321866721 318252146 314907134 312019229 309353232 306808591 304410249 302191883 300155193 298315138
1356.4 298315138 296765625 295468301 294192404 292997599 292136461 291391611 290614009 290251017 290349483
1374.7 290349483 289862007 288280547 286218554 284351140 282970071 281759590 280278921 278760105
1391 278760105 277258724 275603712 273895204 272060156 270201594 268554926 267113239 266023993 265041143
$$ packed form
1270.7D52373207m775942m791289m805088m748434m563600m239976l911078l769845
1287D16767955l841818l922939l913164l847808l820449l846675l882944l909946l923506
1305.4C81858706l968685l951967l910929l944785l939896l937036m029989l990919
1321.7C50184500l815919l712982l688156l690422l584087l321975l149897l354341
1338C21866721l614575l345012k887905k665997k544641k398342k218366k036690j840055
1356.4B98315138j549513j297324j275897j194805q61138p44850p77602l62992R8466
1374.7B90349483m87476j581460k061993j867414j381069j210481j480669j518816
1391B78760105j501381j655012j708508j835048j858562j646668j441687j089246r82850
$$ plain form
1409.4 265041143 263598025 261103064 256937474 249797419 239383265 229744464 221539751 213802367
1425.7 213802367 207120359 201019660 195753396 191811442 188109219 184715047 182783380 181993321
1442 181993321 182210118 183794215 187024295 191769034 197706506 204760328 214359984 224934518 231371462
1460.4 231371462 235766098 240547732 245394439 249357834 252928466 256687701 260567427 264691770
1476.7 264691770 269213796 273927927 278518289 282628655 286486328 290150315 293151110 295456260
1493 295456260 297675610 300050467 302050918 303735077 305407256 307280332 308928788 310005814 311734021
1511.4 311734021 315126598 321341932 330473244 340865016 352285922 362343580 370182663 377575219
1527.7 377575219 384091794 390443176 397278368 403041422 408409894 415614903 422258705 426848292
$$ packed form
1409.4B65041143j443118k494961m165590p140055j0414154r638801q204713p737384
1425.7B13802367o682008o100699n266264l941954l702223l394172j931667p90059
1442A81993321K16797J584097L230080M744739N937472P053822R599656J0574534O436944
1460.4B31371462M394636M781634M846707L963395L570632L759235L879726M124343
1476.7B64691770M522026M714131M590362M110366L857673L663987L000795K305150
1493B95456260K219350K374857K000451J684159J672179J873076J648456J077026J728207
1511.4C11734021L392577O215334R131312J0391772J1420906J0057658P839083P392556
1527.7C77575219O516575O351382O835192N763054N368472P205009O643802M589587
$$ plain form
1544 426848292 431076229 435375333 439992249 444549143 449116349 453904331 459871024 465501875 468989998
1562.4 468989998 472815067 477351725 482174039 486956030 491065204 495580941 501132846 505867302
1578.7 505867302 510073245 514599562 519151688 523510933 527718961 531795382 535675764 539342463
1595 539342463 542823434 546303272 549805343 553194821 556399405 559490383 562439203 565261006 568232477
1613.4 568232477 571748674 575465143 578478336 581648767 585255682 588366032 591077149 593852878
1629.7 593852878 597023249 601449072 607304394 612011433 615838408 620535731 626434326 634011030
1646 634011030 641468465 646811962 653751731 662629128 667693913 672122955 677976072 684793591 691007853
1664.3 691007853 696363807 702502072 708842576 713661790 718385279 723280013 727649271 732328057
$$ packed form
1544D26848292M227937M299104M616916M556894M567206M787982N966693N630851L488123
1562.4D68989998L825069M536658M822314M781991M109174M515737N551905M734456
1578.7E05867302M205943M526317M552126M359245M208028M076421L880382L666699
1595E39342463L480971L479838L502071L389478L204584L090978K948820K821803K971471
1613.4E68232477L516197L716469L013193L170431L606915L110350K711117K775729
1629.7E93852878L170371M425823N855322M707039L826975M697323N898595P576704
1646F34011030P457435N343497O939769Q877397N064785M429042N853117O817519O214262
1664.3F91007853N355954O138265O340504M819214M723489M894734M369258M678786
$$ plain form
1680.7 732328057 737943351 743458450 746686399 749418199 752764761 756454945 761193275 766272783
1697 766272783 770513952 774189591 776945293 779716372 782575309 785159528 788127124 791642129 795486093
1715.3 795486093 798978031 800850689 802300215 804747343 807957351 811446667 815286160 819367468
1731.7 819367468 823796868 827381134 830376685 833864868 834860325 823690414 787057757 730571330
1748 730571330 688905001 682165325 689131200 700054646 721990108 751761138 778870642 795451343
1764.3 795451343 804531455 811355770 817062318 821584880 824418128 826480150 828846395 831286967
1780.6 831286967 833417058 835349381 837203562 839294255 841775298 843765438 844849527 846029222
1796.9 846029222 847575426 848972321 849953294 850894332 852151692 853645742 854886234 855685830 856548131
$$ packed form
1680.7G32328057N615294N515099L227949K731800L346562L690184M738330N079508
1697G66272783M241169L675639K755702K771079K858937K584219K967596L515005L843964
1715.3G95486093L491938J872658J449526K447128L210008L489316L839493M081308
1731.7H19367468M429400L584266K995551L488183R95457j1169911l6632657n6486427
1748G30571330m1666329o739676O965875J0923446K1935462K9771030K7109504J6580701
1764.3G95451343R080112O824315N706548M522562K833248K062022K366245K440572
1780.6H31286967K130091J932323J854181K090693K481043J990140J084089J179695
1796.9H46029222J546204J396895R80973R41038J257360J494050J240492P99596Q62301
$$ plain form
1815.3 856548131 857580185 858612955 859821081 861258388 862600863 863812327 864830971 865243971
1831.6 865243971 865602612 866375208 867231548 868149996 869430721 870706439 871313453 871546090 871839404
1850 871839404 872333467 873018384 873731077 874408841 875088692 875741065 876578391 877784491 878755093 878882408
1870.3 878882408 878808022 879062235 879515052 880065203 880594850 881070077 881624818 882306635 882951260 883307040
1890.7 883307040 883529544 883826554 884125590 884408891 884717882 885075092 885529578 886035860 886472642 886750162
1911.1 886750162 886990309 887459695 888025820 888345778 888564229 888759136 888779998 888840079 889064729 889299631
1931.5 889299631 889486313 889686048 889935553 890302181 890734553 890895605 890824318 890838325 890964925 891117632
1951.9 891117632 891294599 891470671 891614318 891778231 891960919 892200172 892472029 892587304 892551303 892570019
$$ packed form
1815.3H56548131J032054J032770J208126J437307J342475J211464J018644M13000
1831.6H65243971L58641P72596Q56340R18448J280725J275718O07014K32637K93314
1850H71839404M94063O84917P12693O77764O79851O52373Q37326J206100R70602J27315
1870.3H78882408p4386K54213M52817N50151N29647M75227N54741O81817O44625L55780
1890.7H83307040K22504K97010K99036K83301L08991L57210M54486N06282M36782K77520
1911.1H86750162K40147M69386N66125L19958K18451J94907K0862O0081K24650K34902
1931.5H89299631J86682J99735K49505L66628M32372J61052p1287J4007J26600J52707
1951.9H91117632J76967J76072J43647J63913J82688K39253K71857J15275l6001J8716
$$ plain form
1972.3 892570019 892668962 892749369 892825425 892927229 893015862 893107712 893273890 893486619 893682182 893738747 893636048
1994.8 893636048 893567502 893617451 893697083 893746138 893812120 893881798 893888414 893889427 893991709 894119740 894082487
2017.2 894082487 893785298 893266678 892515540 891907692 892192900 893080831 893712640 893970788 894081295 894195139
2037.6 894195139 894318640 894376159 894385397 894381225 894345760 894333720 894357800 894353628 894367278 894426405 894445360 894459248
2062.1 894459248 894515455 894488513 894383192 894271731 894088984 893810511 893480837 893059015 892528474 891952217
2082.5 891952217 891271889 890487790 889822602 889444172 889390647 889671028 890151024 890679598 891223311 891721427
2102.9 891721427 892116666 892449677 892741919 892930329 893078744 893316209 893606722 893841326 893990755 894077718
2123.3 894077718 894176841 894339979 894465804 894517660 894588470 894666076 894714236 894779861 894822419 894809365 894818306
$$ packed form
1972.3H92570019R8943Q0407P6056J01804Q8633R1850J66178K12729J95563N6565j02699
1994.8H93636048o8546M9949P9632M9055O5982O9678O616J013J02282J28031l7253
2017.2H94082487k97189n18620p51138o07848K85208Q87931O31809K58148J10507J13844
2037.6H94195139J23501N7519R238m172l5465j2040K4080m172J3650N9127J8955J3888
2062.1H94459248N6207k6942j05321j11461j82747k78473l29674m21822n30541n76257
2082.5H91952217o80328p84099o65188l78430n3525K80381M79996N28574N43713M98116
2102.9H91721427L95239L33011K92242J88410J48415K37465K90513K34604J49429Q6963
2123.3H94077718R9123J63138J25825N1856P0810P7606M8160O5625M2558j3054Q941
$$ plain form
2145.7 894818306 894847274 894870043 894923151 894946158 894877791 894854665 894899249 894889832 894858301 894794941 894638300
2168.1 894638300 894556761 894637704 894694328 894689381 894684374 894643843 894597113 894589186 894557118 894494474 894468069 894431829
2192.6 894431829 894377947 894358099 894310772 894236207 894218981 894191027 894126415 894111812 894092679 894034445 894019067
2215 894019067 893998027 893902838 893825054 893759310 893629849 893507600 893395841 893189609 892922997 892650604 892317951
2237.5 892317951 891979635 891730011 891549110 891429842 891374052 891324461 891284108 891276479 891231716 891134441 891026199
2259.9 891026199 890876412 890686274 890506566 890298665 890074790 889939308 889851034 889739692 889675736 889654934
2280.3 889654934 889580846 889479518 889364541 889192760 889020979 888871312 888686121 888496101 888327539 888115764 887881637
2302.7 887881637 887667179 887418449 887137949 886877596 886618376 886370480 886130869 885795593 885412991 885114670
$$ packed form
2145.7H94818306K8968K2769N3108K3007o8367k3126M4584r417l1531o3360j56641
2168.1H94638300q1539Q0943N6624m947n007m0531m6730p927l2068o2644k6405l6240
2192.6H94431829n3882j9848m7327p4565j7226k7954o4612j4603j9133n8234j5378
2215H94019067k1040r5189p7784o5744j29461j22249j11759k06232k66612k72393l32653
2237.5H92317951l38316k49624j80901j19268n5790m9591m0353p629m4763r7275j08242
2259.9H91026199j49787j90138j79708k07901k23875j35482q8274j11342o3956k0802
2280.3H89654934p4088j01328j14977j71781Tj49667j85191j90020j68562k11775k34127
2302.7H87881637k14458k48730k80500k60353k59220k47896k39611l35276l82602k98321
$$ plain form
2323.1 885114670 884848416 884504974 884120226 883785963 883482516 883143306 882733643 882310092 881971359 881744862
2343.5 881744862 881754816 881997406 882082582 881782532 881249428 880702913 880233169 879915118 879740834 879593432
2363.9 879593432 879480541 879440367 879376411 879303873 879275322 879215181 879146814 879128933 879052937 878887177 878700256
2386.4 878700256 878438056 878066957 877702475 877348959 876917124 876444280 875944078 875365138 874737740 874078393
2406.8 874078393 873305142 872367442 871204615 869697690 867923081 866216898 864639342 862897098 861150444
2425.1 861150444 859635174 857659996 854189992 848560810 840398967 830068111 818771541 807380795
2441.4 807380795 795482934 781861424 766959250 755973518 755943358 767154813 782615304 796300769
2457.8 796300769 806717634 814396799 819838583 823488712 825957119 827535450 828484118 830211341
$$ packed form
2323.1H85114670k66254l43442l84748l34263l03447l39210m09663m23551l38733k26497
2343.5H81744862R954K42590Q5176l00050n33104n46515m69744l18051j74284j47402
2363.9H79593432j12891m0174o3956p2538k8551o0141o8367j7881p5996j65760j86921
2386.4H78700256k62200l71099l64482l53516m31835m72844n00202n78940o27398o59347
2406.8H74078393p73251r37700j162827j506925j774609j706183j577556j742244j746654
2425.1H61150444j515270j975178l470004n629182q161843j0330856j1296570j1390746
2441.4H07380795j1897861j3621510j4902174j0985732l0160J1211455J5460491J3685465
2457.8G96300769J0416865P679165N441784L650129K468407J578331R48668J727223
$$ plain form
2474.1 830211341 834178925 839739621 845158696 849619210 853097558 855769932 857942104 859819353
2490.4 859819353 861335933 862259507 862481296 862315357 862261832 862466812 862795830 863194525 863589823 863853097
2510.8 863853097 863992214 864049911 863980949 863812268 863625944 863377869 863025486 862639189 862266660 861919761
2531.2 861919761 861611605 861327648 861090541 860931993 860806584 860696316 860634983 860614538 860641539 860752761
2551.6 860752761 860934019 861189544 861601055 862194240 862904966 863741398 864717305 865754247 866795897
2569.9 866795897 867780924 868633509 869316518 869769692 869956553 869967818 869912684 869785011 869566917 869326591
2590.3 869326591 869110107 868896306 868669808 868408203 868116260 867852926 867621779 867361844 867085159 866857231
2610.7 866857231 866659939 866447389 866230726 866032600 865841806 865622103 865368962 865123153 864899039 864664495
$$ packed form
2474.1H30211341L967584N560696N419075M460514L478348K672374K172172J877249
2490.4H59819353J516580R23574K21789j65939n3525K04980L29018L98695L95298K63274
2510.8H63853097J39117N7697o8962j68681j86324k48075l52383l86297l72529l46899
2531.2H61919761l08156k83957k37107j58548j25409j10268o1333k0445K7001J11222
2551.6H60752761J81258K55525M11511N93185P10726Q36432R75907J036942J041650
2569.9H66795897R85027Q52585O83009M53174J86861J1265n5134j27673k18094k40326
2590.3H69326591k16484k13801k26498k61605k91943k63334k31147k59935k76685k27928
2610.7H66857231j97292k12550k16663j98126j90794k19703k53141k45809k24114k34544
$$ plain form
2631.1 864664495 864414275 864180267 863951027 863694966 863448024 863226593 863011539 862806678 862591028 862354457
2651.5 862354457 862116873 861872733 861613035 861365378 861140847 860910296 860672414 860437989 860177219 859881163
2671.9 859881163 859583855 859301150 859030664 858778119 858548105 858330488 858105659 857852995 857591867 857347190
2692.3 857347190 857099593 856826842 856542528 856264532 855977714 855680764 855390728 855108976 854816079 854496121
2712.7 854496121 854178965 853906512 853640735 853308856 852928340 852574706 852284312 852038324 851773441 851418138
2733.1 851418138 850982070 850525856 850050449 849582851 849240363 849072099 848971009 848828912 848616362 848332942
2753.5 848332942 847988248 847594082 847163916 846719146 846266925 845769823 845219374 844646096 844010651 843295455
2773.9 843295455 842575014 841805100 840891123 839857042 838682592 837300897 835735261 834044456 832214355
$$ packed form
2631.1H64664495k50220k34008k29240k56061k46942k21431k15054k04861k15650k36571
2651.5H62354457k37584k44140k59698k47657k24531k30551k37882k34425k60770k96056
2671.9H59881163k97308k82705k70486k52545k30014k17617k24829k52664k61128k44677
2692.3H57347190k47597k72751k84314k77996k86818k96950k90036k81752k92897l19958
2712.7H54496121l17156k72453k65777l31879l80516l53634k90394k45988k64883l55303
2733.1H51418138m36068m56214m75407m67598l42488j68264j01090j42097k12550k83420
2753.5H48332942l44694l94166m30166m44770m52221m97102n50449n73278o35445p15196
2773.9H43295455p20441p69914r13977j034081j174450j381695j565636j690805j830101
$$ plain form
2792.2 832214355 830188155 827932656 825534761 823300362 821477890 819781363 817473114 814077318
2808.6 814077318 809872210 805664003 802226961 799902499 798705697 798686445 799970984 802601755 806254327
2826.9 806254327 810146809 813543320 816151142 817974925 819145799 819927275 820482194 820750237 820749342
2845.3 820749342 820658147 820659876 820845366 821119547 821264744 821104467 820607841 819876015 819034755 818174779
2865.7 818174779 817330956 816479862 815646291 815031588 814819515 814891517 815027237 815177143 815401614 815725744
2886.1 815725744 816143513 816688657 817332208 818018258 818826318 819776177 820717156 821601391 822488070 823358297
2906.5 823358297 824141562 824744642 825148284 825471401 825793862 826103270 826412737 826698244 826892376 826980889
2926.8 826980889 827044010 827201664 827453315 827698410 827879071 828000069 828022242 827923059 827835798 827875674
$$ packed form
2792.2H32214355k026200k255499k397895k234399j822472j696527k308249l395796
2808.6H14077318m205108m208207l437042k324462j196802j9252J284539K630771L652572
2826.9H06254327L892482L396511K607822J823783J170874P81476N54919K68043q95
2845.3H20749342r1195J729J85490K74181J45197j60277m96626p31826q41260q59976
2865.7H18174779q43823q51094q33571o14703k12073P2002J35720J49906K24471L24130
2886.1H15725744M17769N45144O43551O86050Q08060R49859R40979Q84235Q86679Q70227
2906.5H23358297P83265O03080M03642L23117L22461L09408L09467K85507J94132Q8513
2926.8H26980889O3121J57654K51651K45095J80661J20998K2173r9183q7261L9876
$$ plain form
2947.2 827875674 827922046 827856302 827830434 827880383 827833474 827704787 827590883 827477157 827348888 827219069
2967.6 827219069 827077150 826944172 826862335 826802313 826691449 826576233 826557934 826590061 826555610 826397002
2988 826397002 826116145 825825632 825611234 825391710 825173378 824990153 824768245 824522018 824250638 823859215
3008.4 823859215 823380589 822955310 822625935 822368741 822149158 821923792 821660459 821373403 821078181 820747018
3028.8 820747018 820377111 819975793 819606841 819295168 818910182 818440139 818044364 817761481 817467690 817103565
3049.2 817103565 816728354 816385567 816059709 815725982 815371931 815000057 814593971 814124465 813657761 813257158
3069.6 813257158 812846005 812398016 811966419 811557472 811178029 810788989 810326457 809848309 809437096 809066236
3090 809066236 808693647 808306217 807875991 807393968 806910157 806436896 805920660 805374980 804852247 804369748
$$ packed form
2947.2H27875674M6372o5744k5868M9949m6909j28687j13904j13726j28269j29819
2967.6H27219069j41919j32978q1837o0022j10864j15216j8299L2127l4451j58608
2988H26397002k80857k90513k14398k19524k18332j83225k21908k46227k71380l91423
3008.4H23859215m78626m25279l29375k57194k19583k25366k63333k87056k95222l31163
3028.8H20747018l69907m01318l68952l11673l84986m70043l95775k82883k93791l64125
3049.2H17103565l75211l42787l25858l33727l54051l71874m06086m69506m66704m00603
3069.6H13257158m11153m47989m31597m08947l79443l89040m62532m78148m11213l70860
3090H09066236l72589l87430m30226m82023m83811m73261n16236n45680n22733m82499
$$ plain form
3110.4 804369748 803898692 803395212 802844584 802275419 801725984 801153004 800519705 799861550 799216568 798611045
3130.8 798611045 798026383 797396123 796729505 796102941 795541525 795050979 794626057 794184268 793630123 793016851
3151.2 793016851 792422235 791810930 791183889 790547490 789852262 789102197 788328767 787545562 786782622 786015213
3171.6 786015213 785212934 784418583 783605099 782727063 781836629 780962348 780063927 779126704 778151810 777136564
3192 777136564 776141822 775185347 774186134 773126006 772063196 771016300 770009398 769050896 768066764
3210.3 768066764 767047048 766036749 765017569 763952315 762827873 761689186 760597050 759546578
3226.7 759546578 758466601 757323384 756189108 755083561 753942907 752798080 751711249 750663996
3243 750663996 749634206 748603761 747543991 746505976 745552659 744636297 743699074 742771029 741874039
$$ packed form
3110.4H04369748m71056n03480n50628n69165n49435n72980o33299o58155o44982o05523
3130.8G98611045n84662o30260o66618o26564n61416m90546m24922m41789n54145o13272
3151.2G93016851n94616o11305o27041o36399o95228p50065p73430p83205p62940p67409
3171.6G86015213q02279p94351q13484q78036q90434q74281q98421r37223r74894j015246
3192G77136564r94742r56475r99213j060128j062810j046896j006902r58502r84132
3210.3G68066764j019716j010299j019180j065254j124442j138687j092136j050472
3226.7G59546578j079977j143217j134276j105547j140654j144827j086831j047253
3243G50663996j029790j030445j059770j038015r53317r16362r37223r28045q96990
$$ plain form
3261.3 741874039 740989506 740131021 739357412 738687098 737993300 737169683 736242414 735268295 734327614 733420610
3281.7 733420610 732479811 731525302 730618119 729762971 728845477 727758646 726550698 725273967 723967969
3300.1 723967969 722749650 721628666 720413268 718957424 717302561 715570867 713843763 712118089
3316.4 712118089 710361660 708564579 706764698 704935193 702951550 700803578 698606014 696456790
3332.7 696456790 694387555 692321002 690079153 687618375 685069680 682510972 680009842 677604556
3349 677604556 675092161 672300756 669390500 666584611 663880527 661077201 658171177 655408382 652771235
3367.4 652771235 649970949 646899760 643817723 641005814 638436675 635962486 633529782 631171703
3383.7 631171703 628963470 627049327 625468254 623863518 621948302 620015919 618430257 617044330
$$ packed form
3261.3G41874039q84533q58485p73609o70314o93798q23617r27269r74119r40681r07004
3281.7G33420610r40799r54509r07183q55148r17494j086831j207948j276731j305998
3300.1G23967969j218319j120984j215398j455844j654863j731694j727104j725674
3316.4G12118089j756429j797081j799881j829505j983643k147972k197564k149224
3332.7F96456790k069235k066553k241849k460778k548695k558708k501130k405286
3349F77604556k512395k791405k910256k805889k704084k803326k906024k762795k637147
3367.4F52771235k800286l071189l082037k811909k569139k474189k432704k358079
3383.7F31171703k208233j914143j581073j604736j915216j932383j585662j385927
$$ plain form
3400 617044330 615368128 613374233 611624300 610300601 609085619 607798159 606432259 605108976 604042947
3418.4 604042947 603169322 602310240 601540744 601008892 600687027 600392759 600181520 600175619 600117564 599832416
3438.8 599832416 599609256 599719167 600131989 600639760 601064861 601548553 602218628 603028834 604031324
3457.1 604031324 605151534 606113136 607047737 608325481 609758973 610831141 611507058 612252772 613344133
3475.5 613344133 614734590 616104364 617100537 617988646 619135022 620330095 621463180 622801185 624419093
3493.8 624419093 626103520 627679825 629246294 630868495 632315159 633571446 634960055 636503637
3510.2 636503637 638026774 639481127 640859067 642252564 643832743 645651042 647378385 648791790
3526.5 648791790 650120437 651572227 653216541 655058503 656838059 658427477 660280824 662536502
$$ packed form
3400F17044330j676202j993895j749933j323699j214982j287460j365900j323283j066029
3418.4F04042947q73625q59082p69496n31852l21865k94268k11239n901n8055k85148
3438.8E99832416k23160J09911M12822N07771M25101M83692O70075Q10206J002490
3457.1F04031324J120210R61602R34601J277744J433492J072168O75917P45714J091361
3475.5F13344133J390457J369774R96173Q88109J146376J195073J133085J338005J617908
3493.8F24419093J684427J576305J566469J622201J446664J256287J388609J543582
3510.2F36503637J523137J454353J377940J393497J580179J818299J727343J413405
3526.5F48791790J328647J451790J644314J841962J779556J589418J853347K255678
$$ plain form
3542.8 662536502 664648235 666192472 667513013 669051230 670681477 672299564 674127936 676249504
3559.1 676249504 678475440 680635214 682802379 684947371 686725676 688299775 690133333 692306340
3575.4 692306340 694622934 697086155 699767709 702608407 705437779 707878470 709914625 712029338
3591.7 712029338 714406133 716890156 719365299 721744359 723976731 726211965 728579700 731060684
3608.1 731060684 733497500 735843599 738086939 740145504 742137730 743940115 745394886 746928692
3624.4 746928692 748799086 750772655 752173603 753061831 753998458 755007088 756026387 757158637 758502543
3642.7 758502543 760183632 762152016 763651192 763795972 763381660 763354003 763778329 764188588 764355183
3661.1 764355183 764453471 764873981 765700281 766512752 767001152 767345250 767343819 766647100 765890241 765600562
$$ packed form
3542.8F62536502K111733J544237J320541J538217J630247J618087J828372K121568
3559.1F76249504K225936K159774K167165K144992J778305J574099J833558K173007
3575.4F92306340K316594K463221K681554K840698K829372K440691K036155K114713
3591.7G12029338K376795K484023K475143K379060K232372K235234K367735K480984
3608.1G31060684K436816K346099K243340K058565J992226J802385J454771J533806
3624.4G46928692J870394J973569J400948Q88228R36627J008630J019299J132250J343906
3642.7G58502543J681089J968384J499176J44780m14312k7657M24326M10259J66595
3661.1G64355183R8288M20510Q26300Q12471M88400L44098j431o96719p56859k89679
$$ plain form
3681.5 765600562 765898407 766837895 768250704 768966258 768371284 767730057 767625272 767812550 768051445
3699.8 768051445 768167555 768187940 768484950 769192457 769741416 769451559 768827438 768570185 768643200 768796384
3720.2 768796384 768855512 768751085 768596292 768689156 769246101 770141423 770646870 770318806 769797325 769428670
3740.6 769428670 769052863 768812954 768911958 768933535 768513858 767819047 767357707 767145157 766831577 766333342
3761 766333342 765999556 765973687 765997589 765785158 765305519 764844954 764772534 765068591 765138566 764682829 764174819
3783.5 764174819 763824999 763589084 763521492 763555110 763621390 763794839 764046848 764131546 763893902 763462961
3803.9 763462961 762940586 762356937 761985481 761992097 762226939 762501538 762702465 762523234 761783183 761031866
3824.3 761031866 760623097 760434687 760355711 760478318 760829985 761002362 760578573 759820104 759098291 758577645
$$ packed form
3681.5G65600562K97845R39488J412809P15554n94974o41227j04785J87278K38895
3699.8G68051445J16110K0385K97010P07507N48959k89857o24121k57253P3015J53184
3720.2G68796384N9128j04427j54793R2864N56945Q95322N05447l28064n21481l68655
3740.6G69428670l75807k39909R9004K1577m19677o94811m61340k12550l13580m98235
3761G66333342l33786k5869K3902k12431m79639m60565p2420K96057O9975m55737n08010
3783.5G64174819l49820k35915o7592L3618O6280J73449K52009Q4698k37644m30941
3803.9G63462961n22375n83649l71456O616K34842K74599K00927j79231p40051p51317
3824.3G61031866m08769j88410p8976J22607L51667J72377m23789p58469p21813n20646
$$ plain form
3844.6 758577645 758466661 758831203 759305000 759089112 758302808 757915497 757864714 758010626 758164883 758066237
3865 758066237 757867932 757810295 757676303 757212698 756708324 756509721 756597579 756738186 756731391 756495357 756102443
3887.5 756102443 755798638 755548358 755275190 755243361 755506992 755712152 755503535 754918158 754220963 753660083
3907.9 753660083 753370464 753325045 753388286 753408015 753280282 753065467 752877533 752684832 752424657 752230883
3928.3 752230883 752184272 752082646 751817048 751558781 751410484 751314759 751200438 751053631 750945449 750851750
3948.7 750851750 750637352 750354648 750127912 749963880 749847770 749739647 749577641 749383807 749209821 749078512
3969.1 749078512 748978078 748878121 748763323 748602927 748429060 748361945 748362422 748223364 747957826 747747600
3989.5 747747600 747568607 747351050 747171640 747038841
$$ packed form
3844.6G58577645j10984L64542M73797k15888p86304l87311n0783J45912J54257r8646
3865G58066237j98305n7637j33992m63605n04374j98603Q7858J40607o795k36034l92914
3887.5G56102443l03805k50280k73168l1829K63631K05160k08617n85377o97195n60880
3907.9G53660083k89619m5419O3241J9729j27733k14815j87934j92701k60175j93774
3928.3G52230883m6611j01626k65598k58267j48297r5725j14321j46807j08182r3699
3948.7G50851750k14398k82704k26736j64032j16110j08123j62006j93834j73986j31309
3969.1G49078512j00434r9957j14798j60396j73867o7115M77j39058k65538k10226
3989.5G47747600j78993k17557j79410j32799
$$ plain form
3997.6 747038841
$$ packed form
3997.6G47038841
##END=$$ End of the data block
