##TITLE=DI 16-1052554-1 $$ Begin of the data block
##JCAMP-DX=5.00 $$ ACD/SpecManager v 10.08
##SPECTROMETER/DATA SYSTEM=Alpha
##DATE=21 Jul 2016 08:26:52
##DATA TYPE=INFRARED SPECTRUM
##DATA CLASS=XYDATA
##ORIGIN=
##OWNER=
##NPOINTS=1667
##FIRSTX=599.64648438
##LASTX=3997.64306641
##MAXX=3997.64306641
##MINX=599.64648438
##MAXY=1.11488366
##MINY=0.54791886
##XFACTOR=1.0000000000
##YFACTOR=0.000000010000000
##FIRSTY=1.02804625
##DELTAX=2.03961372
##XUNITS=1/CM
##YUNITS=ARBITRARY UNITS
##XYDATA=(X++(Y..Y))
599.6A02804625M4203M1842K790p677L0923Q3756R1863O6173Q8811J10674O2608Q655
$$ 102804625 102848828 102890670 102893460 102885783 102916706 103000462 103092325 103158498 103247309 103357983 103420591 103429246
624.1A03429246k4891m2057k1338R417K3866L1936R859l5537l4427j6404n6076q3065
$$ 103429246 103404355 103362298 103340960 103350377 103374243 103406179 103416038 103380501 103346074 103329670 103273594 103190529
648.6A03190529l8850r906k6369m0496l1566o521n913k06935n99909k93362M06742
$$ 103190529 103151679 103141773 103115404 103074908 103043342 103036821 103030908 102823973 102224064 101930702 102337444
671A02337444K51937m7171j27340j30582j17218p8476o0713p4828o3180k6024l207
$$ 102337444 102589381 102542210 102414870 102284288 102167070 102088594 102027881 101953053 101889873 101863849 101860642
693.5A01860642p784k8872m4120m0507n1034r6738j33145j49369j93286k77626l73018
$$ 101860642 101852858 101823986 101779866 101739359 101688325 101591587 101458442 101309073 101115787 100838161 100465143
715.9A00465143m60255m37618k26253L7849K19369K92820K83157K59018K32327J91415
$$ 100465143 100004888 99567270 99341017 99378866 99598235 99891055 100174212 100433230 100665557 100856972
736.3A00856972J69265J63269J48571J14786Q1098Q8251J08576J04463J01840R7776
$$ 100856972 101026237 101189506 101338077 101452863 101533961 101622212 101730788 101835251 101937091 102034867
756.7A02034867P6675P0369P8011P4327P6449R3365R8729Q5723Q0049P7021O3527O2346
$$ 102034867 102111542 102181911 102259922 102334249 102410698 102504063 102602792 102688515 102768564 102845585 102909112 102971458
781.2A02971458P0250O4540N5087O3479P5221N9783L5370K4831J3948k754j0240j5724
$$ 102971458 103041708 103106248 103161335 103224814 103300035 103359818 103395188 103420019 103433967 103431213 103420973 103405249
805.6A03405249l9983o0033m8912j9026P284K3424L9793N3548O6412Q2826R5904J02783
$$ 103405249 103365266 103305233 103256321 103237295 103244579 103268003 103307796 103361344 103427756 103510582 103606486 103709269
830.1A03709269Q9323O9141O6209O7747O7401O8402O9356O8987O5147O3301O6828N8687
$$ 103709269 103798592 103867733 103933942 104001689 104069090 104137492 104206848 104275835 104340982 104404283 104471111 104529798
854.6A04529798L9828L3772M1330N0580N4217M7278L1400K5522L2235K7883J7929J7202
$$ 104529798 104569626 104603398 104644728 104695308 104749525 104796803 104828203 104853725 104885960 104913843 104931772 104948974
879.1A04948974J4352J383j4150j5354J4675N4121O2525M7052L7062L6454L3295K1136
$$ 104948974 104963326 104964709 104950559 104935205 104949880 105004001 105066526 105113578 105150640 105187094 105220389 105241525
903.5A05241525R501N484R417J9610K5809K5117K2543K6131L4999L1245J6773R024
$$ 105241525 105251026 105256510 105265927 105285537 105311346 105336463 105359006 105385137 105420136 105451381 105468154 105477178
928A05477178M149l22n031k6226n4944p8463j09220j22380p4816P499O1106O8999N2416
$$ 105477178 105481327 105481005 105475974 105449748 105394804 105316341 105207121 105084741 105009925 105017424 105078530 105147529 105199945
954.5A05199945L0017J2004o902k3627j3924K2829O9105J05763J10900P3075P821l4261
$$ 105199945 105229962 105241966 105235064 105211437 105197513 105220342 105289447 105395210 105506110 105579185 105587006 105552745
979A05552745k2018K8491R3043J47331J62124J31583R0814P1037O3217N5706M7159
$$ 105552745 105530727 105559218 105652261 105799592 105961716 106093299 106184113 106255150 106318367 106374073 106421232
1001.5A06421232L2366K2673K4128K6798L2199L2162K1089J2433Q261M113l6n662k8885
$$ 106421232 106453598 106476271 106500399 106527197 106559396 106591558 106612647 106625080 106633341 106637454 106637418 106631756 106602871
1028A06602871n2678m2617k5142k7513m7887p5745r9278j15835j21045j13428r9826
$$ 106602871 106550193 106507576 106482434 106454921 106407034 106331289 106232011 106116176 105995131 105881703 105781877
1050.4A05781877q9562o8593m3559l9816l6383q3M3869K4760k2292j4556l10k3103
$$ 105781877 105692315 105623722 105580163 105540347 105503964 105503881 105547750 105572510 105550218 105535662 105535352 105512249
1074.9A05512249m1592m5752o1405q7774j04475j16324j45674j84929k11072k25222
$$ 105512249 105470657 105424905 105363500 105275726 105171251 105054927 104909253 104724324 104513252 104288030
1095.3A04288030k34449k41220k47228k60699k86722k97177k65765k05601j39522q4114
$$ 104288030 104053581 103812361 103565133 103304434 103017712 102720535 102454770 102249169 102109647 102025533
1115.7A02025533m2022l683K5594M1986N9664Q7130J17528J44673J75750K07889K28632
$$ 102025533 101983511 101979828 102005422 102047408 102107072 102194202 102311730 102456403 102632153 102840042 103068674
1138.1A03068674K39276K42579K39540K30848K11549J84024J56808J43051J43170J32704
$$ 103068674 103307950 103550529 103790069 104020917 104232466 104416490 104573298 104716349 104859519 104992223
1158.5A04992223J09088Q9872P3373M6564R799k6167o3717j04189j34993j55651j67597
$$ 104992223 105101311 105191183 105264556 105311120 105320919 105294752 105231035 105126846 104991853 104836202 104668605
1180.9A04668605j67024j58000j34098j07420j00648r9361r5415j03319j24192j45650
$$ 104668605 104501581 104343581 104209483 104102063 104001415 103902054 103806639 103703320 103579128 103433478
1201.3A03433478j54388j52886j42479j12963q0990o6948o5422p1848p8559p6604p4076
$$ 103433478 103279090 103126204 102983725 102870762 102789772 102722824 102657402 102585554 102506995 102430391 102356315
1223.8A02356315p1133o0224m9639m4167l7801l1591l7288n5504p9203j01220j09065
$$ 102356315 102285182 102224958 102175319 102131152 102093351 102061760 102024472 101968968 101889765 101788545 101679480
1246.2A01679480j06728j04380r6440q5270p9155o8534n9545p0119p9536o6650m8292
$$ 101679480 101572752 101468372 101371932 101286662 101207507 101138973 101079428 101009309 100929773 100863123 100814831
1268.6A00814831m3583n3227o4361o9463p3314o4659l5703j1361q440j5127k5893m2367
$$ 100814831 100771248 100718021 100653660 100584197 100510883 100446224 100410521 100399160 100390720 100375593 100349700 100307333
1293.1A00307333n6898o3145n9521m7291l4070l3164n1248r7388j79458k68131l11178
$$ 100307333 100250435 100187290 100127769 100080478 100046408 100013244 99961996 99864608 99685150 99417019 99105841
1315.6I9105841k44635j9920K68268M42738M58210L87180K92170J98996J21129N5885
$$ 99105841 98861206 98841286 99109554 99552292 100010502 100397682 100689852 100888848 101009977 101065862
1336A01065862K575q953m05n1844j39964j88541j91212j83201j80280j81812j98799
$$ 101065862 101068437 101059484 101059079 101007235 100867271 100678730 100487518 100304317 100124037 99942225 99743426
1358.4I9743426k44600k81805k29525j25909k0069O2061K5469n1165P9155M37671P56544
$$ 99743426 99498826 99217021 98987496 98861587 98841518 98903579 98929048 98877883 98957038 99394709 100151253
1380.8A00151253Q04400O45435M98366M22717L37564K18034R5952P748l1280n7709
$$ 100151253 100955653 101601088 102099454 102522171 102859735 103077769 103173721 103181469 103150189 103092480
1401.2A03092480j29772k20787k86365l78811n07188o10912o66201o89059n99629l90971
$$ 103092480 102962708 102741921 102455556 102076745 101569557 100958645 100292444 99603385 99003756 98612785
1421.6I8612785l60411m96155o48421p89684p80833o57511o13832n00483k86430k03561
$$ 98612785 98252374 97756219 97107798 96318114 95537281 94879770 94265938 93765455 93479025 93275464
1442I3275464j74952j59866k52610m51082o47545p29269p52669n73480k43038j67424
$$ 93275464 93100512 92940646 92688036 92236954 91589409 90860140 90107471 89533991 89290953 89123529
1462.4H9123529j01626N06652J437109K019602K014596J378423P94071N63746M75103
$$ 89123529 89021903 89528555 90965664 92985266 94999862 96378285 97172356 97736102 98211205
1480.8I8211205M58997M75920M76372M56125M32312L61311K40851J31214P2646N4443
$$ 98211205 98670202 99146122 99622494 100078619 100510931 100872242 101113093 101244307 101316953 101371396
1501.2A01371396K1600j25050l16167k36738j58942k30014l23248l85576m32366n37909
$$ 101371396 101392996 101267946 100951779 100715041 100556099 100326085 100002837 99617261 99184895 98646986
1521.6I8646986n83350n71370n96357n87123o61677p87420o66785n89835q80200r54181
$$ 98646986 98063636 97492266 96895909 96308786 95647109 94859689 94192904 93603069 92722869 91768688
1542I1768688o77753m91464l76582k97969j86980n3489P3832J46109L22288N25492
$$ 91768688 91090935 90599471 90222889 89924920 89737940 89684451 89758283 89904392 90226680 90752172
1562.4I0752172O02037O46424O92815P37262P09623O97136P33310O60163N56374M88382
$$ 90752172 91354209 92000633 92693448 93430710 94140333 94837469 95570779 96230942 96787316 97275698
1582.8I7275698L98910K77388J26046m9329k44587m65363o94567r10843j092839j179415
$$ 97275698 97674608 97951996 98078042 98028713 97784126 97318763 96624196 95713353 94620514 93441099
1603.2I3441099j120508r30577o27059k36899J11383L14212L93051L53462J83522r9569
$$ 93441099 92320591 91390014 90762955 90526056 90637439 90951651 91344702 91698164 91881686 91782117
1623.5I1782117l86942o65837r27395j042247j281100j767397j656920j159823q55589
$$ 91782117 91395175 90729338 89801943 88759696 87478596 85711199 84054279 82894456 82038867
1641.9H2038867n50001k23881K51197O55783R36073J315838J368797J334923J397944
$$ 82038867 81488866 81264985 81516182 82171965 83108038 84423876 85792673 87127596 88525540
1660.3H8525540J487547J491594J349968J318091J347435J229971J221508J290041
$$ 88525540 90013087 91504681 92854649 94172740 95520175 96750146 97971654 99261695
1676.6I9261695J203162J092088J042271J059222Q36551N70416M50468L34800K51591
$$ 99261695 100464857 101556945 102599216 103658438 104494989 105065405 105515873 105850673 106102264
1694.9A06102264K09093J74582J46759J28281J12414J16837J08290Q0788M9341K6190
$$ 106102264 106311357 106485939 106632698 106760979 106873393 106990230 107098520 107179308 107228649 107254839
1715.3A07254839K3246N4955P5102N6481M1128J2743j0013n973J2052M8876O9690N3155
$$ 107254839 107278085 107333040 107408142 107464623 107505751 107518494 107508481 107502508 107514560 107563436 107633126 107686281
1739.8A07686281K5356K3961L2115J7500l874K9432N4372K6560J1301J8263K0265K0826
$$ 107686281 107711637 107735598 107767713 107785213 107781339 107810771 107865143 107891703 107903004 107921267 107941532 107962358
1764.3A07962358P856l719R441K0003K2352J8978J3769Q726J67j359J2016O187j0562
$$ 107962358 107970214 107966495 107975936 107995939 108018291 108037269 108051038 108059764 108059931 108058572 108070588 108076775 108066213
1790.8A08066213P129K6882K2339J574r203J1766K5475Q154j0932p045J2088J9407
$$ 108066213 108073342 108100224 108122563 108124137 108114934 108126700 108152175 108160329 108149397 108142352 108154440 108173847
1815.3A08173847Q631Q3n030o938m792n758r501n72J0120N329J19j347n519o986L040
$$ 108173847 108182478 108182561 108177531 108170593 108165801 108160043 108150542 108149970 108160090 108165419 108165538 108164191 108158672 108151686 108154726
1845.9A08154726J0908J2350O008l767j812K110j67r5k194j5294j9050L445K4080J9455
$$ 108154726 108165634 108177984 108183992 108180225 108178413 108180523 108180356 108180261 108178067 108162773 108143723 108147168 108171248 108190703
1874.4A08190703M161l612l720k968l350m685l993L540M399o127q929K086J1277R788
$$ 108190703 108194864 108191252 108187532 108184564 108181214 108176529 108172536 108176076 108180475 108174348 108165419 108167505 108178782 108188570
1903A08188570O55o056J657J0920L898j4198j9526k337M792K409J1217J2195J371n674
$$ 108188570 108189225 108183169 108184826 108195746 108199644 108185446 108165920 108163583 108168375 108170784 108182001 108194196 108195567 108189893
1931.5A08189893l755M005P463k492q118P725J0681p367o950J180p069o759L814L863
$$ 108189893 108186138 108190143 108197606 108195114 108186996 108194721 108205402 108198035 108191085 108192265 108185196 108178437 108182251 108186114
1960.1A08186114P63N48j788k122K205M745L862J037j513k313q94k15m744q464p081
$$ 108186114 108186877 108187425 108185637 108183515 108185720 108190465 108194327 108195364 108193851 108191538 108190644 108190429 108185685 108177221 108170140
1990.7A08170140o20N078L660L147J514m983n150m05L219Q58j1945j9359j1290k813
$$ 108170140 108169520 108174598 108178258 108181405 108182919 108177936 108172786 108172381 108175600 108176458 108164513 108145154 108133864 108131051
2019.2A08131051n031j0120q071k575M423J1945N161k050J764k825r668m470K789K635
$$ 108131051 108126020 108115900 108107829 108105254 108109677 108121622 108126783 108124733 108126497 108123672 108114004 108109534 108112323 108114958
2047.8A08114958N84K074L982P15m899l493J824K646L82o092p176O806J1993J383n794
$$ 108114958 108115542 108117616 108121598 108122313 108117414 108113921 108115745 108118391 108118773 108112681 108105505 108112311 108124304 108125687 108119893
2078.4A08119893o998o318j275N817Q691Q022L839k27k718k884L671O807L576J705
$$ 108119893 108112895 108106577 108105302 108111119 108119810 108127832 108131671 108131444 108128726 108125842 108129513 108136320 108139896 108141601
2106.9A08141601j991k515k563o521n066l851n972k134P546P284k730n686n842p617
$$ 108141601 108139610 108137095 108134532 108128011 108122945 108119094 108113122 108110988 108118534 108125818 108123088 108117402 108111560 108103943
2135.5A08103943n126j07K074q70l744r77K086l81l648k861k98k957p450l553K408
$$ 108103943 108098817 108098710 108100784 108099914 108096170 108095193 108097279 108096898 108093250 108090389 108090091 108087134 108079684 108076131 108078539
2166.1A08078539J681j07K86L624P296M994q3j180K050O557Q774O818K134j252J252
$$ 108078539 108080220 108080113 108080399 108084023 108091319 108096313 108096230 108095050 108097100 108103657 108112431 108119249 108121383 108120131 108121383
2196.7A08121383Q130J3089L994q309J717J0526K956N162J3447J2922O378M113R775
$$ 108121383 108129513 108142602 108146596 108138287 108140004 108150530 108153486 108158648 108172095 108185017 108191395 108195508 108205283
2223.2A08205283R095J741L123J1599J0300R18p63k27m410j586K658m017l290Q893
$$ 108205283 108214378 108216119 108219242 108230841 108241141 108242059 108241296 108241069 108236659 108235073 108237731 108233714 108230424 108239317
2251.8A08239317J1873M208r751k3007j8073k98P141K813k622k253O175J5533K2983
$$ 108239317 108251190 108255398 108245647 108222640 108204567 108204269 108211410 108214223 108211601 108209348 108215523 108231056 108254039
2278.3A08254039K7025J4293j7762m2140m3667n0282o6471o9774p1466q0454q4162
$$ 108254039 108281064 108295357 108277595 108235455 108191788 108141506 108075035 108005261 107933795 107853341 107769179
2300.7A07769179r8872j42288j74415j72448j64712j52099j42467j86348k65682k77292
$$ 107769179 107670307 107528019 107353604 107181156 107016444 106864345 106721878 106535530 106269848 105992556
2321.1A05992556j90998j12104j25229j59860j13511l9458l4964o1727p7093n9664
$$ 105992556 105801558 105689454 105564225 105404365 105290854 105251396 105216432 105154705 105077612 105017948
2341.5A05017948Q0121L47697M06123P2610l62408n76854n11837l35657j32466L1519
$$ 105017948 105098069 105445766 105851889 105924499 105562091 104985237 104473400 104137743 104005277 104036796
2361.9A04036796J59776K97022M01378M57465M90225M86541M68397M65488M57633L94213
$$ 104036796 104196572 104493594 104894972 105352437 105842662 106329203 106797600 107263088 107720721 108114934
2382.3A08114934K75230J66345J02317O3682L0982O581j753j692n37K432P832J7822
$$ 108114934 108390164 108556509 108658826 108722508 108753490 108760071 108758318 108756626 108756089 108758521 108766353 108784175
2406.8A08784175K4533J8728J979j1158p773P272K6560L3057J9288L779j0073j3614
$$ 108784175 108808708 108827436 108829415 108818257 108810484 108817756 108844316 108877373 108896661 108900440 108890367 108876753
2431.2A08876753J228J0442J0145N806l910k397Q941J2207O199M482O950N49l767J573
$$ 108876753 108877981 108888423 108898568 108904374 108900464 108898067 108907008 108919215 108925414 108929896 108936846 108937395 108933628 108935201
2459.8A08935201N102J729p510o569Q536J5533Q249J55j800k945m375j621J288k993
$$ 108935201 108940303 108942032 108934522 108927953 108936489 108952022 108960271 108960426 108958626 108955681 108951306 108949685 108950973 108947980
2488.3A08947980k217J1623J0312q250j2898m196Q22N01K50n018j9062k2721q893Q22
$$ 108947980 108945763 108957386 108967698 108959448 108946550 108942354 108943176 108943677 108943927 108938909 108919847 108897126 108888233 108889055
2516.9A08889055K289M816L207l982n150K957L087q106p570K802K718q35l493p784
$$ 108889055 108891344 108896160 108899367 108895385 108890235 108893192 108896279 108888173 108880603 108883405 108886123 108885288 108881795 108874011
2545.5A08874011k623l93j1241j1647l624n722j1134q452L93l242j8013j9860j2255
$$ 108874011 108871388 108870995 108859754 108848107 108844483 108838761 108827627 108819175 108819568 108816326 108798313 108778453 108766198
2572A08766198j1289r358q94o390j8763j2994j252j561j1742j8514j5342j0395o342
$$ 108766198 108754909 108745551 108744657 108738267 108719504 108706510 108705258 108703697 108691955 108673441 108658099 108647704 108641362
2598.5A08641362q678k1017k1374j3053j3531q535j478r847k0528j9097j5903j8727
$$ 108641362 108632684 108611667 108590293 108577240 108563709 108555174 108553696 108543849 108523321 108504224 108488321 108469594
2623A08469594k1899j8227j9002k6846k1553j6117k5559l1566l0745l6609m0364l2985
$$ 108469594 108447695 108429468 108410466 108383620 108362067 108345950 108320391 108288825 108258080 108221471 108181107 108148122
2647.4A08148122k9516l8505m7564m4036m4084n2524m6527l4118l4535l7455l5823
$$ 108148122 108118606 108080101 108032537 107988501 107944417 107891893 107845366 107811248 107776713 107739258 107703435
2669.9A07703435l1983k4248k5379l5751l4237k1625j4138j4317r894j550l695j3948
$$ 107703435 107671452 107647204 107621825 107586074 107551837 107530212 107516074 107501757 107491863 107490313 107486618 107472670
2694.3A07472670k0254j8525j1122r000j5927j9311j3054p892k0074m0806n0938n5051
$$ 107472670 107452416 107433891 107422769 107413769 107397842 107378531 107365477 107357585 107337511 107296705 107245767 107190716
2718.8A07190716n8853o2538o9057o6257n1355m4191m0937l8814m2510m6146n6136
$$ 107190716 107131863 107069325 107000268 106934011 106882656 106838465 106797528 106758714 106716204 106670058 106613922
2741.2A06613922o5660o8975p0512o0237m1592l9315m9841n3847o1321p2098p7689
$$ 106613922 106548262 106479287 106408775 106348538 106306946 106267631 106217790 106163943 106102622 106030524 105952835
2763.7A05952835q1682r0945j09553j31989j49536j54400j58787j80768k17510k59483
$$ 105952835 105871153 105780208 105670655 105538666 105389130 105234730 105075943 104895175 104677665 104418182
2784.1A04418182l01635l30114l29232l22462l50785l98004m19485m24028m38237m53818
$$ 104418182 104116547 103786433 103457201 103134739 102783954 102385950 101966465 101542437 101104200 100650382
2804.5A00650382m56727m54974m53841m51076m58748m71073m74262m82679n01251n30064
$$ 100650382 100193655 99738681 99284840 98833764 98375016 97903943 97429681 96947002 96445751 95915687
2824.9I5915687n87648o68502p61062q95995j114177j429928j838046k332449k841407
$$ 95915687 95328039 94659537 93898475 93002480 91888303 90458375 88620329 86287880 83446473
2843.2H3446473l190303l234982k891595k057933p63798O74903J847065K504974K622330
$$ 83446473 80256170 77021188 74129593 72071660 71307862 71982765 73829830 76334804 78957134
2861.6G8957134K296347J700842J107157P70103P40362Q21817P59214M81945J11902
$$ 78957134 81253481 82954323 84061480 84831583 85571945 86393762 87152976 87634921 87746823
2879.9H7746823k33847n21576p41250q83657r57572j009643j066834j103723j133990
$$ 87746823 87512976 86991400 86250150 85366493 84408921 83399278 82332444 81228721 80094731
2898.3H0094731j223868j374883j535099j723177j976430k268762k559596k802986
$$ 80094731 78870863 77495980 75960881 74237704 72261274 69992512 67432916 64629930
2914.6F4629930k906745k744431k244818j448971m93079M55409J273352J919979K417189
$$ 64629930 61723185 58978754 56733936 55284965 54791886 55247295 56520647 58440626 60857815
2933F0857815K753448K890497K848644K665382K336717J874941J354409R09364O64723
$$ 60857815 63611263 66501760 69350404 72015786 74352503 76227444 77581853 78491217 79155940
2951.3G9155940O74802Q96919J206958J513636J783812J990956K093536K053809J899773
$$ 79155940 79830742 80727661 81934619 83448255 85232067 87223023 89316559 91370368 93270141
2969.7I3270141J685345J447094J221942J018417Q42119P17395O20461N10013L81839
$$ 93270141 94955486 96402580 97624522 98642939 99485058 100202453 100822914 101332927 101714766
2988A01714766K33650J16587P4744L5703j9037m2832m1092j1587L4833N6267N7888
$$ 101714766 101948416 102065003 102139747 102175450 102156413 102113581 102072489 102060902 102095735 102152002 102209890
3010.5A02209890Q5401J38081J67536J60075J45721J28090J03820Q6152N0676n48k3043
$$ 102209890 102295291 102433372 102600908 102760983 102906704 103034794 103138614 103224766 103275442 103274894 103251851
3032.9A03251851o271J7345l302m6802l8123R525J5319k3377l5954k2590k0659j2720
$$ 103251851 103245580 103262925 103259623 103212821 103174698 103184223 103199542 103176165 103140211 103117621 103096962 103084242
3057.4A03084242m577k2161m9949n9545k1231L9100N6696K3616l2568m5896K5904R3532
$$ 103084242 103079665 103057504 103007555 102948010 102926779 102965879 103022575 103046191 103013623 102967727 102993631 103087163
3081.9A03087163J04129J20580J26243J03903J17481J38092J14643P8118P1144R8562
$$ 103087163 103191292 103311872 103438115 103542018 103659499 103797591 103912234 103990352 104061496 104160058
3102.2A04160058J08254O4874K8336N0962M4596k5379l9232J0550O3729J01280P6342
$$ 104160058 104268312 104333186 104361522 104412484 104457080 104431701 104392469 104403019 104466748 104568028 104644370
3124.7A04644370J1957k1291j4067o044l6060p9942p0608j7488l445l6526o8593r9432
$$ 104644370 104656327 104635036 104620969 104614925 104578865 104498923 104428315 104410827 104407382 104370856 104302263 104202831
3149.2A04202831j22774q7643k3233k4641p1168q7273q0955q9800j09995j18911j13857
$$ 104202831 104080057 103992414 103969181 103944540 103873372 103786099 103705144 103615344 103505349 103386438 103272581
3171.6A03272581j10030j12844j09613j01709j06692j18709j13773r9313r0373p4637
$$ 103272581 103162551 103049707 102940094 102838385 102731693 102612984 102499211 102399898 102309525 102234888
3192A02234888n8377o2942p2348o4218n5194n2941m6516m7469n4383n5110m6564m2557
$$ 102234888 102176511 102113569 102041221 101977003 101921809 101868868 101822352 101774883 101720500 101665390 101618826 101576269
3216.5A01576269n8055o2049n5098o9571r8979j30058j71589j89996j28401p5244j09005
$$ 101576269 101518214 101456165 101401067 101331496 101232517 101102459 100930870 100740874 100612473 100537229 100428224
3238.9A00428224j53959j75345j99372j95360j50716j40596j84780k07490j79130j60837
$$ 100428224 100274265 100098920 99899548 99704188 99553472 99412876 99228096 99020606 98841476 98680639
3259.3I8680639j68764j60671j64413k17366k53147j84202q9079o9732p8225p7963
$$ 98680639 98511875 98351204 98186791 97969425 97716278 97532076 97442997 97373265 97295040 97217077
3279.7I7217077p9483p5429m9752k5768m6449m9127J4770Q2237J27917J38689Q8429
$$ 97217077 97137594 97062165 97012413 96986645 96940196 96891069 96905839 96988076 97115993 97254682 97343111
3302.1I7343111L2872O7496J85812K71869K72655K38734K19059K05160J81919J66398
$$ 97343111 97375983 97443479 97629291 97901160 98173815 98412549 98631608 98836768 99018687 99185085
3322.5I9185085J75470K17534K57438K51925K24256J93084J62422J82224K27320K25663
$$ 99185085 99360555 99578089 99835527 100087452 100311708 100504792 100667214 100849438 101076758 101302421
3342.9A01302421K13671K01201J50419J34193J84727K02632J65594J31130J20783J23906
$$ 101302421 101516092 101717293 101867712 102001905 102186632 102389264 102554858 102685988 102806771 102930677
3363.3A02930677J11616R1469J12152J62196J73509J44506J23000J18434J12701J07598
$$ 102930677 103042293 103133762 103245914 103408110 103581619 103726125 103849125 103967559 104080260 104187858
3383.7A04187858J06931P7569J9598J8692R1970J09744M1938J1707P0214J29342R6404
$$ 104187858 104294789 104372358 104391956 104410648 104502618 104612362 104654300 104666007 104736221 104865563 104961967
3406.1A04961967K5630J5450M8470O7282O4290M0304K0254M0686N8627L3558Q070K0933
$$ 104961967 104987597 105003047 105051517 105118799 105183089 105223393 105243647 105284333 105342960 105376518 105384588 105405521
3430.6A05405521L3856J6427J6749N8639Q3697N9175K9707K7871M0746L8791L2055
$$ 105405521 105439377 105455804 105472553 105531192 105614889 105674064 105703771 105731642 105772388 105811179 105843234
3453.1A05843234M5753M8387L4046M1580M9973K3341J5413O5935J10436R8991N8150
$$ 105843234 105888987 105937374 105971420 106013000 106062973 106086314 106101727 106167662 106278098 106377089 106435239
3475.5A06435239K0910J3899M7493P1574O1536N9771P6151P5436M9996M1330N9616
$$ 106435239 106456149 106470048 106517541 106589115 106650651 106710422 106786573 106862009 106912005 106953335 107012951
3497.9A07012951N1833L5643P7152J11604Q5354N8889O0285Q2790R7430Q4758N3954
$$ 107012951 107064784 107100427 107177579 107289183 107374537 107433426 107493711 107576501 107673931 107758689 107812643
3520.4A07812643K2805M5037R6893J05465R4986Q8024O5815O6746J03604R3091L4368
$$ 107812643 107835448 107880485 107977378 108082843 108177829 108265853 108331668 108398414 108502018 108595109 108629477
3542.8A08629477J7250P0130J23406J05059Q2064J01673Q5819L9768M3154P1669M6920
$$ 108629477 108646727 108716857 108840263 108945322 109027386 109129059 109214878 109254646 109297800 109369469 109416389
3565.2A09416389J4902O6709J27733J10471N8770L2044L1233M2307L2806n555J967
$$ 109416389 109431291 109498000 109625733 109736204 109794974 109827018 109858251 109900558 109933364 109927809 109929776
3587.7A09929776O8534Q4138M8363L5929M3238M2593M8435N4502M7863N2118O6531
$$ 109929776 109998310 110082448 110130811 110166740 110209978 110252571 110301006 110355508 110403371 110455489 110522020
3610.1A10522020M3583O151J669j1349q344M2951P3039N1665k4151k1983P3934R0981
$$ 110522020 110565603 110571754 110573423 110562074 110553730 110596681 110669720 110721385 110697234 110675251 110749185 110840166
3634.6A10840166N9473M6909M3809L9256M3333J9931o8295n5337Q0598Q8513k873q738
$$ 110840166 110899639 110946548 110990357 111029613 111072946 111092877 111024582 110969245 111049843 111138356 111135483 111126745
3659A11126745L4284L6824J8811J586m5932n2964p534m7446l7431N1534P0918O7377
$$ 111126745 111161029 111197853 111216664 111218250 111172318 111119354 111111820 111064374 111026943 111078477 111149395 111216772
3683.5A11216772N8496M506k9540J1408K3866J847N985J2648j9860k8170J7131L8552
$$ 111216772 111275268 111279774 111250234 111261642 111285508 111287355 111293340 111305988 111286128 111257958 111275089 111313641
3708A11313641J2064j7405k26J1182j7536n8436q1587o6435k7502L3116O5637o294
$$ 111313641 111325705 111308300 111308074 111319256 111301720 111243284 111161697 111095262 111067760 111100876 111166513 111160219
3732.5A11160219j01257n3799P6044J50120J19162K5952L1065L7611m3821m5908K4665
$$ 111160219 111058962 111005163 111081207 111231327 111350489 111376441 111407506 111445117 111401296 111355388 111380053
3754.9A11380053M3308Q405p976P129l34l051k468j7083n591K4438K7025n090j3495
$$ 111380053 111423361 111431766 111423790 111430919 111430585 111427534 111425066 111407983 111402392 111426830 111453855 111448765 111435270
3781.4A11435270l469o950n495O67J6749K0564M89J6570J3971n7459l4678O128k4557
$$ 111435270 111431801 111424851 111419356 111420023 111436772 111457336 111457825 111474395 111488366 111430907 111396229 111402357 111377800
3807.9A11377800L57L5858P773m9830l3807K181r823j788N996K0516K4677k528j2994
$$ 111377800 111378157 111414015 111421788 111371958 111338151 111340332 111330509 111328721 111334717 111355233 111379910 111377382 111364388
3834.4A11364388k7060n0509k2733J2290J0085J9956N9152O8915m1831j22845n746
$$ 111364388 111337328 111286819 111264086 111276376 111286461 111306417 111365569 111434484 111392653 111269808 111264062
3856.9A11264062N0676J2994k8658l4082j061o187j1921J9932J2207j991j8227k2376
$$ 111264062 111314738 111327732 111299074 111264992 111263931 111257744 111245823 111265755 111277962 111275971 111257744 111235368
3881.4A11235368j5390l7312L528L3415k1517k3735K1589J9276j9944m1830j6892K4736
$$ 111235368 111219978 111182666 111186194 111219609 111198092 111174357 111195946 111215222 111195278 111153448 111136556 111161292
3905.8A11161292M2021K6297L195j6117l7885k4306J8215K8241R53j9860j1957j3745
$$ 111161292 111203313 111229610 111232805 111216688 111178803 111154497 111172712 111200953 111201906 111182046 111170089 111156344
3930.3A11156344l0136j8060J3721L3784J5962k4128k6619j6964k1243n495J3113J2624
$$ 111156344 111126208 111108148 111121869 111155653 111171615 111147487 111120868 111103904 111082661 111077166 111090279 111102903
3954.8A11102903O866J788r667j8013j7404j0109o0K360N663J3351J6713R013o378
$$ 111102903 111109769 111111557 111101890 111083877 111066473 111056364 111056304 111058664 111064327 111077678 111094391 111103404 111097026
3981.3A11097026j8180j7046o605l5k492j4484o556K2399
$$ 111097026 111078846 111061800 111055195 111055160 111052668 111038184 111031628 111054027
3997.6A11054027
$$ 111054027
##END=$$ End of the data block
