##TITLE=DI 16-1052554-1 $$ Begin of the data block
##JCAMP-DX=5.00 $$ ACD/SpecManager v 10.08
##SPECTROMETER/DATA SYSTEM=Alpha
##DATE=21 Jul 2016 08:26:52
##DATA TYPE=INFRARED SPECTRUM
##DATA CLASS=XYDATA
##ORIGIN=
##OWNER=
##NPOINTS=1667
##FIRSTX=599.64648438
##LASTX=3997.64306641
##MAXX=3997.64306641
##MINX=599.64648438
##MAXY=1.07510388
##MINY=0.00562829
##XFACTOR=1.0000000000
##YFACTOR=0.000000010000000
##FIRSTY=0.81135160
##DELTAX=2.03961372
##XUNITS=1/CM
##YUNITS=ARBITRARY UNITS
##XYDATA=(X++(Y..Y))
599.6H1135160P1603P9268N4270J9002J3679R060k1154k0819p511l9774p9214r5046
624.1H1118524j09541j23197j12832q2636l7580j181q016j7453J1510J1015p5156j78468
648.6H0394989k36946k87980l64560m22394m40025m43376m27645l98689m74895m92996
669G6405483l12900l68655n34260o24263o63799o68967o52504o30778o10614n80114
689.4G0758629n29748m73005m37403m35471m71515n27393o06972p06679q06481r31477
709.8F4832485j110524j363862j689684j965302j877964j184404j37925P23666J140201
728.1E7366687J184642J065869R22596P92658O87856N98246N20748M47350L90840L74806
748.5F4352298L85749L87806L82405L74771L62890L55924L44962L36462L29035L19511
$$ y = [81135160, 81206763, 81286031, 81340301, 81359303, 81372982, 81382042, 81360888, 81340069, 81332558, 81292784, 81213570, 81118524, 81008983, 80885786, 80772954, 80690318, 80652738, 80651557, 80643541, 80626088, 80637598, 80648613, 80573457, 80394989, 80158043, 79870063, 79505503, 79083109, 78643084, 78199708, 77772063, 77373374, 76898479, 76405483, 76092583, 75723928, 75189668, 74565405, 73901606, 73232639, 72580135, 71949357, 71338743, 70758629, 70228881, 69755876, 69318473, 68883002, 68411487, 67884094, 67277122, 66570443, 65763962, 64832485, 63721961, 62358099, 60668415, 58703113, 56825149, 55640745, 55502820, 56226486, 57366687, 58551329, 59617198, 60539794, 61332452, 62020308, 62618554, 63139302, 63586652, 63977492, 64352298, 64738047, 65125853, 65508258, 65883029, 66245919, 66601843, 66946805, 67283267, 67612302, 67931813]
768.9F7931813L11744L06714L07435K94959K59841K27654K10338K00403J94997J95765
789.3G0441663K05064K01428J73593J42300J22958R6840O4015M6784K9737J6737L1024
811.8G1572143N1439N6165P4148J14703J51217J84393K19232K49952K77216K80833
832.2G3231441K66385K77346K98739L07524L09759K96349K76136K77966K95168K94567
852.6G6131380K61724K11870J73849J52826J39088J26129J14459J06460J06579J06531
873G7630895Q1855M7070J7959j6886n8913r1148q0937L052J38730K41041K76417K66623
897.4G8455758K16836J49596R0146N6564N9599Q2356J13469J41704J55503J55097J43713
919.9G9820341J33186J25188J08218P7486L3129k2763q9354j72114k87897m79489p13277
$$ y = [67931813, 68243557, 68550271, 68857706, 69152665, 69412506, 69640160, 69850498, 70050901, 70245898, 70441663, 70646727, 70848155, 71021748, 71164048, 71287006, 71383846, 71447861, 71494645, 71524382, 71541119, 71572143, 71623582, 71679747, 71753895, 71868598, 72019815, 72204208, 72423440, 72673392, 72950608, 73231441, 73497826, 73775172, 74073911, 74381435, 74691194, 74987543, 75263679, 75541645, 75836813, 76131380, 76393104, 76604974, 76778823, 76931649, 77070737, 77196866, 77311325, 77417785, 77524364, 77630895, 77712750, 77759820, 77777779, 77760893, 77701980, 77610832, 77529895, 77532947, 77671677, 77912718, 78189135, 78455758, 78672594, 78822190, 78912336, 78968900, 79028499, 79110855, 79224324, 79366028, 79521531, 79676628, 79820341, 79953527, 80078715, 80186933, 80264419, 80297548, 80274785, 80185431, 80013317, 79725420, 79245931, 78532654]
942.3G8532654p69019m63873K5201L38548L69209K53362J15257L076q4257j28150m2063
964.7G8149945K02864N02378P02548O82175M22716M5109k06930j32155K05857N67150
985.1H1141657P97146Q56894P64984O10561M76741L77465L03673K37471J54370P3201
1005.5H5794163K4467K856P039L8332P1799P8196N1969J317o3193j36155k21073l01701
1030H5348016l67355m30185m83954n39362o17248p02548p69961p92819p64656o95122
1050.4G9184806n79255m13669k42442j32101p1425q952M4858M6337J5420J579j3554
1072.8G7831602n4628j02633j49017k14929l08740m09377n21498o73342q53729j027608
1093.2G3516101j159764j214999j215040j240176j338184j449806j461744j325023
$$ y = [78532654, 77763635, 77299762, 77324963, 77663511, 78032720, 78286082, 78401339, 78404415, 78320158, 78192008, 78149945, 78352809, 78855187, 79557735, 80239910, 80662626, 80707735, 80500805, 80368650, 80574507, 81141657, 81938803, 82795697, 83560681, 84171242, 84647983, 85025448, 85329121, 85566592, 85720962, 85794163, 85818630, 85821486, 85828525, 85866857, 85938656, 86016852, 86068821, 86070138, 86006945, 85870790, 85649717, 85348016, 84980661, 84550476, 84066522, 83527160, 82909912, 82207364, 81437403, 80644584, 79879928, 79184806, 78605551, 78191882, 77949440, 77817339, 77745914, 77736962, 77781820, 77828157, 77843577, 77845156, 77831602, 77776974, 77674341, 77525324, 77310395, 77001655, 76592278, 76070780, 75397438, 74543709, 73516101, 72356337, 71141338, 69926298, 68686122, 67347938, 65898132, 64436388, 63111365]
1109.6F3111365j060331p22814m00364j56093J6433J36811K21491L04025M07368N38910
1129.9F2396801P08007R06253J084364J218187J326782J407564J437294J409847J337623
1148.3G3232722J236588J118434R94402Q77374P59685O28650M90612L50487K00361
1166.7G9889315L4494j63269m05950o57648q52137r47702r41450q61448p55715o48952
1187.1G3689538n52624m87787m60499m63277n06342n93239o91861p56955p27928n97006
1207.5F7852020m47631l57073l35026l60930m20785m83161n12242n07802m79239m14342
1227.9F3533789l08943j83254q0717m6533q6391j67591k49803l13705l50076l54016
1248.2F1392760l17996k38759j56802j14661j01900r7144r5290q0776n2303l4553l7825
$$ y = [63111365, 62051034, 61328220, 60927856, 60771763, 60788196, 60925007, 61146498, 61450523, 61857891, 62396801, 63104808, 64011061, 65095425, 66313612, 67640394, 69047958, 70485252, 71895099, 73232722, 74469310, 75587744, 76582146, 77459520, 78219205, 78847855, 79338467, 79688954, 79889315, 79923809, 79760540, 79354590, 78696942, 77844805, 76897103, 75955653, 75094205, 74338490, 73689538, 73136914, 72649127, 72188628, 71725351, 71219009, 70625770, 69933909, 69176954, 68449026, 67852020, 67404389, 67047316, 66712290, 66351360, 65930575, 65447414, 64935172, 64427370, 63948131, 63533789, 63224846, 63041592, 62960875, 62914342, 62827951, 62660360, 62410557, 62096852, 61746776, 61392760, 61074764, 60836005, 60679203, 60564542, 60462642, 60365498, 60270208, 60189432, 60137129, 60102576, 60064751]
1270.7F0064751n5307q0824r7394p4262O205J23722K25055K68954K44588J70993R4378
1293.1F0890859M8614L1227L3134N4336O7317J3709j58602m67497r13852j414591j666064
1315.6E6518590j241028J4234J536369K410865K277511J510269O96361J55520r9915
1333.9F3778776k04247k58994k78759l32308n48858q66890j092904j160545j145500
1352.3E7889771j110941j071578j054710j115608j221162j111097o50978J383M84604
1370.6E1039684M40073J16980M96012J993048L531718L951377L473926K911943K321815
1389G0276576J668322J212454Q84491N15646J53244k04510o00940j094591j658124
1407.3G1152568k279961k948237l402793l430909l162903k628743j780987j447493
$$ y = [60064751, 60009444, 59928620, 59831226, 59756964, 59763169, 59886891, 60111946, 60380900, 60625488, 60796481, 60890859, 60939473, 60970700, 61003834, 61058170, 61125487, 61139196, 60980594, 60513097, 59599245, 58184654, 56518590, 55277562, 55291796, 56828165, 59239030, 61516541, 63026810, 63723171, 63878691, 63778776, 63574529, 63315535, 63036776, 62704468, 62155610, 61288720, 60195816, 59035271, 57889771, 56778830, 55707252, 54652542, 53536934, 52315772, 51204675, 50553697, 50555080, 51039684, 51479757, 51596737, 52092749, 54085797, 57617515, 61568892, 65042818, 67954761, 70276576, 71944898, 73157352, 74041843, 74557489, 74710733, 74506223, 73905283, 72810692, 71152568, 68872607, 65924370, 62521577, 59090668, 55927765, 53299022, 51518035, 50070542]
1423.7E0070542j792222k282733k683005k656382k188370j804089j434037r64675o77883
1442C3587146m88150l58957n22054j033896j563030j684022j394558q61696m88525
1460.4B5192258l93987m4744J381828L621078N635005O485194M951397K922889K005899
1478.7E1756817J764220J866925K063316K225214K238584J919317J326108Q52019M95505
1497.1F6508025J05750j56474k71302n00554j000571j184303j191628j349246j550770
1515.4E9408927j731843j847601k140110k271694k217520k319407k258143k265909
1531.8D2356700k468860k219212j920617k210662k142876j590771j245337r62863p00575
1550.1B6894927m14401j20610J72296O64019J158157J123798J291940J631442J982948
$$ y = [50070542, 48278320, 45995587, 43312582, 40656200, 38467830, 36663741, 35229704, 34265029, 33587146, 33098996, 32740039, 32217985, 31184089, 29621059, 27937037, 26542479, 25680783, 25192258, 24798271, 24753527, 26135355, 29756433, 35391438, 41876632, 46828029, 49750918, 51756817, 53521037, 55387962, 57451278, 59676492, 61915076, 63834393, 65160501, 66012520, 66508025, 66613775, 66457301, 66185999, 65685445, 64684874, 63500571, 62308943, 60959697, 59408927, 57677084, 55829483, 53689373, 51417679, 49200159, 46880752, 44622609, 42356700, 39887840, 37668628, 35748011, 33537349, 31394473, 29803702, 28558365, 27595502, 26894927, 26480526, 26359916, 26532212, 27196231, 28354388, 29478186, 30770126, 32401568, 34384516]
1568.5C4384516K294409K146238K199990K635282K377096J921800J723486J378277
1584.8E1061094Q49914J97626n77236j436478k358320l213066l836119m148769m051042
1603.2C2487604l493363k626454j624406o07939K38663R83305J541302J379782R59334
1621.5B9237828N25340j55616r07904j554775j925045k270316k826975k631880j923916
1639.9A5566741j440863r62253m46216M8693L68629R46239J768798J709248J717333
1658.2A9276349K168243K757484L086993L037792L461331M055283L986439M495716
1674.5D6325630N324763N332768N281675N731237O364554M982763L361905K763015
1690.9H5468310K159804J826930J572651J228303J040738P92307O32030O14941N26172
$$ y = [34384516, 36678925, 38825163, 41025153, 43660435, 46037531, 47959331, 49682817, 51061094, 51911008, 52108634, 51531398, 50094920, 47736600, 44523534, 40687415, 36538646, 32487604, 28994241, 26367787, 24743381, 24135442, 24374105, 25357410, 26898712, 28278494, 29237828, 29763168, 29607552, 28699648, 27144873, 25219828, 22949512, 20122537, 17490657, 15566741, 14125878, 13163625, 12717409, 12766102, 13134731, 14080970, 15849768, 17559016, 19276349, 21444592, 24202076, 27289069, 30326861, 33788192, 37843475, 41829914, 46325630, 51650393, 56983161, 62264836, 67996073, 74360627, 79343390, 82705295, 85468310, 87628114, 89455044, 91027695, 92255998, 93296736, 94089043, 94721073, 95336014, 95862186]
1709.2I5862186M54491M15475L82977L32934K47127K15643J86903J64747J21283J16909
1729.6I8500675J55592K40832L12812L42065L68917L26812K69043K32554K05302J45459
1750A01100063J17481J16658J07122J00958J05465R2077P1096P5794Q5294J06179Q9443
1772.4A02167630O6483O8045Q4400Q9943Q1420P4649P8500Q2957O9213O1250M9674
1794.9A02974164M9115L4928J6928K1803K9183J9860J0991J4925J6391K0278J6069
1817.3A03224635J8215K4283K6763J8501J3912J2004J3304K8610K7156J3077J0169
1839.8A03430629K3258K0658R215O640M590K134O139J3459J4937J9288J8239J5235
1864.2A03584421J3411P426N615K0254L1447L1078K5892J7357J7798K2686K8753K9957
$$ y = [95862186, 96316677, 96732152, 97115129, 97448063, 97695190, 97910833, 98097736, 98262483, 98383766, 98500675, 98656267, 98897099, 99209911, 99551976, 99920893, 100247705, 100516748, 100749302, 100954604, 101100063, 101217544, 101334202, 101441324, 101542282, 101647747, 101739824, 101810920, 101886714, 101972008, 102078187, 102167630, 102234113, 102302158, 102386558, 102476501, 102557921, 102632570, 102711070, 102794027, 102863240, 102924490, 102974164, 103023279, 103058207, 103075135, 103096938, 103126121, 103145981, 103156972, 103171897, 103188288, 103208566, 103224635, 103242850, 103267133, 103293896, 103312397, 103326309, 103338313, 103351617, 103380227, 103407383, 103420460, 103430629, 103453887, 103474545, 103483760, 103490400, 103494990, 103497124, 103503263, 103516722, 103531659, 103550947, 103569186, 103584421, 103597832, 103605258, 103610873, 103631127, 103662574, 103693652, 103719544, 103736901, 103754699, 103777385, 103806138, 103836095]
1888.7A03836095K7824K4414J5890J8669L1888L2568K3139J5211J1229J3983J6690
1911.1A04067600J6892Q785m315K885J6510J2243R108P939j812m589L254J3566K0540
1937.7A04168606J2255k492m387m375q011m196k062k706K777M638K551K86l278p666
1966.2A04151940j1491j2637j0407o163p164q905p987p868j0562j3125j0216p415q762
1992.7A04029238q583q392j2613k0456k8503k8872k8372l0947l8075m9246n9247o2251
2017.2A03653681m9102l8135l7980k9862j4353m256N472O497j79N01K587P86j823J227
2045.8A03495061N818O962N877R024J0705M101p99J550P855J0813O628Q58L338M423
2074.3A03572214N352J0395R394O020P391P558K312L756P486R18j3125j5330m793j168
$$ y = [103836095, 103863919, 103888333, 103904223, 103922892, 103954780, 103987348, 104010487, 104025698, 104036927, 104050910, 104067600, 104084492, 104093277, 104088962, 104091847, 104108357, 104120600, 104129708, 104137647, 104135835, 104131246, 104134500, 104148066, 104168606, 104180861, 104178369, 104173982, 104169607, 104161596, 104157400, 104155338, 104152632, 104155409, 104160047, 104162598, 104162884, 104159606, 104151940, 104140449, 104127812, 104117405, 104111242, 104104078, 104095173, 104087186, 104079318, 104068756, 104055631, 104045415, 104038000, 104029238, 104020655, 104012263, 103999650, 103979194, 103950691, 103921819, 103893447, 103862500, 103824425, 103775179, 103715932, 103653681, 103604579, 103566444, 103528464, 103498602, 103484249, 103479993, 103485465, 103491962, 103491783, 103492284, 103494871, 103495657, 103493834, 103495061, 103500879, 103507841, 103513718, 103522742, 103533447, 103537548, 103536749, 103538299, 103546154, 103556967, 103563595, 103564453, 103567791, 103572214, 103577566, 103587961, 103597355, 103603375, 103610766, 103618324, 103620636, 103624392, 103631878, 103632796, 103619671, 103604341, 103599548, 103598380]
2102.9A03598380l064m923j0526j8370k7192l1888k1995j1992j7285k4045j9109j7786
2127.3A03390205k5058l3533m4179m5169m0710m5585n4026n2977m3738l6287l5179
2149.8A02933764l9267m5216m5002l2222k3532k4879k6309k6346k6512k5177k0253
2172.2A02599049j7643k3485l1089k9147k2841j6212n305l683j4067j4114k611K396
2196.7A02421248l219r477r787o902J824O485n25k801k62J597K491K301N138K015q405
2227.3A02401721q738J848L374k551o56l993j9575k0516p593n186m089K432L445R6
2255.8A02340019m113j0383j2314n436O103R883j264o723N96L361K814M637J228j1206
2284.4A02317202k4688k4021k4342l3498k9659k2591k0313j6892k4378m0925l8588
$$ y = [103598380, 103595316, 103590393, 103579867, 103561497, 103534305, 103502417, 103480422, 103468430, 103451145, 103427100, 103407991, 103390205, 103365147, 103331614, 103287435, 103242266, 103201556, 103155971, 103101945, 103048968, 103005230, 102968943, 102933764, 102894497, 102849281, 102804279, 102772057, 102748525, 102723646, 102697337, 102670991, 102644479, 102619302, 102599049, 102581406, 102557921, 102526832, 102497685, 102474844, 102458632, 102453327, 102449644, 102435577, 102421463, 102418852, 102421248, 102418029, 102408552, 102398765, 102391863, 102393687, 102400172, 102399647, 102396846, 102396584, 102398181, 102400672, 102402973, 102408111, 102410126, 102401721, 102392983, 102394831, 102398205, 102395654, 102394998, 102391005, 102371430, 102350914, 102343321, 102338135, 102334046, 102336478, 102339923, 102340019, 102335906, 102325523, 102313209, 102307773, 102313876, 102323759, 102322495, 102315772, 102316368, 102319729, 102322543, 102327180, 102328408, 102317202, 102292514, 102268493, 102244151, 102210653, 102180994, 102158403, 102138090, 102121198, 102096820, 102055895, 102017307]
2306.8A02017307k3603k7335l3474j8406j6451m5466n0163j9527k396l731j824K539
2331.3A01777470N555J1134J7000J0073p975q440J9097O0105O2049J7738l2520n4121
2355.8A01877165l0649R060J4913l683P093L5190L6442L7265N2285O4695P9668R6786
2380.2A02276230R4294O6948L9268L0792K7358Q619j2410j8882j8764j2612n496o306
2404.7A02469039m542L529Q022L410k861l040R5M554J0395J2458R477k051j0490n555
2433.3A02492440o318n913r42m196p474j0658j2719q405l266l624j6284k8455k3830
2459.8A02360356j8227k5785l7372m1044l8838l4988l1698l1603l5023m4966n0092
2482.2A01970720m7004n3632o4337n7137m1545m5276o4718p3612o5243n8520o2585
$$ y = [102017307, 101993704, 101966369, 101932895, 101914489, 101898038, 101852572, 101802409, 101782882, 101780486, 101776755, 101774931, 101777470, 101783025, 101794159, 101811159, 101821232, 101813257, 101804817, 101823914, 101884019, 101946068, 101963806, 101931286, 101877165, 101846516, 101855576, 101870489, 101866806, 101873899, 101909089, 101945531, 101982796, 102035081, 102099776, 102179444, 102276230, 102370524, 102437472, 102476740, 102507532, 102534890, 102543509, 102531099, 102512217, 102493453, 102480841, 102475345, 102469039, 102464497, 102468026, 102476048, 102479458, 102476597, 102473557, 102473652, 102478206, 102488601, 102501059, 102510536, 102508485, 102497995, 102492440, 102486122, 102480209, 102479267, 102475071, 102467597, 102456939, 102444220, 102435815, 102432549, 102428925, 102412641, 102384186, 102360356, 102342129, 102316344, 102278972, 102237928, 102199090, 102164102, 102132404, 102100801, 102065778, 102020812, 101970720, 101923716, 101870084, 101805747, 101748610, 101707065, 101661789, 101597071, 101523459, 101458216, 101399696, 101337111]
2504.7A01337111p1383p9762p7284o7687p0035q6773r1755p5436o4778o2966o3134
2527.1A00526118o8450p3814p7200p0429n7042n3656o3729q2648r4312q5676q2415
2549.5I9716747r8300j07068j11192j16951j17743j20586j25378j37925j50943j46651
2569.9I8484010j37604j39648j39003j28276j29795j40661j37901j25647j29628j53589
2590.3I7122258j65683j54448j42008j42979j53870j65224j62607j53786j55449j61213
2610.7I5564991j66535j72061j72645j68627j72830j85841j95372j91951j88255j97888
2631.1I3752986k00665k00677k18141k37071k54608k87228l16561l30942l46399l66616
2651.5I0994078l78132l74061l68780l60757l40855l16811k97504k77138k51490k33233
$$ y = [101337111, 101265728, 101185966, 101108682, 101040995, 100970960, 100884187, 100792432, 100716996, 100652218, 100589252, 100526118, 100457668, 100383854, 100306654, 100236225, 100179183, 100125527, 100061798, 99979150, 99884838, 99799162, 99716747, 99618447, 99511379, 99400187, 99283236, 99165493, 99044907, 98919529, 98781604, 98630661, 98484010, 98346406, 98206758, 98067755, 97939479, 97809684, 97669023, 97531122, 97405475, 97275847, 97122258, 96956575, 96802127, 96660119, 96517140, 96363270, 96198046, 96035439, 95881653, 95726204, 95564991, 95398456, 95226395, 95053750, 94885123, 94712293, 94526452, 94331080, 94139129, 93950874, 93752986, 93552321, 93351644, 93133503, 92896432, 92641824, 92354596, 92038035, 91707093, 91360694, 90994078, 90615946, 90241885, 89873105, 89512348, 89171493, 88854682, 88557178, 88280040, 88028550, 87795317]
2671.9H7795317k25234k21366k10535j80376j45799j37031j42961j30809j12188j04630
2692.3H6184388j00672j02001j07283j06638j04559j09380j30105j61386j88488k22009
2712.7H4851867k67208l07881l50833m06403m56291m91518m91923m46344l99255l69478
2733.1H0864733l57592l66223l73375l82405m07428m36944m45443m22180l92574l95495
2753.5G6885074m23252m39137m56769m88543n17208n51438o10548o92475p86912q86393
2773.9G1032399r85301j096594j231319j370680j495862j613206j719957j799172j852572
2792.2E7867736j901061j947832j963931j951486j927128j878763j801797j712156
2808.6D2783582j635685j583085j537224j485298j438832j413455j406038j420909
$$ y = [87795317, 87570083, 87348717, 87138182, 86957806, 86812007, 86674976, 86532015, 86401206, 86289018, 86184388, 86083716, 85981715, 85874432, 85767794, 85663235, 85553855, 85423750, 85262364, 85073876, 84851867, 84584659, 84276778, 83925945, 83519542, 83063251, 82571733, 82079810, 81633466, 81234211, 80864733, 80507141, 80140918, 79767543, 79385138, 78977710, 78540766, 78095323, 77673143, 77280569, 76885074, 76461822, 76022685, 75565916, 75077373, 74560165, 74008727, 73398179, 72705704, 71918792, 71032399, 70047098, 68950504, 67719185, 66348505, 64852643, 63239437, 61519480, 59720308, 57867736, 55966675, 54018843, 52054912, 50103426, 48176298, 46297535, 44495738, 42783582, 41147897, 39564812, 38027588, 36542290, 35103458, 33690003, 32283965, 30863056]
2824.9C0863056j480353j576114j701352j887842k149651k459904k781364l021708
2841.2A3804768l008034k667226k112143j493407q76615k72254L02747Q36931J285500
2859.5E800267J561778J596173J373253J016353P96227Q52818R80940Q99707N63732
2877.9A5441248R9809l49331o92796r09241j014839j034719j002476r46243q87628
2896.3H703784q52093q31883q05437p88657p83327p62768p19611o62472n97590n17345
2916.7A382601m04100k66940j29961j8771O4362J45234K26123L19995M50110N96732
2937B365385P33861Q65395R44256Q85940P02117N10135M32244M90624O82900J024696
2957.4I637553J480317K005823K570827L135344L608986L900052L997922L915715L676927
$$ y = [30863056, 29382703, 27806589, 26105237, 24217395, 22067744, 19607840, 16826476, 13804768, 10796734, 8129508, 6017365, 4523958, 3647343, 3375089, 3677836, 4514767, 5800267, 7362045, 8958218, 10331471, 11347824, 12144051, 12996869, 13977809, 14877516, 15441248, 15541057, 15191726, 14498930, 13589689, 12574850, 11540131, 10537655, 9591412, 8703784, 7851691, 7019808, 6214371, 5425714, 4642387, 3879619, 3160008, 2497536, 1899946, 1382601, 978501, 711561, 581600, 562829, 627191, 772425, 998548, 1318543, 1768653, 2365385, 3099246, 3964641, 4908897, 5794837, 6496954, 7007089, 7439333, 7929957, 8612857, 9637553, 11117870, 13123693, 15694520, 18829864, 22438850, 26338902, 30336824, 34252539, 37929466]
2975.8C7929466L341514K963582K582833K214408J850668J493477J130802P64614M19939
2994.2E4691303J16217j01864k02883j73700j4132K09713M22853N86582O80500P18617
3014.5E6933206P31498P39003P33292O86061N97245M76968L21716J68663O8194L2478
3034.9F1488324K2889j7798n7495m6837j9497l4869r4378j25450j11705r9653r5331
3057.4F0808200r6172j01257j00291q8167k7352O9725J28305J34421J10071J24497
3077.8F0961980K45934L77930M35209M86195N18107N20403N62691N87809N46658M92496
3098.2F5735412M81355N05298M65304L42387K77334L05915K47902Q9103K6554P3689
3118.6F8550253J45787J82748J09762k4432j09798j18208j19889j85591k77179k92862
$$ y = [37929466, 41270980, 44234562, 46817395, 49031803, 50882471, 52375948, 53506750, 54271364, 54691303, 54807520, 54705656, 54502773, 54329073, 54314941, 54524654, 54947507, 55534089, 56214589, 56933206, 57664704, 58403707, 59136999, 59823060, 60420305, 60897273, 61218989, 61387652, 61455846, 61488324, 61511213, 61493415, 61435920, 61389083, 61369586, 61334717, 61240339, 61114889, 61003184, 60903531, 60808200, 60712028, 60610771, 60510480, 60422313, 60394961, 60464686, 60592991, 60727412, 60837483, 60961980, 61207914, 61585844, 62021053, 62507248, 63025355, 63545758, 64108449, 64696258, 65242916, 65735412, 66216767, 66722065, 67187369, 67529756, 67807090, 68113005, 68360907, 68450010, 68476564, 68550253, 68696040, 68878788, 68988550, 68964118, 68854320, 68736112, 68616223, 68430632, 68153453, 67860591]
3139F7860591k24089k04385k80541l57252m10390m52250m21328l57759l73399m33665
3159.4F4345533m67790m83900n10305n44423n60713n53125n42873n44959n45091n31745
3179.8E9060609n11926m91470m68117m35841l97158l58754l16513k74759k45733k21282
3200.1E5339056j94508j73366j56784j53631j62798j63388j68276j92332k14482k30050
3220.5E3529441k66152l24208l83723m34506n02437n57446n19348m77719n20819n81920
3240.9D8961163o38998o95461o93575o44406o34873o77052p02471o73166o47530o54402
3261.3D2299229o52418o45408o55508o55621n81947m71589m17361l94886l57694l13583
3281.7C7153214k63104j93765j22467p9632k6438Q0351K00378K94459L44104L35860
$$ y = [67860591, 67636502, 67432117, 67151576, 66794324, 66383934, 65931684, 65510356, 65152597, 64779198, 64345533, 63877743, 63393843, 62883538, 62339115, 61778402, 61225277, 60682404, 60137445, 59592354, 59060609, 58548683, 58057213, 57589096, 57153255, 56756097, 56397343, 56080830, 55806071, 55560338, 55339056, 55144548, 54971182, 54814398, 54660767, 54497969, 54334581, 54166305, 53973973, 53759491, 53529441, 53263289, 52939081, 52555358, 52120852, 51618415, 51060969, 50541621, 50063902, 49543083, 48961163, 48322165, 47626704, 46933129, 46288723, 45653850, 44976798, 44274327, 43601161, 42953631, 42299229, 41646811, 41001403, 40345895, 39690274, 39108327, 38636738, 38219377, 37824491, 37466797, 37153214, 36890110, 36696345, 36573878, 36494246, 36467808, 36548159, 36748537, 37042996, 37387100, 37722960]
3302.1C7722960L28106M06506N55203O76575P18343P14285P22700P45082P65058P81092
3322.5D4135910Q04848Q64452R17360R24495R24897R13608Q75211Q80539R23819R27484
3342.9E3092623R05937Q63713Q03369P97248Q27795Q11613P71713P53504P45243P27111
3363.3F1099869O96528O84464P01833P14469P09784O89912O48313O12015N99158N91433
3383.7F7747778N60891N06634M67795M54670M35019L89671L55578L53920L36575K96706
3404.1G1905237K71994K50846K30688K24448K13164K01064J94156J84083J85990J89651
3424.5G4051321J72168J59317J61207J60539J55145J40601J31911J32960J17242J06353
3444.9G5488764J12152J16968J33229J55431J84476K15966K22653K18743K21759K30157
$$ y = [37722960, 38051066, 38457572, 39012775, 39689350, 40407693, 41121978, 41844678, 42589760, 43354818, 44135910, 44940758, 45805210, 46722570, 47647065, 48571962, 49485570, 50360781, 51241320, 52165139, 53092623, 53998560, 54862273, 55665642, 56462890, 57290685, 58102298, 58874011, 59627515, 60372758, 61099869, 61796397, 62480861, 63182694, 63897163, 64606947, 65296859, 65945172, 66557187, 67156345, 67747778, 68308669, 68815303, 69283098, 69737768, 70172787, 70562458, 70918036, 71271956, 71608531, 71905237, 72177231, 72428077, 72658765, 72883213, 73096377, 73297441, 73491597, 73675680, 73861670, 74051321, 74223489, 74382806, 74544013, 74704552, 74859697, 75000298, 75132209, 75265169, 75382411, 75488764, 75600916, 75717884, 75851113, 76006544, 76191020, 76406986, 76629639, 76848382, 77070141, 77300298]
3465.3G7300298K53737K64907K37399K14267K18910K29150K30533K26945K34109K59256
3485.7G9669511K77090K75004K76918K85339K97612L12483L13527L16709L40122L53277
3506.1H2717592L56143L67630L81279L92824L94488L93384L88146L79276L98385M28176
3526.5H6597323M29964M30757M36801M27574M29177M51738M48793M09514L93057M24385
3546.9I0879083M53949M44942M36950M43906M27663L95584L85010L96330L83561L54481
3567.3I5001459L75617M15069L99047L53700L36277L38990L36396L19833K89738K80035
3587.7I8446161L00645K96426K65372K48343K48158K38251K24257K24078K23469K07711
3608.1A00922871J91164J89376K06100K15388J75011J54281K03383K41112K23923J39904
$$ y = [77300298, 77554035, 77818942, 78056341, 78270608, 78489518, 78718668, 78949201, 79176146, 79410255, 79669511, 79946601, 80221605, 80498523, 80783862, 81081474, 81393957, 81707484, 82024193, 82364315, 82717592, 83073735, 83441365, 83822644, 84215468, 84609956, 85003340, 85391486, 85770762, 86169147, 86597323, 87027287, 87458044, 87894845, 88322419, 88751596, 89203334, 89652127, 90061641, 90454698, 90879083, 91333032, 91777974, 92214924, 92658830, 93086493, 93482077, 93867087, 94263417, 94646978, 95001459, 95377076, 95792145, 96191192, 96544892, 96881169, 97220159, 97556555, 97876388, 98166126, 98446161, 98746806, 99043232, 99308604, 99556947, 99805105, 100043356, 100267613, 100491691, 100715160, 100922871, 101114035, 101303411, 101509511, 101724899, 101899910, 102054191, 102257574, 102498686, 102722609, 102862513]
3628.5A02862513R3663J43981J69098J62351J51563J38569J43993J71375J48797L2926
3648.8A04218829L397R5201P7390k6083l4332J55j6653l5036n3525j31631j44553m9830
3673.3A03903329n4931L576K10130L57950M43578M69768M16338L43323K79331J96207
3693.7A06568599J44160J49369J24371L0708L290P3350J07121N2369l1412k4426K6214
3716.2A07223713L2461J741l1293k8443n72N3477Q4996J5891r8193j10447J1766J45304
3740.6A07300401J38378R668J4567M7374o0201q2648K027J7095j5879j2136J3853L707
3765.1A07376206R5M626k1482k6727m923j323k5368k3186M554k599k4951j3625K6595
3791.6A07267892L8398J6856L0875K0135o5768n0628q440m5729j6868M7469L1185m5228
$$ y = [102862513, 102956176, 103100157, 103269255, 103431606, 103583169, 103721738, 103865731, 104037106, 104185903, 104218829, 104222226, 104317427, 104394817, 104368734, 104334402, 104334557, 104317904, 104282868, 104229343, 104097712, 103953159, 103903329, 103848398, 103851974, 104062104, 104420054, 104863632, 105333400, 105749738, 106093061, 106372392, 106568599, 106712759, 106862128, 106986499, 107017207, 107020497, 107093847, 107200968, 107253337, 107221925, 107197499, 107223713, 107256174, 107257915, 107226622, 107198179, 107197607, 107251084, 107336080, 107351971, 107253778, 107143331, 107155097, 107300401, 107438779, 107448447, 107463014, 107510388, 107450187, 107367539, 107369566, 107386661, 107370782, 107358646, 107372499, 107376206, 107376301, 107380927, 107359445, 107332718, 107327795, 107326472, 107301104, 107277918, 107282472, 107279873, 107254922, 107241297, 107267892, 107306290, 107323146, 107354021, 107374156, 107308388, 107257760, 107249320, 107203591, 107186723, 107234192, 107265377, 107220149]
3816.1A07220149k9373j836n7256m1890J2588M5800L6443m280k742n913m0936l8564
3840.6A07092190k1208l576M2391J09828J28626l9541k10333p9215M5312M9793N746
3863A07120013j6320J6749K468m1628k1541M995K2721R883r954j3197m9829j9718L2080
3889.5A07036722j8990l4964K8038M0638p474m5884m5180k3294M65J085k408m65k9838
3916A06898451m3035j0991Q524k015j8227k3508m0364n6601l7086k849J1134j7703
3940.5A06665730o0451n2750k1684j7917j8346j7906k0074j4997k5129l8815k2447
3962.9A06355214j2135j8919p248m363k3627k1625L076J4472J383k2412l3521k4939
3987.4A06205356j9848k2066k7096l4595k4938
$$ y = [107220149, 107190776, 107188940, 107131684, 107089794, 107102382, 107148182, 107184625, 107180345, 107177603, 107171690, 107130754, 107092190, 107070982, 107067406, 107109797, 107219625, 107348251, 107308710, 107098377, 107019162, 107064474, 107114267, 107120013, 107103693, 107120442, 107122910, 107081282, 107059741, 107064736, 107087457, 107097340, 107087386, 107074189, 107024360, 107004642, 107036722, 107017732, 106982768, 107010806, 107051444, 107043970, 106998086, 106952906, 106929612, 106930077, 106931162, 106928754, 106928289, 106898451, 106855416, 106844425, 106852949, 106850934, 106832707, 106809199, 106768835, 106712234, 106675148, 106672299, 106683433, 106665730, 106605279, 106552529, 106530845, 106512928, 106494582, 106476676, 106456602, 106441605, 106416476, 106377661, 106355214, 106343079, 106324160, 106316912, 106312549, 106288922, 106267297, 106270373, 106284845, 106286228, 106263816, 106230295, 106205356, 106185508, 106163442, 106136346, 106101751, 106076813]
3997.6A06076813
$$ y = [106076813]
##END=$$ End of the data block
