##TITLE=DI 16-0249279-6 emulsao $$ Begin of the data block
##JCAMP-DX=5.00 $$ ACD/SpecManager v 10.08
##SPECTROMETER/DATA SYSTEM=Alpha
##DATE=17 Mar 2016 10:50:26
##DATA TYPE=INFRARED SPECTRUM
##DATA CLASS=XYDATA
##ORIGIN=
##OWNER=
##NPOINTS=1667
##FIRSTX=599.64648438
##LASTX=3997.64306641
##MAXX=3997.64306641
##MINX=599.64648438
##MAXY=1.06909645
##MINY=0.08207416
##XFACTOR=1.0000000000
##YFACTOR=0.000000010000000
##FIRSTY=0.54805058
##DELTAX=2.03961372
##XUNITS=1/CM
##YUNITS=ARBITRARY UNITS
##XYDATA=(X++(Y..Y))
$$ plain form
599.6 54805058 54443401 54052192 53741413 53585744 53574449 53645056 53696799 53657216 53562814 53491259 53482062
622.1 53482062 53545654 53656608 53739715 53710192 53531039 53225052 52837151 52414489 51986527 51544738
642.5 51544738 51092172 50616974 50044578 49307239 48411891 47505766 46838900 46601343 46892458 47682682
662.9 47682682 48727277 50476819 53221506 54973066 55973166 56968683 57845581 58518159 59002054
681.2 59002054 59301633 59426194 59356904 58938187 57874995 55990022 53792268 52226692 51476067
699.6 51476067 51029819 50980973 51871586 53467041 54904693 55756420 56205404 56349498 56033033 55504030
720 55504030 55466920 56141406 57062870 57758403 58003360 57770801 57278228 56912935 56925875 57160544 57171613
742.4 57171613 56756896 56322134 56409955 57075506 58105737 59378850 60871345 62516803 64055765
$$ packed form
599.6E4805058l61657l91209l10779j55669j1295P0607N1743l9583r4402p1555r197
622.1E3482062O3592J10954Q3107k9523j79153l05987l87901m22662m27962m41789
642.5E1544738m52566m75198n72396p37339q95348r06125o66866k37557K91115P90224
662.9D7682682J044595J749542K744687J751560J000100R95517Q76898O72578M83895
681.2E9002054K99579J24561o9290m18717j063192j884973k197754j565576p50625
699.6E1476067m46248m8846Q90613J595455J437652Q51727M48984J44094l16465n29003
720E5504030l7110O74486R21464O95533K44957k32559m92573l65293J2940K34669J1069
742.4E7171613m14717m34762Q7821O65551J030231J273113J492495J645458J538962
$$ plain form
760.8 64055765 65288055 66272867 67101943 67786098 68340492 68744963 68937790 69081092 69539624 70327300
781.2 70327300 71102703 71739811 72371858 73079133 73794591 74420393 74904895 75252777 75487745 75595206
801.6 75595206 75612706 75705999 75967228 76246774 76353461 76245254 75991845 75646156 75218749 74771100
822 74771100 74400514 74111551 73806781 73392361 72834295 72190535 71613085 71258378 71147877 71182245
842.4 71182245 71257591 71289253 71217567 71032065 70750827 70384914 69935608 69408298 68827397 68240589
862.8 68240589 67718267 67311853 67019159 66803640 66622674 66437066 66223884 66047597 65976375 65904057
883.2 65904057 65718979 65542650 65600365 66025108 66831481 67925394 69131082 70277697 71248567 71950632
903.5 71950632 72320104 72361809 72138107 71741772 71263182 70745724 70187098 69571590 68900329 68210024
$$ packed form
760.8F4055765J232290R84812Q29076O84155N54394M04471J92827J43302M58532P87676
781.2G0327300P75403O37108O32047P07275P15458O25802M84502L47882K34968J07461
801.6G5595206J7500R3293K61229K79546J06687j08207k53409l45689m27407m47649
822G4771100l70586k88963l04770m14420n58066o43760n77450l54707j10501L4368
842.4G1182245P5346L1662p1686j85502k81238l65913m49306n27310n80901n86808
862.8F8240589n22322m06414k92694k15519j80966j85608k13182j76287p1222p2318
883.2F5904057j85078j76329N7715M24743Q06373J093913J205688J146615R70870P02065
903.5G1950632L69472M1705k23702l96335m78590n17458n58626o15508o71261o90305
$$ plain form
923.9 68210024 67563093 67023879 66640067 66415286 66292983 66193128 66056240 65834159 65479696 64988035
944.3 64988035 64393103 63725036 63017124 62336195 61794156 61498129 61448652 61497653 61464417 61297506
964.7 61297506 61086088 60939896 60901582 60934561 60935944 60784441 60405278 59758663 58796024 57499254
985.1 57499254 55938625 54246241 52532154 50850612 49211925 47581887 45900664 44155222 42429566
1003.5 42429566 40809813 39295581 37878951 36598706 35474861 34479442 33578992 32759118 32008448
1021.8 32008448 31304711 30618346 29954639 29381293 28923807 28517070 28103763 27689359 27321449 27032784
1042.2 27032784 26829556 26714700 26684058 26722875 26813248 26937068 27071294 27184197 27222455 27108181
1062.6 27108181 26763511 26154906 25320596 24347952 23334503 22376756 21553394 20911452 20496400 20336147
$$ packed form
923.9F8210024o46931n39214l83812k24781j22303r9855j36888k22081l54463m91661
944.3F4988035n94932o68067p07912o80929n42039k96027m9477M9001l3236j66911
964.7F1297506k11418j46192l8314L2979J383j51503l79163o46615r62639j296770
985.1E7499254j560629j692384j714087j681542j638687j630038j681223j745442j725656
1003.5D2429566j619753j514232j416630j280245j123845r95419r00450q19874p50670
1021.8C2008448p03737o86365o63707n73346m57486m06737m13307m14404l67910k88665
1042.2B7032784k03228j14856l0642L8817R0373J23820J34226J12903L8258j14274
1062.6B7108181l44670o08605q34310r72644j013449r57747q23362o41942m15052j60253
$$ plain form
1083 20336147 20397569 20615935 20936096 21303245 21655019 21940592 22142074 22267668 22327904 22326225 22254208
1105.5 22254208 22097436 21845044 21529903 21279243 21297640 21727547 22439115 23058653 23289816 23103213
1125.9 23103213 22604111 21822278 20784882 19800809 19196838 18732272 17842421 16357844 14644058
1144.2 14644058 13216725 12383077 12167310 12475124 13210829 14223962 15302192 16274488 17071347
1162.6 17071347 17700617 18201657 18605626 18935056 19209275 19441111 19647051 19834982 19980405 20034669
1183 20034669 19944635 19652647 19103758 18272457 17194898 15971380 14747840 13676265 12866966 12371584
1203.4 12371584 12161334 12133276 12182160 12266956 12400902 12619683 12948705 13370241 13819979 14221771
1223.8 14221771 14521387 14676027 14669038 14521740 14284852 14025435 13823131 13781348 14007978 14562571
$$ packed form
1083B0336147O1422K18366L20161L67149L51774K85573K01482J25594O0236j679p2017
1105.5B2254208j56772k52392l15141k50660J8397M29907P11568O19538K31163j86603
1125.9B3103213m99102p81833j037396r84073o03971m64566q89851j484577j713786
1144.2A4644058j427333q33648k15767L07814P35705J013133J078230R72296P96859
1162.6A7071347O29270N01040M03969L29430K74219K31836K05940J87931J45423N4264
1183B0034669r0034k91988n48889q31301j077559j223518j223540j071575q09299m95382
1203.4A2371584k10250k8058M8884Q4796J33946K18781L29022M21536M49738M01792
1223.8A4221771K99616J54640o989j47298k36888k59417k02304m1783K26630N54593
$$ plain form
1244.2 14562571 15424554 16534521 17831068 19256893 20757514 22287908 23822923 25345892 26833826
1262.5 26833826 28295267 29766762 31262901 32790661 34328476 35825002 37231296 38490188
1278.8 38490188 39549708 40400782 41080788 41655788 42182511 42688686 43190491 43688989 44178250 44657123
1299.2 44657123 45141050 45644102 46155632 46634844 47010830 47238764 47307357 47218126 47021252 46774745
1319.6 46774745 46480674 46135280 45764872 45441809 45282775 45346504 45536220 45667705 45662430 45559457
1340 45559457 45434377 45408013 45562905 45895132 46412620 47130245 47976568 48712304 49062514 48991179
1360.4 48991179 48559424 47717503 46537158 45255217 44175342 43667620 43864635 44449002 45276880
1378.8 45276880 46351862 47364780 48091549 48659536 49007571 49011967 48960873 49028796 49116683 49294835
$$ packed form
1244.2A4562571Q61983J109967J296547J425825J500621J530394J535015J522969J487934
1262.5B6833826J461441J471495J496139J527760J537815J496526J406294J258892
1278.8C8490188J059520Q51074O80006N75000N26723N06175N01805M98498M89261M78873
1299.2D4657123M83927N03052N11530M79212L75986K27934O8593q9231j96874k46507
1319.6D6774745k94071l45394l70408l23063j59034O3729J89716J31485n275j02973
1340D5559457j25080k6364J54892L32227N17488P17625Q46323P35736L50210p1335
1360.4D8991179m31755q41921j180345j281941j079875n07722J97015N84367Q27878
1378.8D5276880J074982J012918P26769N67987L48035M396n1094O7923Q7887J78152
$$ plain form
1399.2 49294835 49543735 49844131 50292915 50660360 50843459 50947422 50933141 50776899 50689119 50680476
1419.6 50680476 50289005 49584439 48822430 48107219 47477296 46745160 45891184 45273629 44836852 44189999
1440 44189999 43463552 42746598 42091858 41573563 40988505 40110475 39207602 39198455 40127128 40374205
1460.4 40374205 40109810 40012044 40347731 41601914 44781756 50377852 55873823 59651893 62649459
1478.7 62649459 65488458 68246269 70728046 73109919 75601429 77778304 79101527 79989421 81128639
1497.1 81128639 82746887 84540522 86088061 87547737 89025313 89754909 90089482 90485251 90955734
1515.4 90955734 91437167 91868532 92307413 92613822 92767876 92913902 93017048 93169206 93394810 93525261
1535.8 93525261 93693829 94097364 94333351 94319266 94335163 94417351 94585693 94812340 95072299 95383316
$$ packed form
1399.2D9294835K48900L00396M48784L67445J83099J03963j4281j56242q7780q643
1419.6E0680476l91471p04566p62009p15211o29923p32136q53976o17555m36777o46853
1440D4189999p26447p16954o54740n18295n85058q78030r02873r147R28673K47077
1460.4D0374205k64395r7766L35687J254183L179842N596096N495971L778070K997566
1478.7F2649459K838999K757811K481777K381873K491510K176875J323223Q87894J139218
1497.1H1128639J618248J793635J547539J459676J477576P29596L34573L95769M70483
1515.4I0955734M81433M31365M38881L06409J54054J46026J03146J52158K25604J30451
1535.8I3525261J68568M03535K35987j4085J5897Q2188J68342K26647K59959L11017
$$ plain form
1556.2 95383316 95867836 96167594 96113569 96116740 96231997 96403211 96544117 96591264 96679711 96791750 96733022
1578.7 96733022 96607763 96471602 96309781 96211565 96255988 96360683 96400249 96339220 96200663 96030825
1599.1 96030825 95832080 95590985 95307571 95029277 94805688 94653529 94550717 94471997 94294423 93972147
1619.5 93972147 93668479 93389022 93079931 92754871 92416620 92090720 91870564 91693860 91348714 90933007
1639.9 90933007 90571082 90301746 90120012 89844793 89471674 89271981 89043629 88516480 88008910 87646514
1660.3 87646514 87400031 87135148 86861044 86743134 86718762 86585796 86485839 86388320 86162347 85921514
1680.7 85921514 85850674 85866523 85583055 85200417 84874541 84579766 84337461 84030092 83458179 82427007
1701.1 82427007 80928713 78961962 76298481 73033631 69213682 64778435 59551448 53031868
$$ packed form
1556.2I5383316M84520K99758n4025L171J15257J71214J40906M7147Q8447J12039n8728
1578.7I6733022j25259j36161j61821r8216M4423J04695L9566o1029j38557j69838
1599.1I6030825j98745k41095k83414k78294k23589j52159j02812p8720j77574l22276
1619.5I3972147l03668k79457l09091l25060l38251l25900k20156j76704l45146m15707
1639.9I0933007l61925k69336j81734k75219l73119j99693k28352n27149n07570l62396
1660.3H7646514k46483k64883k74104j17910k4372j32966r9957r7519k25973k40833
1680.7H5921514p0840J5849k83468l82638l25876k94775k42305l07369n71913j031172
1701.1H2427007j498294j966751k663481l264850l819949m435247n226987o519580
$$ plain form
1717.4 53031868 46059027 39891508 34217626 29137069 25110665 22075282 20103081 19521078 19772245
1735.7 19772245 20316437 22134982 25333768 29445940 34632352 41092655 49115762 57409173 64093935
1754.1 64093935 69804806 74839640 78638750 81648082 83759999 85165673 86382592 87531108
1770.4 87531108 88687724 89661545 90451813 91341472 92411637 93508136 94593197 95597345 96453953
1788.8 96453953 97264057 98018426 98519826 98860586 99177992 99447334 99660558 99838305 100025165 100215769
1809.2 100215769 100395203 100543809 100685036 100831592 100977349 101118445 101257408 101399016 101522684 101634932
1829.6 101634932 101697099 101734161 101793611 101879692 101972306 102076316 102186346 102242649 102259362 102276719 102304542
1852 102304542 102330685 102357304 102383542 102412403 102433181 102447510 102473164 102489948 102466404 102434433 102438354 102456880
$$ packed form
1717.4E3031868o972841o167519n673882n080557m026404l035383j972201n82003K51167
1735.7A9772245N44192J818545L198786M112172N186412O460303Q023107Q293411O684762
1754.1F4093935N710871N034834L799110L009332K111917J405674J216919J148516
1770.4H7531108J156616R73821P90268Q89659J070165J096499J085061J004148Q56608
1788.8I6453953Q10104P54369N01400L40760L17406K69342K13224J77747J86860J90604
1809.2A00215769J79434J48606J41227J46556J45757J41096J38963J41608J23668J12248
1829.6A01634932O2167L7062N9450Q6081R2614J04010J10030N6303J6713J7357K7823
1852A02304542K6143K6619K6238K8861K0778J4329K5654J6784k3544l1971L921J8526
$$ plain form
1876.5 102456880 102476501 102495682 102517033 102541089 102574944 102616107 102644730 102664018 102682447 102700722 102712822
1898.9 102712822 102725434 102738285 102757108 102777219 102784896 102784586 102790570 102812886 102832353 102820039 102786040 102755868
1923.4 102755868 102726722 102703965 102683067 102656269 102631581 102609694 102585816 102552354 102502751 102444434 102393007
1945.8 102393007 102345324 102310622 102296448 102289319 102281058 102277708 102280259 102286255 102297270 102304709 102310061 102319503 102329516
1972.3 102329516 102334535 102340043 102346122 102348566 102354431 102364457 102372575 102378595 102390635 102406311 102421510 102438724 102457011
1998.8 102457011 102474928 102489090 102495527 102495313 102491391 102484334 102475131 102459955 102440524 102430212 102434754 102442157 102441144
2025.4 102441144 102438438 102440870 102445114 102449119 102455723 102462924 102463841 102462482 102466547 102470648 102464652 102456450 102456605 102456701 102449143
2056 102449143 102439547 102432358 102427161 102428663 102434552 102437937 102436769 102431595 102428269 102430570 102441442 102461207 102477443 102482009
$$ packed form
1876.5A02456880J9621J9181K1351K4056L3855M1163K8623J9288J8429J8275J2100
1898.9A02712822J2612J2851J8823K0111P677l10N984K2316J9467j2314l3999l0172
1923.4A02755868k9146k2757k0898k6798k4688k1887k3878l3462m9603n8317n1427
1945.8A02393007m7683l4702j4174p129q261l350K551N996J1015P439N352R442J0013
1972.3A02329516N019N508O079K444N865J0026Q118O020J2040J5676J5199J7214J8287
1998.8A02457011J7917J4162O437k14l922p057r203j5176j9431j0312M542P403j013
2025.4A02441144k706K432M244M005O604P201R17j359M065M101n996q202J55R6p558
2056A02449143r596p189n197J502N889L385j168n174l326K301J0872J9765J6236M566
$$ plain form
2084.5 102482009 102483845 102488959 102498507 102508748 102515352 102520823 102529836 102540803 102545273 102548730 102556455 102561069 102561975 102565730
2113.1 102565730 102568102 102567983 102570808 102575016 102580941 102585208 102585649 102586830 102590501 102597070 102608669 102615952 102610958 102603245
2141.6 102603245 102601147 102596688 102584565 102578378 102582860 102590728 102598524 102605832 102609944 102614665 102623463 102633822 102647042
2168.1 102647042 102658617 102663004 102658713 102653861 102659464 102674937 102691007 102701890 102708399 102718580 102738059 102756715
2192.6 102756715 102772248 102788472 102802444 102812910 102819967 102823985 102830780 102845562 102864671 102884650 102908731 102935636
2217.1 102935636 102958405 102978516 102996349 103012395 103028846 103043222 103054440 103062034 103066802 103067720 103062260 103055263 103058243
2243.6 103058243 103065872 103063130 103051996 103037703 103018200 102995193 102977061 102965117 102954364 102940881 102922332 102906013
2268.1 102906013 102891231 102863228 102824533 102788794 102754819 102713668 102665722 102612507 102548039 102477837 102409005
$$ packed form
2084.5A02482009J836N114R548J0241O604N471R013J0967M470L457P725M614R06L755
2113.1A02565730K372j19K825M208N925M267M41J181L671O569J1599P283m994p713
2141.6A02603245k098m459j2123o187M482P868P796P308M112M721Q798J0359J3220
2168.1A02647042J1575M387m291m852N603J5473J6070J0883O509J0181J9479J8656
2192.6A02756715J5533J6224J3972J0466P057M018O795J4782J9109J9979K4081K6905
2217.1A02935636K2769K0111J7833J6046J6451J4376J1218P594M768R18n460o997K980
2243.6A03058243P629k742j1134j4293j9503k3007j8132j1944j0753j3483j8549j6319
2268.1A02906013j4782k8003l8695l5739l3975m1151m7946n3215o4468p0202o8832
$$ plain form
2290.5 102409005 102335286 102257693 102178311 102097714 102024186 101949644 101852071 101736414 101630712 101543581 101470268
2312.9 101470268 101410568 101347136 101267517 101203418 101173663 101150417 101114178 101073921 101055956 101057577 101044548 100999439
2337.4 100999439 100930250 100865483 100815988 100764775 100703800 100640965 100620282 100682986 100746906 100734019 100708020
2359.9 100708020 100706089 100687933 100656438 100639939 100617123 100579441 100559664 100574744 100609457 100665939 100745070 100812697
2384.3 100812697 100844133 100844741 100828612 100808692 100785649 100749326 100702679 100659239 100620294 100575852 100523198 100467634
2408.8 100467634 100413549 100360143 100306416 100257778 100215280 100173020 100127220 100080383 100032628 99980551 99925709
2431.2 99925709 99874294 99829316 99782556 99729598 99676347 99621409 99561256 99503452 99451715 99400181 99345946 99290782
2455.7 99290782 99236101 99181145 99128866 99078000 99017948 98949641 98887128 98834223 98783779 98731977 98672938 98606080
$$ packed form
2290.5A02409005p3719p7593p9382q0597p3528p4542r7573j15657j05702q7131p3313
2312.9A01470268n9700o3432p9619o4099k9755k3246l6239m0257j7965J621j3029m5109
2337.4A00999439o9189o4767m9495n1213o0975o2835k0683O2704O3920j2887k5999
2359.9A00708020j931j8156l1495j6499k2816l7682j9777J5080L4713N6482P9131O7627
2384.3A00812697L1436O08j6129j9920k3043l6323m6647m3440l8945m4442n2654n5564
2408.8A00467634n4085n3406n3727m8638m2498m2260m5800m6837m7755n2077n4842
2431.2I9925709n1415m4978m6760n2958n3251n4938o0153n7804n1737n1534n4235n5164
2455.7I9290782n4681n4956n2279n0866o0052o8307o2513n2905n0444n1802n9039o6858
$$ plain form
2480.2 98606080 98545623 98495317 98444694 98389798 98335266 98282200 98227382 98168272 98106867 98046601 97981268 97908109
2504.7 97908109 97828931 97743809 97658920 97578180 97500461 97422421 97339362 97256517 97183722 97118020 97050959 96981341
2529.1 96981341 96920794 96876007 96833330 96785980 96740866 96691632 96635222 96588147 96542937 96480232 96414411 96357965
2553.6 96357965 96298832 96233922 96173561 96112520 96032840 95936430 95839614 95744616 95639980 95521796 95401460
2576 95401460 95282990 95161563 95043504 94927633 94798696 94664156 94540113 94412386 94271016 94131762
2596.4 94131762 93996972 93858147 93719351 93575978 93419254 93256772 93097621 92941970 92780453 92616516
2616.8 92616516 92467570 92323130 92162639 91989505 91816580 91651362 91492957 91337734 91181940 91031957
2637.2 91031957 90897405 90771049 90648919 90532589 90410817 90276837 90134752 89990312 89848721 89704561
$$ packed form
2480.2I8606080o0457n0306n0623n4896n4532n3066n4818n9110o1405o0266o5333p3159
2504.7I7908109p9178q5122q4889q0740p7719p8040q3059q2845p2795o5702o7061o9618
2529.1I6981341o0547m4787m2677m7350m5114m9234n6410m7075m5210o2705o5821n6446
2553.6I6357965n9133o4910o0361o1041p9680r6410r6816r4998j04636j18184j20336
2576I5401460j18470j21427j18059j15871j28937j34540j24043j27727j41370j39254
2596.4I4131762j34790j38825j38796j43373j56724j62482j59151j55651j61517j63937
2616.8I2616516j48946j44440j60491j73134j72925j65218j58405j55223j55794j49983
2637.2I1031957j34552j26356j22130j16330j21772j33980j42085j44440j41591j44160
$$ plain form
2657.6 89704561 89556587 89411783 89270949 89137030 89001715 88847685 88683444 88532746 88401717 88288766
2678 88288766 88202786 88147277 88098395 88034660 87963939 87896252 87834078 87774396 87705529 87622935 87531334 87427562
2702.5 87427562 87309361 87175620 87018073 86841518 86660957 86475962 86277825 86062801 85835701 85607868
2722.9 85607868 85378301 85172254 85017174 84873497 84717661 84565610 84427476 84311223 84202176 84073287
2743.3 84073287 83900654 83699369 83527899 83395314 83252293 83078325 82898426 82717073 82511979 82281911
2763.7 82281911 82040268 81785405 81505024 81182480 80822968 80478626 80155271 79789144 79360902 78894424
2784.1 78894424 78385568 77838564 77298808 76777065 76219803 75585872 74912357 74235100 73495883 72645849
2804.5 72645849 71714360 70743811 69796556 68914568 68055820 67181242 66281104 65325516 64280730 63127840
$$ packed form
2657.6H9704561j47974j44804j40834j33919j35315j54030j64241j50698j31029j12951
2678H8288766q5980n5509m8882o3735p0721o7687o2174n9682o8867q2594r1601j03772
2702.5H7427562j18201j33741j57547j76555j80561j84995j98137k15024k27100k27833
2722.9H5607868k29567k06047j55080j43677j55836j52051j38134j16253j09047j28889
2743.3H4073287j72633k01285j71470j32585j43021j73968j79899j81353k05094k30068
2763.7H2281911k41643k54863k80381l22544l59512l44342l23355l66127m28242m66478
2784.1G8894424n08856n47004n39756n21743n57262o33931o73515o77257p39217q50034
2804.5G2645849r31489r70549r47255q81988q58748q74578r00138r55588j044786j152890
$$ plain form
2824.9 63127840 61848295 60409951 58753282 56780899 54358894 51314521 47462511 42629802
2841.2 42629802 36790675 30346501 24229029 19545750 16910593 16161540 16773157 18311247 20449123
2859.5 20449123 22840618 25100189 26891184 28054580 28663239 28969461 29244378 29577434 29857683
2877.9 29857683 29939839 29750925 29285729 28581694 27700767 26721302 25713450 24719279 23760055 22825231
2898.3 22825231 21875358 20867190 19755392 18485212 16993909 15256582 13361968 11532456 10029436
2916.7 10029436 8998688 8420502 8207416 8290496 8631802 9193490 9938248 10882919 12071650 13511260
2937 13511260 15173660 17004640 18877159 20602180 22016022 23041013 23709868 24149784 24551208
2955.4 24551208 25095809 25866085 26845151 27978492 29246107 30676281 32302493 34144875 36169040
$$ packed form
2824.9F3127840j279545j438344j656669j972383k422005l044373l852010m832709
2841.2D2629802n839127o444174o117472m683279k635157p49053O11617J538090K137876
2859.5B0449123K391495K259571J790995J163396O08659L06222K74917L33056K80249
2877.9B9857683Q2156j88914m65196p04035q80927r79465j007852r94171r59224r34824
2898.3B2825231r49873j008168j111798j270180j491303j737327j894614j829512j503020
2916.7A0029436j030748n78186k13086Q3080L41306N61688P44758R44671J188731J439610
2937A3511260J662400J830980J872519J725021J413842J024991O68855M39916M01424
2955.4B4551208N44601P70276R79066J133341J267615J430174J626212J842382K024165
$$ plain form
2973.8 36169040 38291508 40472636 42699990 44948646 47223544 49530253 51833081 54071212
2990.1 54071212 56176621 58099264 59805155 61275178 62520647 63563919 64426684 65135586 65722966
3008.4 65722966 66221505 66644126 66978860 67209357 67335480 67365313 67280382 67067063 66749692 66372603
3028.8 66372603 66015035 65753233 65607053 65571952 65621364 65676844 65666550 65586275 65450513 65251499 64992082
3051.3 64992082 64689827 64345801 63943571 63487297 63025457 62609029 62256819 61968923 61732769 61524248
3071.7 61524248 61310136 61070746 60794413 60458189 60071552 59653074 59195799 58722341 58275080 57863969
3092.1 57863969 57488936 57149631 56814975 56435043 55991864 55532116 55088013 54621571 54107296 53596270
3112.4 53596270 53141695 52702171 52221715 51691109 51119655 50543076 49995914 49462390 48899257 48313436
$$ packed form
2973.8C6169040K122468K181128K227354K248656K274898K306709K302828K238131
2990.1E4071212K105409J922643J705891J470023J245469J043272Q62765P08902N87380
3008.4F5722966M98539M22621L34734K30497J26123K9833q4931k13319l17371l77089
3028.8F6372603l57568k61802j46180l5101M9412N5480j0294q0275j35762j99014k59417
3051.3F4992082l02255l44026m02230m56274m61840m16428l52210k87896k36154k08521
3071.7F1524248k14112k39390k76333l36224l86637m18478m57275m73458m47261m11111
3092.1E7863969l75033l39305l34656l79932m43179m59748m44103m66442n14275n11026
3112.4E3596270m54575m39524m80456n30606n71454n76579n47162n33524n63133n85821
$$ plain form
3132.8 48313436 47748226 47223216 46704209 46126753 45499116 44881213 44295946 43757454 43250033 42697704
3153.2 42697704 42076913 41435689 40809470 40216485 39653718 39095351 38530809 37983841 37456247 36913070
3173.6 36913070 36363879 35841608 35325339 34792602 34266207 33756790 33265311 32791984 32319358 31845760
3194 31845760 31389078 30952030 30519894 30095983 29688299 29284805 28878951 28478068 28091037 27719900
3214.4 27719900 27356246 26995596 26633987 26269779 25915879 25578985 25269583 25025439 24805324 24478249
3234.8 24478249 24060145 23674411 23355392 23105016 22910504 22678895 22342895 21991426 21733750 21528703
3255.2 21528703 21275213 20983028 20716129 20483571 20284504 20153986 20083550 19941966 19677912 19380854
3275.6 19380854 19099958 18857877 18659811 18482587 18321638 18192588 18131141 18098173 17989482 17793980
$$ packed form
3132.8D8313436n65210n25010n19007n77456o27637o17903n85267n38492n07421n52329
3153.2D2697704o20791o41224o26219n92985n62767n58367n64542n46968n27594n43177
3173.6C6913070n49191n22271n16269n32737n26395n09417m91479m73327m72626m73598
3194C1845760m56682m37048m32136m23911m07684m03494m05854m00883l87031l71137
3214.4B7719900l63654l60650l61609l64208l53900l36894l09402k44144k20115l27075
3234.8B4478249m18104l85734l19019k50376j94512k31609l36000l51469k57676k05047
3255.2B1528703k53490k92185k66899k32558j99067j30518p0436j41584k64054k97058
3275.6A9380854k80896k42081j98066j77224j60949j29050o1447l2968j08691j95502
$$ plain form
3296 17793980 17554706 17342775 17265129 17306349 17307146 17146142 16850306 16559123 16372420 16256502 16150014
3318.4 16150014 16050524 16000652 15991035 15914483 15754339 15616195 15540195 15538175 15603940 15615629 15527356 15423480
3342.9 15423480 15322906 15263450 15307231 15330876 15222569 15092863 15057297 15096731 15125826 15142828 15255383
3365.4 15255383 15427601 15476370 15353552 15217687 15198025 15242538 15279521 15294299 15307476 15358399 15483509
3387.8 15483509 15695813 15880908 15916102 15925075 16090378 16321179 16409431 16372883 16406570 16560274 16736320
3410.2 16736320 16886601 16999629 17089519 17234232 17450075 17657177 17851506 18091117 18367672 18634203
3430.6 18634203 18890159 19148299 19392066 19619375 19869810 20154561 20488475 20894293 21266513 21562766
3451 21562766 21878497 22241090 22609764 22979093 23380367 23794061 24181005 24573509 25026861 25545365
$$ packed form
3296A7793980k39274k11931p7646M1220P97j61004k95836k91183j86703j15918j06488
3318.4A6150014r9490m9872r617p6552j60144j38144p6000k020O5765J1689q8273j03876
3342.9A5423480j00574n9456M3781K3645j08307j29706l5566L9434K9095J7002J12555
3365.4A5255383J72218M8769j22818j35865j9662M4513L6983J4778J3177N0923J25110
3387.8A5483509K12304J85095L5194Q973J65303K30801Q8252l6548L3687J53704J76046
3410.2A6736320J50281J13028Q9890J44713K15843K07102J94329K39611K76555K66531
3430.6A8634203K55956K58140K43767K27309K50435K84751L33914M05818L72220K96253
3451B1562766L15731L62593L68674L69329M01274M13694L86944L92504M53352N18504
$$ plain form
3471.4 25545365 26086068 26591295 27041891 27525964 28133717 28756127 29315165 29897538 30508831 31105992
3491.8 31105992 31717548 32373607 33027601 33683449 34440610 35246521 35968444 36715323 37573281 38434061
3512.2 38434061 39252597 40065995 40903091 41789919 42773014 43795508 44812956 45869887 46899217
3530.6 46899217 47868139 48901722 50029737 51116395 52141362 53228873 54468173 55728650 56834996
3548.9 56834996 57941097 59170491 60351557 61454952 62605017 63744557 64790261 66002274
3565.2 66002274 67582166 68997741 70028150 71059203 72206086 73363113 74500114 75577718
3581.5 75577718 76564586 77665150 79023087 80237442 81176424 82200289 83328354 84368509 85372555
3599.9 85372555 86370057 87287772 88210869 89249790 90249443 91112000 91894132 92616248 93392068 94151372
$$ packed form
3471.4B5545365N40703N05227M50596M84073O07753O22410N59038N82373O11293N97161
3491.8C1105992O11556O56059O53994O55848P57161Q05911P21923P46879Q57958Q60780
3512.2C8434061Q18536Q13398Q37096Q86828R83095J022494J017448J056931J029330
3530.6D6899217R68922J033583J128015J086658J024967J087511J239300J260477J106346
3548.9E6834996J106101J229394J181066J103395J150065J139540J045704J212013
3565.2F6002274J579892J415575J030409J031053J146883J157027J137001J077604
3581.5G5577718R86868J100564J357937J214355R38982J023865J128065J040155J004046
3599.9H5372555R97502R17715R23097J038921R99653Q62557P82132P22116P75820P59304
$$ plain form
3620.3 94151372 94702321 95163757 95742524 96535355 97217745 97624129 98029065 98479027 98919314 99348998
3640.7 99348998 99751931 100150084 100598681 101051915 101375592 101623821 101889658 102150714 102378166 102627599
3661.1 102627599 102911282 103201735 103516817 103846002 104110134 104321527 104503620 104592264 104643035 104727232
3681.5 104727232 104869080 105054736 105218184 105319381 105390060 105448401 105512702 105618882 105751324 105845964
3701.9 105845964 105904257 106009209 106178153 106310320 106294036 106231487 106239688 106290233 106334198 106341505 106331050
3724.3 106331050 106339419 106392241 106487501 106563735 106530845 106424475 106423581 106584370 106765687 106808734 106830239
3746.7 106830239 106909645 106863606 106687915 106609726 106633627 106628978 106583846 106574929 106599021 106630445 106626964 106563306
3771.2 106563306 106518269 106532025 106550121 106523597 106489766 106476057 106449425 106417871 106405711 106429362 106489706
$$ packed form
3620.3I4151372N50949M61436N78767P92831O82390M06384M04936M49962M40287M29684
3640.7I9348998M02933L98153M48597M53234L23677K48229K65837K61056K27452K49433
3661.1A02627599K83683K90453L15082L29185K64132K11393J82093Q8644N0771Q4197
3681.5A04727232J41848J85656J63448J01197P0679N8341O4301J06180J32442R4640
3701.9A05845964N8293J04952J68944J32167j6284o2549Q201N0545M3965P307j0455
3724.3A06331050Q369N2822R5260P6234l2890j06370q94J60789J81317M3047K1505
3746.7A06830239P9406m6039j75691p8189K3901m649m5132q917K4092L1424l481o3658
3771.2A06563306m5037J3756J8096k6524l3831j3709k6632l1554j2160K3651O0344
$$ plain form
3793.7 106489706 106540215 106583965 106630659 106616879 106596029 106561542 106435990 106354773 106405056 106498182 106541383
3816.1 106541383 106565440 106544721 106436980 106379354 106385553 106405449 106441259 106467581 106469977 106468427 106469142 106443048
3840.6 106443048 106360435 106273079 106281221 106415451 106619620 106689453 106473160 106294990 106288552 106351781 106381750
3863 106381750 106368971 106379247 106378615 106322896 106249654 106177199 106150806 106154597 106139088 106112337 106054044 106021142
3887.5 106021142 106046903 106021547 105951083 105941617 105976748 105994391 105965495 105873489 105762959 105700946 105674231
3909.9 105674231 105663860 105669153 105667663 105640733 105594003 105549824 105504513 105458283 105423474 105366337 105283868 105234814
3934.4 105234814 105231214 105235898 105218101 105174935 105131960 105086792 105027604 104987800 104975665 104955995 104915404 104862535
3958.9 104862535 104809201 104767168 104736078 104711282 104685891 104650283 104595435 104524767 104457831 104409027 104374838
$$ packed form
3793.7A06489706N0509M3750M6694j3780k0850l4487j25552q1217N0283R3126M3201
3816.1A06541383K4057k0719j07741n7626O199J9896L5810K6322K396j550P15k6094
3840.6A06443048q2613q7356Q142J34230K04169O9833k16293j78170o438O3229K9969
3863A06381750j2779J0276o32n5719p3242p2455k6393L791j5509k6751n8293l2902
3887.5A06021142K5761k5356p0464r466L5131J7643k8896r2006j10530o2013k6715
3909.9A05674231j0371N293j490k6930m6730m4179m5311m6230l4809n7137q2469m9054
3934.4A05234814l600M684j7797m3166m2975m5168n9188l9804j2135j9670m0591n2869
3958.9A04862535n3334m2033l1090k4796k5391l5608n4848p0668o6936m8804l4189
$$ plain form
3981.3 104374838 104337561 104301751 104274726 104251540 104235280 104209387 104165125 104131150
3997.6 104131150
$$ packed form
3981.3A04374838l7277l5810k7025k3186j6260k5893m4262l3975
3997.6A04131150
##END=$$ End of the data block
