##TITLE=DI 16-0053799-7 Savix -  Cloreto de Benzalconio $$ Begin of the data block
##JCAMP-DX=5.00 $$ ACD/SpecManager v 10.08
##SPECTROMETER/DATA SYSTEM=Alpha
##DATE=15 Jan 2016 10:27:10
##DATA TYPE=INFRARED SPECTRUM
##DATA CLASS=XYDATA
##ORIGIN=
##OWNER=
##NPOINTS=1667
##FIRSTX=599.64648438
##LASTX=3997.64306641
##MAXX=3997.64306641
##MINX=599.64648438
##MAXY=1.11997736
##MINY=0.54607421
##XFACTOR=1.0000000000
##YFACTOR=0.000000010000000
##FIRSTY=1.00780094
##DELTAX=2.03961372
##XUNITS=1/CM
##YUNITS=ARBITRARY UNITS
##XYDATA=(X++(Y..Y))
599.6A00780094q583m0472l6669n2845o5863k8885N2417J28805J86932K08569J72222
$$ 100780094 100771511 100731039 100694370 100641525 100575662 100546777 100599194 100727999 100914931 101123500 101295722
622.1A01295722J04582L9768K5451O0153J09983J51336J44613Q9597O2168P3195Q0418
$$ 101295722 101400304 101440072 101465523 101525676 101635659 101786995 101931608 102021205 102083373 102156568 102236986
644.5A02236986R1994J02305R3139P7140Q0502R9933J00827R2399R6441M9829K027
$$ 102236986 102328980 102431285 102524424 102601564 102682066 102781999 102882826 102975225 103071666 103121495 103123522
667A03123522R1982J28162P0393O6626J18458J67370J46139J03545R2494O6197R871
$$ 103123522 103215504 103343666 103414059 103480685 103599143 103766513 103912652 104016197 104108691 104174888 104184759
689.4A04184759q8418l22962q74936j915956l071677l197301j581710Q61501K460242
$$ 104184759 104096341 103773379 102898443 100982487 97910810 94713509 93131799 93993300 96453542
707.7I6453542K523529J586527M57513m62031j158178j587677j592005j267445q46231
$$ 96453542 98977071 100563598 101021111 100559080 99400902 97813225 96221220 94953775 94107544
726.1I4107544l42571J90991O45006J079976J501387J739830J693398J449692J150394
$$ 94107544 93764973 93955964 94600970 95680946 97182333 98922163 100615561 102065253 103215647
744.5A03215647Q73363O58834M91178L57353K85638K36893J94942J88089J85323J43146
$$ 103215647 104089010 104747844 105239022 105596375 105882013 106118906 106313848 106501937 106687260 106830406
764.9A06830406N8198l0541j20008k39170l47125l93010l20446p1108K78544N60415
$$ 106830406 106888604 106858063 106738055 106498885 106151760 105758750 105438304 105367196 105645740 106206155
785.3A06206155O89673P09081O66308N68152M40502L10862K09713J66559J55688J34873
$$ 106206155 106895828 107604909 108271217 108839369 109279871 109590733 109800446 109967005 110122693 110257566
805.6A10257566J06716Q7273P2277N7685N3156M3082J7238M315K968l087M601M1747
$$ 110257566 110364282 110451555 110523832 110581517 110634673 110677755 110694993 110699308 110702276 110699189 110703790 110745537
830.1A10745537P7474P4518N4133N3597O9785P2908M6909L028m4537q3232j22106j75428
$$ 110745537 110823011 110897529 110951662 111005259 111075044 111147952 111194861 111197889 111153352 111070120 110948014 110772586
854.6A10772586k45679l37565m39190n51117o47342o54531n64146m20284k55108j09255
$$ 110772586 110526907 110189342 109750152 109199035 108551693 107897162 107333016 106912732 106657624 106548369
875A06548369j9503L1019P4112R7251R3865Q2863P0822Q0597J33038J90580K22134
$$ 106548369 106528866 106559885 106633997 106731248 106825113 106907976 106978798 107059395 107192433 107383013 107605147
897.4A07605147K39301K47824K45130K30110K09594J94144J74987J43850R6321L2378
$$ 107605147 107844448 108092272 108337402 108567512 108777106 108971250 109146237 109290087 109386408 109418786
917.8A09418786l6455r0837r2268m4429K3746J20068K28488L12078L65901L88849L73280
$$ 109418786 109382331 109291494 109199226 109154797 109178543 109298611 109527099 109839177 110205078 110593927 110967207
940.3A10967207L33726K72179J90270J23584P9191L1579j0181k1744k4235m5741o8175
$$ 110967207 111300933 111573112 111763382 111886966 111966157 111997736 111987555 111965811 111941576 111895835 111827660
962.7A11827660q8096j23048j41454j40738j56713j67501j61028j50060j11604m8900
$$ 111827660 111739564 111616516 111475062 111334324 111177611 111010110 110849082 110699022 110587418 110538518
983.1A10538518q213k956l0685r0480j56510j99055j99259j68466j18268l171J72484
$$ 110538518 110530305 110527349 110496664 110406184 110249674 110050619 109851360 109682894 109564626 109561455 109733939
1005.5A09733939K86985K82478K31087J94466J76168J58596J23346O7961n770j15919
$$ 109733939 110020924 110303402 110534489 110728955 110905123 111063719 111187065 111255026 111249256 111133337
1025.9A11133337k40219k57730p9906J80411L01528K26605R8109K6131L374l577l051
$$ 111133337 110893118 110635388 110555482 110735893 111037421 111264026 111362135 111388266 111391640 111388063 111385012
1048.4A11385012j228q822q452j812j0836j5640m77J5044J5331N007j0312l7468p7641
$$ 111385012 111383784 111374962 111366510 111364698 111353862 111338222 111337745 111352789 111368120 111373127 111362815 111325347 111247706
1074.9A11247706j38068k29215k82288j87314K9481K11668K65896K23136J47724Q5700
$$ 111247706 111109638 110880423 110598135 110410821 110440302 110651970 110917866 111141002 111288726 111374426
1095.3A11374426M7350K2960R799n436l4178o3598p7033p4685o8640p0036o7079n2511
$$ 111374426 111421776 111444736 111454535 111449099 111414921 111351323 111274290 111199605 111130965 111060929 110993850 110941339
1119.8A10941339n2155o0617m1616Q58K6965K4259J8358J3328p248l7360n9414o8760
$$ 110941339 110889184 110828567 110786951 110787809 110814774 110839033 110857391 110870719 110863471 110826111 110766697 110697937
1144.2A10697937p1728p5913q0776q2707r4676j09446p3445Q750N5814M0483O890j1372
$$ 110697937 110626209 110550296 110469520 110386813 110292137 110182691 110109246 110117996 110173810 110214293 110221183 110209811
1168.7A10209811k0290k3663j9693k6786m6909p4280j05905j12033p3206j5533J9419
$$ 110209811 110189521 110165858 110146165 110119379 110072470 109998190 109892285 109780252 109707046 109691513 109710932
1191.1A09710932K2948R262j8382n2166p9966j12593j70946k59566l88432n74588p39575
$$ 109710932 109733880 109743142 109724760 109672594 109592628 109480035 109309089 109049523 108661091 108086503 107346928
1213.6A07346928o63113k28942L31223O60312O55997M73654K84887J59108R0921N4467
$$ 107346928 106683815 106454873 106786096 107446408 108102405 108576059 108860946 109020054 109110975 109165442
1234A09165442L6395L2603L2807K5856J3530l254k1863l3247m1175n0378n0473m4573
$$ 109165442 109201837 109234440 109267247 109293103 109306633 109303379 109281516 109248269 109207094 109156716 109106243 109061670
1258.4A09061670n1164n1225k9230j3494j5891l3748o1524p3528o4385n7936o0200
$$ 109061670 109010506 108959281 108930051 108916557 108900666 108866918 108805394 108731866 108667481 108609545 108549345
1280.9A08549345o0750m8613l0983l6048o4576r4986j18005j27745j22201j09184q9789
$$ 108549345 108488595 108439982 108408999 108372951 108308375 108213389 108095384 107967639 107845438 107736254 107646465
1303.3A07646465n9986k6274Q4J5163J8144J9300K6226J7130M757J2755J0753k2447
$$ 107646465 107586479 107560205 107560289 107575452 107593596 107612896 107639122 107656252 107661009 107673764 107684517 107662070
1327.8A07662070p5782j25479j35470p7712k5213q6915j55485j11163n9151p1669j03080
$$ 107662070 107586288 107460809 107325339 107247627 107222414 107135499 106980014 106868851 106809700 106738031 106634951
1350.2A06634951r3115n6004m2558q297L1436r7263l15404l25263k41148j97864k47347
$$ 106634951 106541836 106485832 106443274 106434977 106466413 106369150 106053746 105728483 105487335 105289471 105042124
1372.7A05042124m98259n66924j69551K60794L89349L44074K24447L5012K1565J58954
$$ 105042124 104543865 103976941 103807390 104068184 104457533 104801607 105026054 105061066 105082631 105241585
1393.1A05241585J56832J8191n5254k5093P6270K3568j78814k95329m03166m58515
$$ 105241585 105398417 105416608 105361354 105336261 105412531 105436099 105257285 104961956 104558790 104100275
1413.5A04100275k80964J3339J46413J95766K68304J56391m1962k85161n44846n68938
$$ 104100275 103819311 103832650 103979063 104174829 104443133 104599524 104557562 104272401 103727555 103158617
1433.9A03158617o97601j038766r28640o75500n75941o49751j075160j620877j802629
$$ 103158617 102461016 101422250 100493610 99818110 99242169 98592418 97517258 95896381 94093752
1452.2I4093752j446796p24136p1764Q9210o259m22090o59567R0152J237053J820862
$$ 94093752 92646956 91922820 91851056 91940266 91934007 91511917 90852350 90942502 92179555 94000417
1472.6I4000417R25076j70690n32704n72473m35418L9190Q12620J597899J767594J326084
$$ 94000417 94925493 94754803 94222099 93649626 93214208 93253398 94066018 95663917 97431511 98757595
1493I8757595J118892J137126J088774J037097J038051J210761Q54349k19834l36158
$$ 98757595 99876487 101013613 102102387 103139484 104177535 105388296 106242645 106022811 105686653
1511.4A05686653k2781K31290K53939J78337O5351j83404k25222k08485j39356Q2326
$$ 105686653 105663872 105895162 106149101 106327438 106392789 106209385 105984163 105775678 105636322 105718648
1531.8A05718648O9440k8336L09920N33068j31237n48232m63009k08354j7535K9933
$$ 105718648 105788088 105759752 106069672 106602740 106471503 105923271 105460262 105251908 105234373 105264306
1552.2A05264306J47283L93939L93045n23841o63543k52020j4651P9751r2364j65355
$$ 105264306 105411589 105805528 106198573 105674732 105011189 104759169 104744518 104824269 104731905 104566550
1572.6A04566550M8924m1044l74901l72339k89774j91104j7488Q8859M5287m3320j14561
$$ 104566550 104615474 104574430 104199529 103827190 103537416 103346312 103328824 103417683 103462970 103419650 103305089
1595A03305089j71411j85990j90139k19810k13039j78766k36845l13282k30980j55580
$$ 103305089 103133678 102947688 102757549 102537739 102324700 102145934 101909089 101595807 101364827 101209247
1615.4A01209247l93379m87041k57981k09653k97851k70193k16616m0662K69157K84606
$$ 101209247 100815868 100328827 100070846 99861193 99563342 99293149 99076533 99035871 99305028 99589634
1635.8I9589634j69218k30860L0702L33607N18388K33197Q4984M16076J22154m34541
$$ 99589634 99420416 99189556 99220258 99553865 100072253 100305450 100390434 100806510 100928664 100494123
1656.2A00494123j86670J59943K79176J39439J79029M14919L14165N6529Q2588O6054
$$ 100494123 100307453 100467396 100746572 100886011 101065040 101479959 101794124 101850653 101933241 101999295
1676.6A01999295Q4567L20256N53953K48230k83993k01916l6395J34313M00472M29678
$$ 101999295 102083862 102404118 102958071 103206301 102922308 102720392 102683997 102818310 103218782 103648460
1697A03648460K06005r2363k27249j16300j23763j35052K0158K39742L96359J64997
$$ 103648460 103854465 103762102 103534853 103418553 103294790 103159738 103179896 103419638 103815997 103980994
1717.4A03980994l46899l58605j40202l3534N7674J80196K71333K08485j39952j74761
$$ 103980994 103634095 103275490 103135288 103101754 103159428 103339624 103610957 103819442 103679490 103504729
1737.8A03504729m375L636k0695O1775J62232N3119k20418k19154m3762K1661M1401
$$ 103504729 103500354 103503990 103483295 103545070 103707302 103760421 103540003 103320849 103277087 103298748 103340149
1760.2A03340149j2171j13130q142J53935K05338O2323k11585k30205p1013J0097j7583
$$ 103340149 103327978 103214848 103206706 103360641 103565979 103628302 103416717 103186512 103115499 103125596 103108013
1782.6A03108013l7885k6321P4970K13480R9469j36793j03378L5071L6025q4102j10793
$$ 103108013 103070128 103043807 103118777 103332257 103431726 103294933 103191555 103226626 103262651 103178549 103067756
1805.1A03067756j8335N7173J7274o9643n9330k0194k9838L147R0980R8753O4481K8729
$$ 103067756 103049421 103106594 103123868 103054225 102994895 102974701 102944863 102948010 103038990 103137743 103202224 103230953
1829.6A03230953j21105j57129m1092O295J6856J20890J84214P117j37925j07122m0293
$$ 103230953 103109848 102952719 102911627 102917922 102934778 103055668 103239882 103246999 103109074 103001952 102961659
1852A02961659N937J9515J9073J6964J8274O4886J73056J63114q1634j97637r6798
$$ 102961659 102967596 102987111 103006184 103023148 103041422 103106308 103279364 103442478 103360844 103163207 103066409
1874.4A03066409j8120n13M947N985J0621M4048P1192q595p5114m5395m1497m8649
$$ 103066409 103048289 103047776 103052723 103058708 103069329 103113377 103184569 103175974 103100860 103055465 103013968 102965319
1898.9A02965319k5523p915O211K7966K1148k7430l3879M2808R1397L5143K647p582
$$ 102965319 102939796 102931881 102938092 102966058 102987206 102959776 102925897 102968705 103060102 103095245 103097892 103090310
1923.4A03090310n6970m5264L255K4736K8443J9967J8263N4860R3270L0470n6303n6565
$$ 103090310 103033340 102988076 102991331 103016067 103044510 103064477 103082740 103137600 103230870 103261340 103205037 103148472
1947.9A03148472k4414m053l660j6450j8776j0204m804J3947L3367L063l6692k5296
$$ 103148472 103124058 103120005 103116345 103099895 103081119 103070915 103066111 103080058 103113425 103116488 103079796 103054500
1972.3A03054500N149K1327K5308K4831K5881K9385L3796M5860O5422K8681l5524k2531
$$ 103054500 103059649 103080976 103106284 103131115 103156996 103186381 103220177 103266037 103331459 103360140 103324616 103302085
1996.8A03302085J4913J5891R215J2898J6106J4805J5009K0516L7706K9361j6248k9576
$$ 103302085 103316998 103332889 103342104 103355002 103371108 103385913 103400922 103421438 103459144 103488505 103472257 103442681
2021.3A03442681l553J3531J4603Q487N079Q213M232J586Q905O842j013k003p51M435
$$ 103442681 103439128 103452659 103467262 103475749 103480828 103489041 103493273 103494859 103503764 103510606 103509593 103507590 103506839 103511274
2049.8A03511274J0228R990P713O437J347l82L303m530p832N269J561j5580r823P367
$$ 103511274 103521502 103531492 103539205 103545642 103546989 103546607 103549910 103545380 103537548 103542817 103544378 103528798 103518975 103526342
2078.4A03526342N042o675l398R799J6725J3507P415P712R263R155P761O878J2505
$$ 103526342 103531384 103524709 103521311 103531110 103547835 103561342 103568757 103576469 103585732 103594887 103602648 103609526 103622031
2104.9A03622031J4103J5020K2900J9574J1802J6189K2924K3448J8418J9085K7895
$$ 103622031 103636134 103651154 103674054 103693628 103705430 103721619 103744543 103767991 103786409 103805494 103833389
2127.3A03833389L1781L1150L4201L8135L3605K4259K2841L3235M0877L4845K8896
$$ 103833389 103865170 103896320 103930521 103968656 104002261 104026520 104049361 104082596 104123473 104158318 104187214
2149.8A04187214L1805L9411M4477M4858M4549M0793L3784L1400L8636M8601M6814
$$ 104187214 104219019 104258430 104302907 104347765 104392314 104433107 104466891 104498291 104536927 104585528 104632342
2172.2A04632342L4487K9624L1626L3378M0341M6658M1390L1948L6049M6170M3225
$$ 104632342 104666829 104696453 104728079 104761457 104801798 104848456 104889846 104921794 104957843 105004013 105047238
2194.6A05047238L4797L1960L3987L9327M4501M9793N0819L9661L1948L6288L5715
$$ 105047238 105082035 105113995 105147982 105187309 105231810 105281603 105332422 105372083 105404031 105440319 105476034
2217.1A05476034L4666M4822M9627M3166L9899M2379M1402L3950K7621K8801L3283
$$ 105476034 105510700 105555522 105605149 105648315 105688214 105730593 105771995 105805945 105833566 105862367 105895650
2239.5A05895650L4023L4344L5024L4523L8230L6705K8908L0041L3497K8551K4700
$$ 105895650 105929673 105964017 105999041 106033564 106071794 106108499 106137407 106167448 106200945 106229496 106254196
2262A06254196K8074L1686K8312K2387K5797L5429M0937M2486M2176M0484L3641K3687
$$ 106254196 106282270 106313956 106342268 106364655 106390452 106425881 106466818 106509304 106551480 106591964 106625605 106649292
2286.4A06649292K0635K0611J7309J6594J6117J3387J7512J5462j336O56K1196K0253
$$ 106649292 106669927 106690538 106707847 106724441 106740558 106753945 106771457 106786919 106785583 106786239 106807435 106827688
2310.9A06827688K849m017r275j8656m947K8396L2043R680R298J9706J0991Q821K1970
$$ 106827688 106830537 106826520 106817245 106798589 106793642 106822038 106854081 106863761 106873059 106892765 106903756 106912577 106934547
2337.4A06934547K5011K1958L3247N5182L2795k7943m2534R42Q369N030P0560J13583
$$ 106934547 106959558 106981516 107014763 107069945 107102740 107074797 107032263 107033205 107041574 107046604 107117164 107230747
2361.9A07230747Q5366O1929P0679P0584O1524N7637O3765P6724P8916O8808N2786
$$ 107230747 107316113 107378042 107448721 107519305 107580829 107638466 107702231 107778955 107857871 107926679 107979465
2384.3A07979465M4620M1079K6786K1673L5023L8851K4223J9848L1650L7754L3057
$$ 107979465 108024085 108065164 108091950 108113623 108148646 108187497 108211720 108231568 108263218 108300972 108334029
2406.8A08334029K3520J8513K2662K9504L1626L0816K8848K7967L6299M0078L6168
$$ 108334029 108357549 108376062 108398724 108428228 108459854 108490670 108519518 108547485 108583784 108623862 108660030
2429.2A08660030L2437K4677K3722K7168K8050L0708K8730K8348L0553K4354J9563
$$ 108660030 108692467 108717144 108740866 108768034 108796084 108826792 108855522 108883870 108914423 108938777 108958340
2451.6A08958340K4378L3474L8385L2771K4629J9693K4164L2639K7442K0457J9764
$$ 108958340 108982718 109016192 109054577 109087348 109111977 109131670 109155834 109188473 109215915 109236372 109256136
2474.1A09256136K1053K7239L0875K9338K4616K0218K1708K6155K9957K6965J4949
$$ 109256136 109277189 109304428 109335303 109364641 109389257 109409475 109431183 109457338 109487295 109514260 109529209
2496.5A09529209J0371J6260J9622K3437K0325J1623J4412J4222M244l22K432Q321
$$ 109529209 109539580 109555840 109575462 109598899 109619224 109630847 109645259 109659481 109663725 109663403 109665835 109674156
2521A09674156J2982J3113R703R871J5509J7702J7214K0516K3937K1530J6141J5890
$$ 109674156 109687138 109700251 109709954 109719825 109735334 109753036 109770250 109790766 109814703 109836233 109852374 109868264
2545.5A09868264J8811J7262J3661J7345K6536K8038K2686J8644J5128Q392L386J0299
$$ 109868264 109887075 109904337 109917998 109935343 109961879 109989917 110012603 110031247 110046375 110054767 110058153 110068452
2569.9A10068452J3459N60o079N9L207O688J3208J2708J0633J3149J5247J7345J6463
$$ 110068452 110081911 110082471 110076392 110076451 110079658 110086346 110099554 110112262 110122895 110136044 110151291 110168636 110185099
2596.4A10185099Q130Q70K062N722P391Q619J2469J5271J1289J1826J8728J5819O210
$$ 110185099 110193229 110194099 110196161 110201883 110209274 110217893 110230362 110245633 110256922 110268748 110287476 110303295 110309505
2623A10309505L601Q940J1349L576o056p271J847J1254R584P129J1766O306m399j919
$$ 110309505 110313106 110322046 110333395 110336971 110330915 110323644 110325491 110336745 110346329 110353458 110365224 110371530 110367131 110365212
2651.5A10365212N162J538j4318j9574j0872j0800j3316j1611q213k27m506k3675k6178
$$ 110365212 110370374 110371912 110357594 110338020 110327148 110316348 110303032 110291421 110283208 110282981 110278475 110254800 110228622
2678A10228622L10L0458L3140J9431J9682K5057K1494J6081J3972J2755J0812O938
$$ 110228622 110228932 110259390 110292530 110311961 110331643 110356700 110378194 110394275 110408247 110421002 110431814 110438752
2702.5A10438752K444j550q678q381j585l564p153j7691m0781n3036m6575k2185P796
$$ 110438752 110441196 110439646 110430968 110422587 110421002 110417438 110410285 110392594 110351813 110298777 110252202 110230017 110237813
2729A10237813J7500J1873O116Q106O485n853j3423k8384m4572k8694j0514k6310m6599
$$ 110237813 110255313 110267186 110273302 110281408 110287893 110282040 110268617 110240233 110195661 110166967 110156453 110130143 110083544
2755.5A10083544n6374n8746m3774k7120k0730k2161k7967m3070n8973l8481j2350
$$ 110083544 110027170 109968424 109924650 109897530 109876800 109854639 109826672 109783602 109724629 109686148 109673798
2778A09673798k5344m1079m3595n9951p4076m8518j3757k7156o7747p1561m5693n4324
$$ 109673798 109648454 109607375 109563780 109503829 109429753 109381235 109367478 109340322 109272575 109201014 109155321 109100997
2802.4A09100997j00684j48141j79982j79291j62125j64294j87278k16770k46608k69139
$$ 109100997 109000313 108852172 108672190 108492899 108330774 108166480 107979202 107762432 107515824 107246685
2822.8A07246685k86210l27456m09197n33808p22789j007748j433790k025175k796161
$$ 107246685 106960475 106633019 106223822 105690014 104967225 103959477 102525687 100500512 97704351
2841.2I7704351l713542m554498m994166m751361l591603j549375Q15284K755779L860069
$$ 97704351 93990809 89436311 84442145 79690784 76099181 74549806 75365090 78120869 81980938
2859.5H1980938M102492L608292K602196J454163N88125L22288N94813R13155Q54546
$$ 81980938 86083430 89691722 92293918 93748081 94336206 94658494 95253307 96166462 97021008
2877.9I7021008M62847P535l68011o55902q79306j030164j115072j158810j160937
$$ 97021008 97483855 97491390 97123379 96467477 95588171 94558007 93442935 92284125 91123188
2896.3I1123188j169402j245940j390314j599550j910412k375651k992737l685480
$$ 91123188 89953786 88707846 87317532 85717982 83807570 81431919 78439182 74753702
2912.6G4753702m324675m710150m588145l767782k286029m69500J254511K593702L475732
$$ 74753702 70429027 65718877 61130732 57362950 55076921 54607421 55861932 58455634 61931366
2930.9F1931366M005909M257518M213041L881478L325468K615607J813489R59552J19436
$$ 61931366 65937275 70194793 74407834 78289312 81614780 84230387 86043876 87003428 87122864
2949.3H7122864n08249o54495k82413L54278R98527J554734J988709K238661K250588
$$ 87122864 86614615 85960120 85677707 86031985 87030512 88585246 90573955 92812616 95063204
2967.6I5063204K033186J671725J286495R50944O79410N12337M65990M57262M24302
$$ 95063204 97096390 98768115 100054610 101005554 101684964 102197301 102663291 103120553 103544855
2986A03544855L77715L24619K87962K71058K02214R7955J6892n8306j01053r6822q6439
$$ 103544855 103922570 104247189 104535151 104806209 105008423 105106378 105123270 105064964 104963911 104867089 104780650
3008.4A04780650p6794o2132n9259o2907n6565n7304p4792q1932p3123p6425p9584
$$ 104780650 104703856 104641724 104582465 104519558 104462993 104405689 104330897 104248965 104175842 104099417 104019833
3030.9A04019833m0830O1560J74582K02716J71303J70779K03765K07305J45185O2382
$$ 104019833 103979003 104040563 104215145 104417861 104589164 104759943 104963708 105171013 105316198 105378580
3051.3A05378580n245o4266r3710r8014q2553r274J20819K64179L59917L64828K86794
$$ 105378580 105373335 105309069 105215359 105117345 105034792 105025518 105146337 105410516 105770433 106135261 106422055
3073.7A06422055J76525J02079O8962L1627j4329m1855m4977j5808L6610N2344J3912
$$ 106422055 106598580 106700659 106769621 106801248 106786919 106745064 106700087 106684279 106720889 106773233 106787145
3096.1A06787145l3021m6182l4117m9758r1195j00875p1478o8617r6917q9562n8889
$$ 106787145 106754124 106707942 106673825 106624067 106532872 106431997 106360519 106291902 106194985 106105423 106046534
3118.6A06046534l9328k9158m4727q7059j08373q3173p1394j12283j51539j41835j04583
$$ 106046534 106007206 105978048 105933321 105846262 105737889 105654716 105583322 105471039 105319500 105177665 105073082
3141A05073082r2196j09923j31869j64974j84929j54937j18172j22964j55676j86872
$$ 105073082 104980886 104870963 104739094 104574120 104389191 104234254 104116082 103993118 103837442 103650570
3161.4A03650570j98054j86682j68181j59704j73259j89722j89304j96040k13420k16973
$$ 103650570 103452516 103265834 103097653 102937949 102764690 102574968 102385664 102189624 101976204 101759231
3181.8A01759231k07972k11072k26593k22636k01726j94847j98746k07078k20025k10959
$$ 101759231 101551259 101340187 101113594 100890958 100689232 100494385 100295639 100088561 99868536 99657577
3202.2I9657577j94174j93596j93619k07395k26247k17301k05272k00421j80936j78825
$$ 99657577 99463403 99269807 99076188 98868793 98642546 98425245 98219973 98019552 97838616 97659791
3222.6I7659791k06769k22039k22147k23344k10738j83470j67113j71238j79446j83523
$$ 97659791 97453022 97230983 97008836 96785492 96574754 96391284 96224171 96052933 95873487 95689964
3243I5689964j86723j67734j38121j37181j54906j62935j52868j45620j40471j31201
$$ 95689964 95503241 95335507 95197386 95060205 94905299 94742364 94589496 94443876 94303405 94172204
3263.4I4172204j53208j93370j92701j61541j56879j77706j81663j73175j91540k24167
$$ 94172204 94018996 93825626 93632925 93471384 93314505 93136799 92955136 92781961 92590421 92366254
3283.8I2366254k28238k16043k22587k40684k55018k52599k28405k34151k82305l05480
$$ 92366254 92138016 91921973 91699386 91458702 91203684 90951085 90722680 90488529 90206224 89900744
3304.2H9900744k79623k46018k50853k92378l13217l00115k92653k90251k95245l11476
$$ 89900744 89621121 89375103 89124250 88831872 88518655 88218540 87925887 87635636 87340391 87028915
3324.6H7028915l17371l17896l05283k82848k88426l03835l01975k98119k87986k71493
$$ 87028915 86711544 86393648 86088365 85805517 85517091 85213256 84911281 84613162 84325176 84053683
3345H4053683k62534k46424k31623k43617k58392k43222k05678j72496j54376j49375
$$ 84053683 83791149 83544725 83313102 83069485 82811093 82567871 82362193 82189697 82035321 81885946
3365.4H1885946j52129j67924j85335j68246j34170j15734j13565j08153q6677p6228
$$ 81885946 81733817 81565893 81380558 81212312 81078142 80962408 80848843 80740690 80654013 80577785
3385.7H0577785o2734j3065K1576n388l4380j3196K1678K4658J2142J5890L0369N4288
$$ 80577785 80515051 80501986 80523562 80518174 80483794 80470598 80492276 80516934 80529076 80544966 80575335 80629623
3410.2H0629623O9565O0325N6452P9185Q6230O4438Q1069J30361J47861J28383J23584
$$ 80629623 80699188 80759513 80815965 80895150 80981380 81045818 81126887 81257248 81405109 81533492 81657076
3432.7H1657076J41799J36036J16736J29354J60670J86127J92804J68711J68359K01380
$$ 81657076 81798875 81934911 82051647 82181001 82341671 82527798 82720602 82889313 83057672 83259052
3453.1H3259052K14273K25132K47437K34699K15674K51383K87896K70790K44927K45851
$$ 83259052 83473325 83698457 83945894 84180593 84396267 84647650 84935546 85206336 85451263 85697114
3473.4H5697114K58095K93767L34233L26312L09193L19254L15052L01618L10182L32016
$$ 85697114 85955209 86248976 86583209 86909521 87218714 87537968 87853020 88154638 88464820 88796836
3493.8H8796836L49397L51405L58367L77494L59326L22169L41630L57360L17758L11429
$$ 88796836 89146233 89497638 89856005 90233499 90592825 90914994 91256624 91613984 91931742 92243171
3514.2I2243171L49527L74538M00615M24677L98022L44604K98327K69920K73812K90489
$$ 92243171 92592698 92967236 93367851 93792528 94190550 94535154 94833481 95103401 95377213 95667702
3534.6I5667702K94334K92378L17163L62384L84056L33030K60388K52724K45035K11292
$$ 95667702 95962036 96254414 96571577 96933961 97318017 97651047 97911435 98164159 98409194 98620486
3555I8620486K30944K84261L19016L74347M47166L21913K7489m375J41919K08533K08628
$$ 98620486 98851430 99135691 99454707 99829054 100276220 100598133 100625622 100621247 100763166 100971699 101180327
3577.5A01180327K00176J97864K63989L85821L39531P5531K9445J83416J95062J09243
$$ 101180327 101380503 101578367 101842356 102228177 102567708 102643239 102672684 102856100 103051162 103160405
3597.9A03160405J11103J20437J44303K58053L13699K14195J39332J08623J14775J59156
$$ 103160405 103271508 103391945 103536248 103794301 104108000 104322195 104461527 104570150 104684925 104844081
3618.3A04844081J7047j24204K0623K99502M18043N3489k03299j02830o008L6525Q6177
$$ 104844081 104861128 104736924 104757547 105057049 105475092 105528581 105325282 105222452 105216444 105252969 105339146
3640.7A05339146J42967K85614N15640M33850j68240l91066j49024j7655q7964n3966
$$ 105339146 105482113 105767727 106283367 106717217 106548977 106157911 106008887 105991232 105903268 105849302
3661.1A05849302M1246J18923K76542L85499J66440R1350K22349p4195k90645j55043
$$ 105849302 105890548 106009471 106286013 106671512 106837952 106929302 107151651 107077456 106786811 106631768
3681.5A06631768L3700K19655L86513K96747r1612k59531j61564p474J23179J08754
$$ 106631768 106665468 106885123 107271636 107568383 107476771 107217240 107055676 107048202 107171381 107280135
3701.9A07280135m3797p987K19833L34979Q7416k47073k30349l7455R4426J09458N4776
$$ 107280135 107236338 107228351 107448184 107783163 107870579 107623506 107393157 107355702 107450128 107559586 107614362
3724.3A07614362m6348q0109J13082L77870L18527j10781l29459j42980K22063L54231
$$ 107614362 107568014 107487905 107600987 107978857 108297384 108186603 107857144 107714164 107936227 108290458
3744.7A08290458K9874l565Q0407k36523l50297j47128l1936j11723j13404R489N6613
$$ 108290458 108320332 108316767 108397174 108160651 107810354 107663226 107631290 107519567 107406163 107415652 107472265
3767.1A07472265K8264q6093j79624p9537Q6725J17278k360n2738n5468r7144p3576
$$ 107472265 107500529 107414436 107234812 107155275 107242000 107359278 107356918 107304180 107248712 107151568 107077992
3789.6A07077992R322J12784J87922J59883J96600J66690j12331j48463j23012k05731
$$ 107077992 107087314 107200098 107388020 107547903 107744503 107911193 107798862 107650399 107527387 107321656
3810A07321656r9004J45519K75707J59908J00553n1975k43676j54591n2702K1708J03247
$$ 107321656 107222652 107368171 107643878 107803786 107904339 107852364 107608688 107454097 107401395 107423103 107526350
3832.4A07526350J22881J96230J86229q1563k70176k63774j47975O0249L45850N16534
$$ 107526350 107649231 107845461 108031690 107950127 107679951 107416177 107268202 107328451 107674301 108190835
3852.8A08190835j2m65298l10314n531J77920R9349m757R2328M6110j62232k17712
$$ 108190835 108190823 107725525 107415211 107409680 107587600 107686949 107682192 107774520 107820630 107658398 107440686
3875.2A07440686j05023J15728J10948n1331m4513p6210m0389M9198p0751j04475J07241
$$ 107440686 107335663 107451391 107562339 107511008 107466495 107390285 107349896 107399094 107328343 107223868 107331109
3897.7A07331109K73526J91271l9172k47514k84171j61481k4855P8964J48713R4545
$$ 107331109 107604635 107795906 107756734 107509220 107225049 107063568 107038713 107117677 107266390 107360935
3918.1A07360935l4153o7103k0588j5771n829N6684K6047q6701r3079r763O5661P9691
$$ 107360935 107326782 107259679 107239091 107223320 107217491 107274175 107300222 107213521 107120442 107110679 107176340 107256031
3942.5A07256031J2338m208K6035l2472p7498l2151M065M566M423r871k4366r966O652
$$ 107256031 107268369 107264161 107290196 107257724 107180226 107148075 107152140 107156706 107161129 107151258 107126892 107116926 107123578
3969.1A07123578l6j526J0157M243l814q822j1718K646O295p701m721J0538J3042L826
$$ 107123578 107123542 107122016 107132173 107136416 107132602 107123780 107112062 107114708 107121003 107113302 107108581 107119119 107132161 107135987
3997.6A07135987
$$ 107135987
##END=$$ End of the data block
