##TITLE=DI 15-2167808-3 IZA Brasil Silicones Polyterminais $$ Begin of the data block
##JCAMP-DX=5.00 $$ ACD/SpecManager v 10.08
##SPECTROMETER/DATA SYSTEM=Alpha
##DATE=14 Jan 2016 08:14:52
##DATA TYPE=INFRARED SPECTRUM
##DATA CLASS=XYDATA
##ORIGIN=
##OWNER=
##NPOINTS=1667
##FIRSTX=599.64648438
##LASTX=3997.64306641
##MAXX=3997.64306641
##MINX=599.64648438
##MAXY=1.11030734
##MINY=0.03269515
##XFACTOR=1.0000000000
##YFACTOR=0.000000010000000
##FIRSTY=0.97695535
##DELTAX=2.03961372
##XUNITS=1/CM
##YUNITS=ARBITRARY UNITS
##XYDATA=(X++(Y..Y))
599.6I7695535o4152q5795r4533o6668q5050j15054j16647j18643j02019n5915j8680
$$ 97695535 97631383 97545588 97451055 97384387 97299337 97184283 97067636 96948993 96846974 96791059 96772379
622.1I6772379j8150j1307L52J0955J8537J4156n507j1003l0989j31428k58148l51619
$$ 96772379 96754229 96742922 96743274 96754229 96772766 96786922 96781415 96770412 96739423 96607995 96349847 95998228
646.6I5998228m89271q31223j498514k771092m381394m736549k884745n32997N29266
$$ 95998228 95508957 94677734 93179220 90408128 86026734 81290185 78405440 77872443 78401709
664.9G8401709P27558M63307j50049l88157n11414p25341j006073j256031j279777
$$ 78401709 79129267 79592574 79442525 79054368 78542954 77817613 76811540 75555509 74275732
683.3G4275732r61083m41444m2063j2028k95902o41316q45033q21554m95720J44607
$$ 74275732 73314649 72873205 72831142 72819114 72523212 71881896 71036863 70215309 69719589 69864196
703.7F9864196J066964K184731L178591L597086L288466K529693J726168J100934O56557
$$ 69864196 70931160 73115891 76294482 79891568 83180034 85709727 87435895 88536829 89193386
722H9193386L55869J49703j4442j49399k76065l95566m70680m78178m18174l04920
$$ 89193386 89549255 89698958 89684516 89535117 89259052 88863486 88392806 87914628 87496454 87191534
742.4H7191534j95873j87480k79677m08453n53381p16192r06133j140613j434600j787031
$$ 87191534 86995661 86808181 86528504 86120051 85566670 84850478 83944345 82803732 81369132 79582101
762.8G9582101k180642k617973l109711l665203m343808n193072o120301o905496p369578
$$ 79582101 77401459 74783486 71673775 68008572 63664764 58471692 52351391 45445895 38076317
781.2C8076317p435897p026620o106879m875251l599386k473519j600521r82493n32345
$$ 38076317 30640420 23613800 17506921 12631670 9032284 6558765 4958244 3975751 3443406
799.5C443406j73891J15422L75927O21647Q28898R40574R53866R27684J007903J359850
$$ 3443406 3269515 3384937 3760864 4382511 5211409 6151983 7105849 8033533 9041436 10401286
819.9A0401286K080222L124877M215777M974813N173465M851097M230181L574171L048298
$$ 10401286 12481508 15606385 19822162 24796975 29970440 34821537 39051718 42625889 45674187
838.3D5674187K690387K426713K125293J691294J101464L84140m05693j160329j700509
$$ 45674187 48364574 50791287 52916580 54607874 55709338 56093478 55687785 54527456 52826947
856.6E2826947j864177j603362j001516k62377L90447Q46260J152930J438540J790840
$$ 52826947 50962770 49359408 48357892 48095515 48485962 49332222 50485152 51923692 53714532
875E3714532K253073K773124L176427L319073L193152K882301K499879K136469J818120
$$ 53714532 55967605 58740729 61917156 65236229 68429381 71311682 73811561 75948030 77766150
893.4G7766150J551980J345086J176405J034051R13650Q03316P05325O27041N60630
$$ 77766150 79318130 80663216 81839621 82873672 83787322 84590638 85295963 85923004 86483634
911.7H6483634N07283M73237M43500M17453M00233L79616L45171K95097K37405J75756
$$ 86483634 86990917 87464154 87907654 88325107 88725340 89104956 89450127 89745224 89982629 90158385
932.1I0158385J08314L4606l4398q5467j34194j91307k54029l41856m67801o15871
$$ 90158385 90266699 90301305 90266907 90181440 90047246 89855939 89601910 89260054 88792253 88176382
952.5H8176382p46686q19677q38262q35657q41254q79556r69058j107645j270413j444322
$$ 88176382 87429696 86610019 85771757 84936100 84094846 83215290 82246232 81138587 79868174 78423852
972.9G8423852j639593j881844k177506k484495k784914l100949l433335l767246m080617
$$ 78423852 76784259 74902415 72724909 70240414 67455500 64354551 60921216 57153970 53073353
991.3E3073353m359195m614040m849121n037499n108472m981347m638837m090417l365168
$$ 53073353 48714158 44100118 39250997 34213498 29105026 24123679 19484842 15394425 12029257
1009.6A2029257k567430j813970j178766o94758l59315j29972L1309J34743J96272
$$ 12029257 9461827 7647857 6469091 5774333 5415018 5285046 5316355 5451098 5647370
1028E647370K38810K70605K87090K97348L02086K92811K70976K45674K17619J85278
$$ 5647370 5886180 6156785 6443875 6741223 7043309 7336120 7607096 7852770 8070389 8255667
1048.4H255667J49197J05872N5679N647l7558q0707j22842j62587j97940k27309k55356
$$ 8255667 8404864 8510736 8566415 8572062 8534504 8453797 8330955 8168368 7970428 7743119 7487763
1070.8G487763k83086l03399l16778l33803l41655l31020l10113k86735k43310j77415
$$ 7487763 7204677 6901278 6584500 6250697 5909042 5578022 5267909 4981174 4737864 4560449
1091.2D560449j06000k3773P0112J75726K93470M25341N72186P41207R33705J144962
$$ 4560449 4454449 4430676 4500788 4676514 4969984 5395325 5967511 6708718 7642423 8787385
1111.6H787385J376253J623069J882077K142275K378884K582563K758143K889306K967224
$$ 8787385 10163638 11786707 13668784 15811059 18189943 20772506 23530649 26419955 29387179
1129.9B9387179K997246K994842K973681K918926K820736K695951K562061K432964
$$ 29387179 32384425 35379267 38352948 41271874 44092610 46788561 49350622 51783586
1146.3E1783586K332645K264846K206081K141106K072209K005076J943046J888043
$$ 51783586 54116231 56381077 58587158 60728264 62800473 64805549 66748595 68636638
1162.6F8636638J839000J775759J692820J633972J632011J642674J579899J434916
$$ 68636638 70475638 72251397 73944217 75578189 77210200 78852874 80432773 81867689
1178.9H1867689J278222J159721J081354J029002R88543R48096R00334Q42172P75808
$$ 81867689 83145911 84305632 85386986 86415988 87404531 88352627 89252961 90095133 90870941
1197.3I0870941O94036N85461M59981L36283K22725J20801K9403m5687j15627k04802
$$ 90870941 91564977 92150438 92610419 92946702 93169427 93290228 93319631 93273944 93158317 92953515
1217.7I2953515l09813m16797n37622o84476q42464j018411j246786j545489j919293
$$ 92953515 92643702 92226905 91689283 91004807 90162343 89143932 87897146 86351657 84432364
1236H4432364k393908l039110l983926n350870p070035q858925j0503349j1603430
$$ 84432364 82038456 78999346 75015420 69664550 62594515 53735590 43232241 31628811
1252.3C1628811j1136844q582043n075975k065625L41672L030873O582806J0175976
$$ 31628811 20491967 11909924 6833949 4768324 5109996 8140869 14723675 24899651
1268.6B4899651J2111889J1602125R545388P323552N538755M217613L259963K560091
$$ 24899651 37011540 48613665 58159053 65482605 71021360 75238973 78498936 81059027
1285H1059027K055669J686477J381207J119160R21816P89350O99204O48964O38127
$$ 81059027 83114696 84801173 86182380 87301540 88223356 89012706 89711910 90360874 90999001
1303.3I0999001O38843O21188N70964M97645M11857L09831K46906K64597K89452K60311
$$ 90999001 91637844 92259032 92829996 93327641 93739498 94049329 94296235 94560832 94850284 95110595
1323.7I5110595J99884J28913O2865J6284m3279j24591j69879j18035m0114m3595p0709
$$ 95110595 95310479 95439392 95502257 95518541 95475262 95350671 95180792 95062757 95022643 94979048 94908339
1346.2I4908339m9323k593K1315O568o5338k33961m42439n09703m24361m52626o37239
$$ 94908339 94859016 94856423 94877738 94884306 94818968 94585007 94142568 93632865 93208504 92755878 92118639
1368.6I2118639q31545r66084q42875m14354o4605L7491j06710m48996q67438j218039
$$ 92118639 91287094 90321010 89478135 89063781 88999176 89036667 88929957 88480961 87613523 86395484
1389H6395484j512766j948344k294469j971853j218683m96560j24437j40017l80707
$$ 86395484 84882718 82934374 80639905 78668052 77449369 76952809 76828372 76688355 76307648
1407.3G6307648n58263l27414L57550J173658K159983L164273K852017K130443J715213
$$ 76307648 75749385 75421971 75779521 76953179 79113162 82277435 85129452 87259895 88975108
1425.7H8975108J185017P46042L69155m0042l09038l58492m20863n76114o02216l74561
$$ 88975108 90160125 90906167 91275322 91235280 90926242 90567750 90146887 89570773 88968557 88593996
1446.1H8593996P2974M68021M98843K83170K20686N61035N92560L25745K07293L02261
$$ 88593996 88666970 89134991 89633834 89917004 90137690 90698725 91291285 91617030 91824323 92126584
1466.5I2126584L85702M26602N96064O49202M42446K25651J13857J44058K06685K72840
$$ 92126584 92512286 92938888 93534952 94184154 94626600 94852251 94966108 95110166 95316851 95589691
1486.9I5589691N24885Q62318P63005N00858M81731N32233L62546K8413k78860j08266
$$ 95589691 96114576 96976894 97739899 98240757 98722488 99254721 99617267 99645680 99366820 99258554
1507.3I9258554L26490K35504j6182k13033k38484j99664j53685l0893l2097p2759
$$ 99258554 99585044 99820548 99804366 99591333 99352849 99153185 98999500 98968607 98936510 98863751
1527.7I8863751j37759k95269l30567k82032m81611o94877m14235j83027k53839m49502
$$ 98863751 98725992 98430723 98100156 97818124 97336513 96641636 96227401 96044374 95790535 95341033
1548.1I5341033o28746o96492p97790r27645j001394o50936l55781m62603n50050m90957
$$ 95341033 94712287 94015795 93218005 92290360 91288966 90638030 90282249 89819646 89269596 88778639
1568.5H8778639k80887j36352p6794K29132M88210N10633O08724P27731P97033Q35657
$$ 88778639 88497752 88361400 88284606 88513738 89001948 89512581 90121305 90849036 91646069 92481726
1588.9I2481726Q56990Q46440Q34781Q00508P10249O18267N59312M96012M34124M17257
$$ 92481726 93338716 94185156 95019937 95820445 96530694 97148961 97708273 98204285 98638409 99055666
1609.3I9055666L65686K16347J43981K95687K85160J15431J14071J76871J72889J56963
$$ 99055666 99421352 99637699 99781680 100077367 100362527 100477958 100592029 100768900 100941789 101098752
1629.7A01098752L1006j35231l1566K51221K34175P1132j04177j46007N5933O4587
$$ 101098752 101129758 100994527 100962961 101214182 101448357 101519489 101415312 101269305 101325238 101389825
1650.1A01389825l7777K81715M21083K03634M3773M9210J42062M1794p2336P7248J92022
$$ 101389825 101352048 101633763 102054846 102258480 102302253 102351463 102493525 102535319 102462983 102540231 102732253
1672.5A02732253J77240K14422J19162q2553j71935J24001L56806K26926J35220j574
$$ 102732253 102909493 103123915 103243077 103160524 102988589 103112590 103469396 103696322 103831542 103829968
1692.9A03829968j73938j83404j8155K09784K03455Q5866J17648J15812j7834j90509
$$ 103829968 103656030 103472626 103454471 103664255 103867710 103953576 104071224 104187036 104169202 103978693
1713.3A03978693k70998n6803K42936J88589M2582k4009j05107k10690k68137j66166
$$ 103978693 103707695 103650892 103893828 104082417 104124999 104100990 103995883 103785193 103517056 103350890
1733.7A03350890O5744M7016j9193M5955J13034J32025J50692K93434M60660L60883
$$ 103350890 103416634 103463650 103444457 103490412 103603446 103735471 103886163 104179597 104640257 105001140
1754.1A05001140J90580J25575Q7726J18375J31952J359j13344j15251J8656J94824
$$ 105001140 105191720 105317295 105405021 105523396 105655348 105656707 105543363 105428112 105446768 105641592
1774.5A05641592J78706O6626L2163P6985J08850R5308J55p8273N2917K04063J51896
$$ 105641592 105820298 105886924 105919087 105996072 106104922 106200230 106200385 106122112 106175029 106379092 106530988
1796.9A06530988O9881J02389J83475J65033Q2660L8921Q6630J48010J23823P9977
$$ 106530988 106600869 106703258 106886733 107051766 107134426 107173347 107259977 107407987 107531810 107611787
1817.3A07611787P0560L4309k5249j7082J370K3687J31131J46555O3956L1936k38r3842
$$ 107611787 107682347 107716656 107691407 107674325 107675695 107699382 107830513 107977068 108041024 108072960 108072722 107978880
1841.8A07978880j02520N2762J31917R2674M0483M292j2148j8227j9419k5296o6710
$$ 107978880 107876360 107929122 108061039 108153713 108194196 108198488 108186340 108168113 108148694 108123398 108056688
1864.2A08056688j49440j28592N3871J21629L8112j9992k2626j9479k2017k7919o1477
$$ 108056688 107907248 107778656 107832527 107954156 107992268 107972276 107949650 107930171 107908154 107880235 107818758
1886.7A07818758p9703j1587K3961o878M458J2028k1505m6647o5720j02317j20676
$$ 107818758 107739055 107727468 107751429 107744551 107749009 107761037 107739532 107692885 107627165 107524848 107404172
1909.1A07404172j04463j13678j63090j75321j11556o8688m5062j2016m1461j00648
$$ 107404172 107299709 107186031 107022941 106847620 106736064 106667376 106622314 106610298 106568837 106468189
1929.5A06468189j41526j77228k07066k35713k64859k36762r8169M5848J08147J31452
$$ 106468189 106326663 106149435 105942369 105706656 105441797 105205035 105106866 105152714 105260861 105392313
1949.9A05392313J36101J25170J19591J18136J13487J12534J09100J22452J73676K09713
$$ 105392313 105528414 105653584 105773175 105891311 106004798 106117332 106226432 106348884 106522560 106732273
1970.3A06732273J99843J76751J56546J39534J21010R6392O8522M3785J7798m649Q047
$$ 106732273 106932116 107108867 107265413 107404947 107525957 107622349 107690871 107734656 107752454 107747805 107755852
1992.7A07755852L8254M3464M8411P7021J01185R8884Q6069P6878O5029M7683K3318
$$ 107755852 107794106 107837570 107885981 107963002 108064187 108163071 108249140 108326018 108391047 108438730 108462048
2015.2A08462048J4042K6465K4819R227n019j8751l7849n8198p5221r5260j17910j47724
$$ 108462048 108476090 108502555 108527374 108536601 108531582 108512831 108474982 108416784 108341563 108246303 108128393 107980669
2039.6A07980669j71674j67966j42514j08707p3946l6645K623K9313M1295N0735N0342
$$ 107980669 107808995 107641029 107498515 107389808 107315862 107279217 107281840 107311153 107352448 107403183 107453525
2062.1A07453525M3511N2071O2203N4145L9232L2926L7908M4704M4167M3654M4739
$$ 107453525 107497036 107549107 107611310 107665455 107704687 107737613 107775521 107820225 107864392 107908046 107952785
2084.5A07952785L4786K3269K6274L9649M8828M2928K8729J9705K0993K3687J9538
$$ 107952785 107987571 108010840 108037114 108076763 108125591 108168519 108197248 108216953 108237946 108261633 108281171
2106.9A08281171O283q178j1134j3149k2256k7740j9300m924k587l171R966K2066K3127
$$ 108281171 108287454 108279276 108268142 108254993 108232737 108204997 108185697 108180773 108178186 108175015 108184981 108207047 108230174
2133.5A08230174K7048K9993K5392K5713L2497L4511L2139L1256L0482K7621K1410
$$ 108230174 108257222 108287215 108312607 108338320 108370817 108405328 108437467 108468723 108499205 108526826 108548236
2155.9A08548236J0884K825M768P952R107J3268J0693l6k694M840R489P916M136K051
$$ 108548236 108559120 108561945 108566713 108574665 108583772 108597040 108607733 108607697 108605003 108609843 108619332 108627248 108631384 108633435
2184.5A08633435N567R489M148o902p820M327P999J550R227J7547N961j931K539N436
$$ 108633435 108639002 108648491 108652639 108645737 108637917 108642244 108650243 108651793 108661020 108678567 108684528 108682597 108685136 108690572
2213A08690572Q452J5020K2614K0611J1897J3602K1684K3079J9968K6035L1889J8596
$$ 108690572 108699024 108714044 108736658 108757269 108769166 108782768 108804452 108827531 108847499 108873534 108905423 108924019
2237.5A08924019N138R251J7393K2614K5951K1959J4376P511L242L898O557R894J1063
$$ 108924019 108929157 108938408 108955801 108978415 109004366 109026325 109040701 109048212 109051454 109055352 109061909 109071803 109082866
2264A09082866J1670J0467K968k515L6P569J4103J4269J0264Q226J4686K7418L1734
$$ 109082866 109094536 109105003 109107971 109105456 109105492 109113061 109127164 109141433 109151697 109159923 109174609 109202027 109233761
2290.5A09233761K6584K6297L0220K7263K3794K9910L9994M9615O0106O8283O7091
$$ 109233761 109260345 109286642 109316862 109344125 109367919 109397829 109437823 109487438 109547544 109615827 109682918
2312.9A09682918O6006Q1086J00529J02127P5745N0044O0749P0596M5455L0601N3715
$$ 109682918 109748924 109830010 109930539 110032666 110108411 110158455 110219204 110289800 110335255 110365856 110419571
2335.4A10419571N7042J4675j7107n7256j59168j64676j669J75273K51663K14339J15990
$$ 110419571 110476613 110491288 110474181 110416925 110257757 110093081 110091412 110266685 110518348 110732687 110848677
2357.8A10848677K7824k3497p5149j34623j72329j91522j96445j73378j51515j44815
$$ 110848677 110876501 110853004 110777855 110643232 110470903 110279381 110082936 109909558 109758043 109613228
2378.2A09613228j27983r3770o3885m5168k5463q225k897q583j2017n245P03m661r536
$$ 109613228 109485245 109391475 109327590 109282422 109256959 109248734 109245837 109237254 109225237 109219992 109220695 109216034 109206498
2404.7A09206498j145O950Q452Q118K671m602n281n031p057m685p27J07k193K956J5319
$$ 109206498 109205353 109212303 109220755 109228873 109231544 109226942 109221661 109216630 109209573 109204888 109204161 109204268 109202075 109205031 109220350
2435.3A09220350J0156r358j2409M613J2982O008K003M53p248j3268l719Q011J871
$$ 109220350 109230506 109221148 109208739 109213352 109226334 109232342 109234345 109234798 109227550 109214282 109210563 109218574 109220445
2461.8A09220445p593n007m17m507j1849j1063o115j2004j9157j6654k3556m1198n5600
$$ 109220445 109212852 109207845 109207428 109202921 109191072 109180009 109173894 109161890 109142733 109126079 109102523 109061325 109005725
2488.3A09005725p2145r7036j18792j11080n6207L7599J34814J91390J88863J50550
$$ 109005725 108933580 108836544 108717752 108606672 108550465 108588064 108722878 108914268 109103131 109253681
2508.7A09253681J11186Q1134N3406K3973N150N662J2803J5342J1957O521J693q977
$$ 109253681 109364867 109446001 109499407 109523380 109528530 109534192 109546995 109562337 109574294 109580815 109582508 109573531
2533.2A09573531k3997l5393m4405m9985m8971m4954m5132m5407l8743k9219j8918
$$ 109573531 109549534 109514141 109469736 109419751 109370780 109325826 109280694 109235287 109196544 109167325 109148407
2555.6A09148407j6785k4676k8765k4224j6880j6188k1267k2769k1398k1899j8859
$$ 109148407 109131622 109106946 109078181 109053957 109037077 109020889 108999622 108976853 108955455 108933556 108914697
2578.1A08914697j4591j8561k2650k2864j7917p689o104p379k813n257j4615j9801
$$ 108914697 108900106 108881545 108858895 108836031 108818114 108810425 108804321 108796942 108794129 108788872 108774257 108754456
2602.6A08754456j3637o962j5927k5963j8633j2183k4605l3355l1662l4058l5584l6025
$$ 108754456 108740819 108733857 108717930 108691967 108673334 108661151 108636546 108603191 108571529 108537471 108501887 108465862
2627A08465862l8421m0340m2796m9007n4741n7268o4934p5721q2589q7881j01733j18232
$$ 108465862 108427441 108387101 108344305 108295298 108240557 108183289 108118355 108042634 107960045 107872164 107770431 107652199
2651.5A07652199j12903q9538p4363o9189n4931l2759j2541Q678K2519K6751L0398
$$ 107652199 107539296 107449758 107375395 107306206 107251275 107218516 107205975 107214653 107237172 107263923 107294321
2673.9A07294321K6095J1778O699J4139J5521L528j4031k9015m0877m6587n1379o1238
$$ 107294321 107320416 107332194 107338893 107353032 107368553 107372081 107358050 107329035 107288158 107241571 107190192 107128954
2698.4A07128954o3622o2299o8104p2396o5911n0688m3094n1546n6135n6863o2001
$$ 107128954 107065332 107003033 106934929 106862533 106796622 106745934 106702840 106651294 106595159 106538296 106476295
2720.9A06476295o0713o1870n5110l8517m0007m6849m9817m8900l7920l8743n3585
$$ 106476295 106415582 106353712 106298602 106260085 106220078 106173229 106123412 106074512 106036592 105997849 105944264
2743.3A05944264o7747p7498o5052m3571n2798q2803j02699j13785j23608j27256j21748
$$ 105944264 105876517 105799019 105733967 105690396 105637598 105554795 105452096 105338311 105214703 105087447 104965699
2765.7A04965699j16706j35231j81568k21646k36809k61939l14855l58379l83770m20475
$$ 104965699 104848993 104713762 104532194 104310548 104073739 103811800 103496945 103138566 102754796 102334321
2786.1A02334321m35758l75486k86173k42031k27785j68788o5411j3852k1887k9254
$$ 102334321 101898563 101523077 101236904 100994873 100767088 100598300 100532889 100519037 100497150 100467896
2806.5A00467896l7896l4523j6535k0968l6478m9079q0931j34075j88374k53678l48836
$$ 100467896 100430000 100395477 100378942 100357974 100321496 100272417 100191486 100057411 99869037 99615359 99266523
2828.9I9266523m56834n58275o67619p97505r06747j001692j163983j373673j531106
$$ 99266523 98809689 98251414 97583795 96786290 95879543 94877851 93713868 92340195 90809089
2847.3I0809089j607138j595145j442665j152301q35550n97531m51803l51220k56640
$$ 90809089 89201951 87606806 86164141 85011840 84176290 83578759 83126956 82775736 82519096
2865.7H2519096j71709j25414j13434m6652J51872M09013N57846N02515K87712J7071
$$ 82519096 82347387 82221973 82108539 82061887 82213759 82622772 83180618 83683133 83970845 83987916
2886.1H3987916k60878n42456q23653j100534j357943j566106j638681j434636q94880
$$ 83987916 83727038 83184582 82360929 81260395 79902452 78336346 76697665 75263029 74368149
2904.4G4368149j43462N50753R35375R39387O81669L10313q3512m20343o45292p51639
$$ 74368149 74224687 74775440 75710815 76650202 77331871 77642184 77558672 77138329 76493037 75741398
2924.8G5741398p54958o79284n65052m36819k85137j45209j43873m07535r64296j783192
$$ 75741398 74986440 74307156 73742104 73305285 73020148 72874939 72731066 72323531 71359235 69576043
2945.2F9576043k836871m063684n352217o560886p361141p226470n874964l515169
$$ 69576043 66739172 62675488 57323271 50762385 43401244 36174774 30299810 26784641
2961.5B6784641o93927K050817M397923O142944P176760P466835P106525O350678N444115
$$ 26784641 26090714 28141531 32539454 38682398 45859158 53325993 60432518 66783196 72227311
2979.9G2227311M571527L846652L257894K756870K309829J916260J604300J339907
$$ 72227311 76798838 80645490 83903384 86660254 88970083 90886343 92490643 93830550
2996.2I3830550J104790R17679P54755O21921N16153L96454K92116K52080K42812K10464
$$ 93830550 94935340 95853019 96607774 97229695 97745848 98142302 98434418 98686498 98929310 99139774
3016.6I9139774J63811J28424Q8650N5731M5925K0743m775M447L1233L7705k086l5143
$$ 99139774 99303585 99432009 99520659 99576390 99622315 99643058 99638283 99642730 99673963 99711668 99709582 99674439
3041.1I9674439j6868K2090L7467K0612J6009K4814J6755K4783M6867L4243l57j3399
$$ 99674439 99657571 99679661 99717128 99737740 99753749 99778563 99795318 99820101 99866968 99901211 99900854 99887455
3065.5I9887455J9902O1523M7690m864m6503n3048k3783O694J3411O402r156j5801
$$ 99887455 99907357 99968880 100016570 100011706 99965203 99912155 99888372 99895066 99908477 99914879 99905723 99889922
3090I9889922l838o819l6305o0743m8054j2409j1439n7441o4629p117r316p2336o3545
$$ 99889922 99886084 99879265 99842960 99782217 99734163 99721754 99710315 99652874 99588245 99581128 99571812 99499476 99435931
3116.5I9435931M06O0647J11753J14310O8951L0827L8862O1524L4315j5968r674N3352
$$ 99435931 99436337 99496984 99608737 99723047 99791998 99822825 99861687 99923211 99957526 99941558 99931884 99985236
3141I9985236Q3321N1415J2934k3555m5252k134N7375M7195Q178L934J2875m77j6844
$$ 99985236 100068557 100119972 100132906 100109351 100064099 100061965 100119340 100166535 100174713 100178647 100191522 100191045 100174201
3167.5A00174201j3757j6654k6715l1197k2518k444l040k1350k6512j7453j4037j3351
$$ 100174201 100160444 100143790 100117075 100085878 100063360 100060916 100057876 100036526 100010014 99992561 99978524 99965173
3192I9965173j2112j7076j8639j9133k1112j7685j6963j8829p963l821j5747j7894
$$ 99965173 99953061 99935985 99917346 99898213 99877101 99859416 99842453 99823624 99815661 99811840 99796093 99778199
3216.5I9778199j7398j0705J1301J6796j55j3458k8664l7170P189N9306M0043n681
$$ 99778199 99760801 99750096 99761397 99778193 99778038 99764580 99735916 99698746 99705935 99765241 99805284 99799603
3240.9I9799603k4491l6347j9431L1834M1897Q529j79J2684J9997K6513J9013l874
$$ 99799603 99775112 99738765 99719334 99751168 99793065 99801594 99801415 99814099 99834096 99860609 99879622 99875748
3265.4I9875748l1859n6713l0363K5898M1509L3349K6107J8769J4752R60j5175k3348
$$ 99875748 99843889 99787176 99756813 99782711 99824220 99857569 99883676 99902445 99917197 99918157 99902982 99879634
3289.9I9879634k0420L010L0511M0609J6379l2502n4079k4194K5654N4205N0079K7144
$$ 99879634 99859214 99862224 99892735 99933344 99949723 99917221 99863142 99838948 99864602 99918807 99968886 99996030
3314.4I9996030J2362R823j645k1380k8187q792J2577J0633k20k2197m3076j5217K3120
$$ 99996030 100008392 100018215 100016570 99995190 99967003 99958211 99970788 99981421 99981201 99959004 99915928 99900711 99923831
3340.9I9923831K4086J8478J109l0649j6886K8312L4201K456k3735k1904j1331j5068
$$ 99923831 99947917 99966395 99967504 99936855 99919969 99948281 99982482 99984938 99961203 99939299 99927968 99912900
3365.4I9912900j5140J7834O8563P1132K5106K646Q309M768o91R573J1515j4722j5629
$$ 99912900 99897760 99915594 99984157 100055289 100080395 100083041 100091350 100096118 100095427 100105000 100116515 100101793 100086164
3391.9A00086164K1554K1982r752k86N7805Q7428M8768R859J2529L0124M4537L3390
$$ 100086164 100107718 100129700 100119948 100119662 100177467 100264895 100313663 100323522 100336051 100366175 100410712 100444102
3416.3A00444102k408L112L9112L4142J2147R906J6511J1027j478J9824N3239M7350
$$ 100444102 100441694 100444806 100483918 100518060 100530207 100540113 100556624 100567651 100566173 100585997 100639236 100686586
3440.8A00686586J7834j0837L994O2251O0535J0085M494J6701L588P868L1245J6677
$$ 100686586 100704420 100693583 100697577 100759828 100820363 100830448 100834942 100851643 100855231 100863099 100894344 100911021
3465.3A00911021q178K5118Q2540R5499P6616M7850K7442O6793J09005R1350R0862
$$ 100911021 100902843 100927961 101010501 101106000 101182616 101230466 101257908 101324701 101433706 101525056 101615918
3487.7A01615918J17862J06835P3815O6852P6258O8295P2742J33252J73700J42360
$$ 101615918 101733780 101840615 101914430 101981282 102057540 102125835 102198577 102331829 102505529 102647889
3508.1A02647889J10876J10972J16575J19495J17684Q7332M1831O0964J32572J64926
$$ 102647889 102758765 102869737 102986312 103105807 103223491 103310823 103352654 103413618 103546190 103711116
3528.5A03711116J64390J48666J13177J21892J51562R3806N508K9194J48272J87064
$$ 103711116 103875506 104024172 104137349 104259241 104410803 104504609 104510117 104539311 104687583 104874647
3548.9A04874647J17564R5391J31202J03676L2413k861l6967p1156L1841J95503J90342
$$ 104874647 104992211 105087602 105218804 105322480 105354893 105352032 105315065 105243909 105275750 105471253 105661595
3571.3A05661595R2232K5380m626k7883n5277j21021j57452K051J71840R6011q47L3868
$$ 105661595 105753827 105779207 105774581 105746698 105691421 105570400 105412948 105414999 105586839 105682850 105682003 105715871
3595.8A05715871J11770J75393K34318K16842J25241J04797J56760J50216J17659R0838
$$ 105715871 105827641 106003034 106237352 106454194 106579435 106684232 106840992 106991208 107108867 107199705
3616.2A07199705Q8727J68467J87123L2818j50979j24860J04464J47318P1693L2163
$$ 107199705 107288432 107456899 107644022 107676840 107525861 107401001 107505465 107652783 107724476 107756639
3636.6A07756639J7595J1194l6216j57416k45714o2621L22318L80600K26855J52111
$$ 107756639 107774234 107785428 107749212 107591796 107346082 107283461 107605779 107986379 108213234 108365345
3657A08365345J63269J57523R0862l9185j62518j70314q2540r0325o3682J31822J86479
$$ 108365345 108528614 108686137 108776999 108737814 108575296 108404982 108322442 108232117 108168435 108300257 108486736
3679.4A08486736O5827j00851k55418l37314j90699P0858J07884K7370l6323p0941
$$ 108486736 108552563 108451712 108196294 107858980 107668281 107739139 107847023 107874393 107838070 107767129
3699.8A07767129j7023O9034K0373r9445r3340J09267K39932J59407M1819k706J8262
$$ 107767129 107750106 107819140 107839513 107740068 107646728 107755995 107995927 108155334 108197153 108194447 108212709
3722.3A08212709P7880J56450J33503k0504j66917j22166P8201J15276o366j10638
$$ 108212709 108290589 108447039 108580542 108560038 108393121 108270955 108349156 108464432 108458066 108347428
3742.7A08347428j41287j22440j20103l7420J07503Q6939k038N770P4803M7887k1243
$$ 108347428 108206141 108083701 107963598 107926178 108033681 108120620 108118582 108124352 108199155 108247042 108225799
3765.1A08225799j5176N5838J39987J54233Q4186M506L5930J57320J76001J52147J77097
$$ 108225799 108210623 108266461 108406448 108560681 108644867 108649373 108685303 108842623 109018624 109170771 109347868
3787.5A09347868J62685J00458L0577k4462k7776K420Q0359J53732J39404J27315R4867
$$ 109347868 109510553 109611011 109641588 109617126 109589350 109591770 109672129 109825861 109965265 110092580 110187447
3810A10187447j2386j10984j28233j12748p3672O9988J38605P5424K6238j2649p4088
$$ 110187447 110175061 110064077 109935844 109823096 109749424 109819412 109958017 110033441 110059679 110047030 109972942
3832.4A09972942j31595j16217K5689J68634K00307J83141J02961o6542k13266j15812
$$ 109972942 109841347 109725130 109750819 109919453 110119760 110302901 110405862 110339320 110126054 110010242
3852.8A10010242J93525K22003J04225J0157l6800j1349o413k6560K9981J15335J23226
$$ 110010242 110203767 110425770 110529995 110540152 110503352 110492003 110485590 110459030 110489011 110604346 110727572
3875.2A10727572K8909p6330n8222O819L3081O2978K5844m148N2690K5225j03974j64497
$$ 110727572 110756481 110680151 110621929 110628748 110661829 110724807 110750651 110746503 110799193 110824418 110720444 110555947
3899.7A10555947p8440Q0979J95658J83714R2876j1290r0003r9611j8334N8281K7812
$$ 110555947 110477507 110558486 110754144 110937858 111030734 111019444 110929441 110829830 110811496 110869777 110897589
3922.1A10897589j9610L516N019m3213k6381M6265O0642J6176l4761m3643q916q774
$$ 110897589 110877979 110881495 110886514 110843301 110816920 110863185 110923827 110940003 110905242 110861599 110852683 110843909
3946.6A10843909j5152L3915M7160j2351n1665k4450K4176L8564O223l0720l4535k4677
$$ 110843909 110828757 110862672 110909832 110897481 110845816 110821366 110845542 110884106 110890329 110859609 110825074 110800397
3971.1A10800397k4509j9228K241J5866R072k730p796j5473k8920k6382r238K312n72
$$ 110800397 110775888 110756660 110758901 110774767 110783839 110781109 110773313 110757840 110728920 110702538 110693300 110695612 110695040
3997.6A10695040
$$ 110695040
##END=$$ End of the data block
