##TITLE=DI 15-2121150-9 Add 001 - Item 3 $$ Begin of the data block
##JCAMP-DX=5.00 $$ ACD/SpecManager v 10.08
##SPECTROMETER/DATA SYSTEM=Alpha
##DATE=17 Dec 2015 08:07:50
##DATA TYPE=INFRARED SPECTRUM
##DATA CLASS=XYDATA
##ORIGIN=
##OWNER=
##NPOINTS=1667
##FIRSTX=599.57470703
##LASTX=3997.16503906
##MAXX=3997.16503906
##MINX=599.57470703
##MAXY=0.99372131
##MINY=0.92584956
##XFACTOR=1.0000000000
##YFACTOR=1.000000000000000e-9
##FIRSTY=0.92584956
##DELTAX=2.03937006
##XUNITS=1/CM
##YUNITS=ARBITRARY UNITS
##XYDATA=(X++(Y..Y))
599.6I25849557N31018P74979J251698J172423Q97229P72953M78864K61366J55985
617.9I32146072K40565J93357l71694m05968J32502M65333M50909j14620o82830k38598
638.3I31815028N28097L81947O9618K89798J03354k46346P7665K16544k52068n69701
658.7I32413936l79861j20878J43766R17674J755476J190185N80251M67360N44668
677.1I37512577N24938M82559L59595j38998o00934n68867j47939L50177N27621K60770
697.5I38561499N7817J67608K21610M3869l29554o34611p11560q06272j001716j130044
717.9I34438646r59277q06094j017332j045584n69344j20640p8320j3054N89490J603961
738.3I32022452K158046J667619N87821l69370o10173k28286K45929O72639Q62062
$$ y = [925849557, 926380575, 927155554, 928407252, 929579675, 930476904, 931249857, 931728721, 931990087, 932146072, 932386637, 932579994, 932208300, 931802332, 931934834, 932400167, 932851076, 932736456, 932053626, 931815028, 932343125, 932725072, 932794690, 933084488, 933187842, 932941496, 933019161, 933235705, 932983637, 932413936, 932034075, 931913197, 932056963, 932974637, 934730113, 935920298, 936500549, 936967909, 937512577, 938037515, 938520074, 938879669, 938740671, 938139737, 937570870, 937422931, 937773108, 938300729, 938561499, 938619316, 938786924, 939008534, 939052403, 938722849, 938088238, 937376678, 936570406, 935568690, 934438646, 933479369, 932673275, 931655943, 930610359, 930041015, 929920375, 929842055, 929829001, 930418491, 932022452, 934180498, 935848117, 936435938, 936066568, 935456395, 935228109, 935474038, 936146677, 937008739]
756.6I37008739R12666R66668Q01086M69149J48415K325l0995l8624J74702M94241
777I40908372O40750M41730J9253j76728k57313m61281n89430o08921l03626L42429
797.4I39955235O77943O36458N70059L68655J82032J34707j25289n20885q64089j103401
817.8I39911425j128912j116574j023829l05354J084327K324105K775490K777100K896189
836.1I48193967K911091K504349J949310J715005J666784J315534R18627O46829K20895
854.5I62042391k45273n06759n89668m97818k4021N94318O86705K93017O6936J7583
874.9I61837411j47045k80022k42234k09033m16756p02739q52465r18210j018524j095176
895.3I55955207r30130p81179r01579r84550p75397l48270j7881J38640M70519R08673
$$ y = [937008739, 937921405, 938888073, 939689159, 940158308, 940306723, 940309048, 940278053, 940239429, 940414131, 940908372, 941549122, 941990852, 942010105, 941833377, 941576064, 941114783, 940525353, 939916432, 939612806, 939955235, 940633178, 941269636, 941839695, 942208350, 942390382, 942525089, 942399800, 941878915, 941014826, 939911425, 938782513, 937665939, 936642110, 936336756, 937421083, 939745188, 942520678, 945297778, 948193967, 951105058, 953609407, 955558717, 957273722, 958940506, 960256040, 961174667, 961821496, 962042391, 961797118, 961290359, 960700691, 960202873, 960178852, 960773170, 961459875, 961752892, 961819828, 961837411, 961690366, 961410344, 961168110, 960959077, 960542321, 959839582, 958987117, 958068907, 957050383, 955955207, 955025077, 954243898, 953342319, 952357769, 951582372, 951234102, 951216221, 951354861, 951825380, 952734053]
915.7I52734053R63152O67750L39866O5863j64389m51029o73294n69343k65003j9908
936.1I52627718J41263J43767l1650j36316j26720j83939l00229l40641l93509m50910
956.5I50948834m23073m68612m78625k71142n5015m7982q0049k6941K7120M9651p4864
978.9I49099302k09391k50697m03345n76377n26785l10779j69814k24173l42488l42190
999.3I45743263l55542n41031o85692n12719r2686L30985O87718Q17597N18084R5427
1019.7I46005404Q106J13845J22666J41740K88844M65274O49274R20832J163781J292645
1040.1I51172411J332581J163483R03189Q11041P25686N56231M37021K26438m2200
1058.4I57285881Q524K23755K26498K06947K09034K9027n1796J15692J79947J18971
$$ y = [952734053, 953697205, 954364955, 954704821, 954770684, 954606295, 954155266, 953481972, 952912629, 952647626, 952627718, 952768981, 952912748, 952881098, 952744782, 952618062, 952434123, 952133894, 951793253, 951399744, 950948834, 950525761, 950057149, 949578524, 949307382, 949252367, 949204385, 949124336, 949097395, 949124515, 949174166, 949099302, 948889911, 948639214, 948235869, 947659492, 947132707, 946821928, 946652114, 946427941, 946085453, 945743263, 945387721, 944846690, 944160998, 943648279, 943555593, 943886578, 944574296, 945391893, 945909977, 946005404, 946013510, 946127355, 946250021, 946391761, 946680605, 947145879, 947795153, 948715985, 949879766, 951172411, 952504992, 953668475, 954571664, 955382705, 956108391, 956664622, 957101643, 957328081, 957285881, 957294405, 957518160, 957744658, 957951605, 958160639, 958189666, 958137870, 958253562, 958433509, 958552480]
1078.8I58552480J25289J13785R0897J55389K55525K87652K00332N5849M0710J65642
1099.2I60043550K57074L20375L89934N44667P45177P99954Q01444P84219O11305L39389
1119.6I65637088K33292K45214J40488J16706K25186L20494M51684N34773M70162L61800
1140I68736887L04520K32041J11818O2883Q9824Q2493L6240j00553k92719k90632k35200
1162.4I68737602m30166o19710n06401l59893n15282q83222j232922j253783o30975
1180.8I62305248N06878J596212K130449K149284J828074J163721M01795j62422m47333
1199.2I71471906n78642p19369q49962r17673r43422r66430r69291r07778q50797q13902
1219.5I62954640p15851o40750n47409k70129N3943K44319L05295L16143L60966M10914
$$ y = [958552480, 958677769, 958791554, 958882451, 959037840, 959293365, 959581017, 959781349, 959837198, 959877908, 960043550, 960300624, 960620999, 961010933, 961555600, 962300777, 963100731, 963902175, 964686394, 965297699, 965637088, 965870380, 966115594, 966256082, 966372788, 966597974, 966918468, 967370152, 967904925, 968375087, 968736887, 969041407, 969273448, 969385266, 969448149, 969537973, 969620466, 969656706, 969556153, 969263434, 968972802, 968737602, 968307436, 967687726, 967181325, 966821432, 966306150, 965422928, 964190006, 962936223, 962305248, 962812126, 964408338, 966538787, 968688071, 970516145, 971679866, 972081661, 971919239, 971471906, 970893264, 970173895, 969323933, 968406260, 967462838, 966496408, 965527117, 964619339, 963768542, 962954640, 962238789, 961598039, 961050630, 960780501, 960834444, 961078763, 961384058, 961700201, 962061167, 962472081]
1239.9I62472081M53592N73039P58767R28342J114965J368701J536369J555086J543045
1258.3I72303987J514017J356483J046836P88808P05838O98507O36220N53787N66601
1276.7I80171084N44072L31580J33217q762k52545l51906k49267j92463j06752O1751
1297I80080009J81436L08037M79817M63605K73049J62423J90198K98619M03405L95417
1317.4I83236015K08139j9431o8426l4869r2685j93655k75851l04699l08275k91943
1337.8I81854320r7037J27495J54733J67430J64568M77j57893k40028m43518p02500
1358.2I80828047o37412J7702P53224P85828M46975J34468m5836j5199K861k06709
1378.6I82063949l96609l22342j03593J50085L82840L49045K24888K40803K40386J71542
$$ y = [962472081, 962925673, 963498712, 964257479, 965185821, 966300786, 967669487, 969205856, 970760942, 972303987, 973818004, 975174487, 976221323, 977010131, 977715969, 978414476, 979050696, 979604483, 980171084, 980715156, 981046736, 981179953, 981171191, 980918646, 980566740, 980317473, 980125010, 980018258, 980080009, 980261445, 980569482, 981049299, 981512904, 981785953, 981948376, 982138574, 982437193, 982840598, 983236015, 983444154, 983424723, 983356297, 983321428, 983228743, 983035088, 982759237, 982454538, 982146263, 981854320, 981757283, 981884778, 982039511, 982206941, 982371509, 982371986, 982214093, 981974065, 981530547, 980828047, 980190635, 980208337, 980961561, 981747389, 982194364, 982328832, 982282996, 982267797, 982270658, 982063949, 981667340, 981344998, 981241405, 981391490, 981774330, 982123375, 982348263, 982589066, 982829452, 983000994]
1399I83000994O795k59161l64721l15726l26812k69771j20997j08719j99497j77085
1419.4I80865300j77265l17513m25339n07117n21659l75510k57074j64807o9201j88649
1439.8I77861166k92957l18706l89337l44813j48118r6083j11818K02358Q29339O87838
1460.2I77878869L36408L13938L37839J50800O9141M08828Q02279P42197N06937K79963
1480.6I81827199J42873j22130o06716j011729j063645j109302j572609k197027k203822
1499I72083092j790643j528561j559615r92358J206756K688229L387511L822505M052460
1517.3I81369376L165007K229273J404822N20170K75492J74940m3094j75536k08080
1535.7I88712370j90436L5345K75910L11255L55781J64449j6749n37j6450j30356o2942
$$ y = [983000994, 983007789, 982748628, 982383907, 982068181, 981741369, 981471598, 981350601, 981241882, 981042385, 980865300, 980688035, 980370522, 979945183, 979438066, 978916407, 978540897, 978283823, 978119016, 978049815, 977861166, 977568209, 977249503, 976860166, 976515353, 976367235, 976271152, 976159334, 976361692, 977191031, 977878869, 978215277, 978529215, 978867054, 979017854, 979086995, 979495823, 980298102, 981040299, 981547236, 981827199, 981970072, 981847942, 981241226, 980229497, 979165852, 978056550, 976483941, 974286914, 972083092, 970292449, 968763888, 967204273, 966211915, 967418671, 970106900, 973494411, 977316916, 981369376, 984534383, 986763656, 988168478, 988688648, 988964140, 989139080, 989095986, 988920450, 988712370, 988521934, 988557279, 988833189, 989144444, 989500225, 989664674, 989647925, 989647388, 989630938, 989500582, 989437640]
1558.1I89437640J89244P272j62065k06768j56164n9605j57893l67939n50986n31494
1578.5I87441242l88623k21610L7551K19882J07705j78456m00960m70877m06563l73781
1598.9I85365510n19156p56085o90043k09749L62694P42436Q10384R04382J170992
1617.2I87181365Q62062M35830L46601K41220Q6724N9128M2737J7166Q4638J25766
1637.6I89483237P6473m6372k26438k55526J5736R8109k8908K35856L74019J13547
1658I89839733k0922O1393J30773j7345o7890L7432K9623J7405O318j22368k25902
1680.5I89668250k34902M8876K82645J79827J10388l9816k28345l13461j69396J47283
1700.9I89451349J41203j2994l4630p7009j81198l36349m35770j97470J77443J19686
$$ y = [989437640, 989626884, 989634156, 989472091, 989265323, 989109159, 989049554, 988891661, 988523722, 987972736, 987441242, 987052619, 986831009, 986868560, 987088442, 987196147, 987017691, 986616731, 986145854, 985739291, 985365510, 984846354, 984090269, 983400226, 983190477, 983553171, 984295607, 985105991, 986010373, 987181365, 988043427, 988479257, 988825858, 989067078, 989153802, 989212930, 989255667, 989272833, 989357471, 989483237, 989559710, 989513338, 989286900, 989031374, 989047110, 989145219, 989116311, 989352167, 989726186, 989839733, 989818811, 989880204, 990010977, 989993632, 989925742, 989963174, 989992797, 990010202, 990016520, 989894152, 989668250, 989433348, 989482224, 989764869, 989944696, 990055084, 990015268, 989786923, 989473462, 989304066, 989451349, 989592552, 989579558, 989544928, 989467919, 989286721, 988950372, 988514602, 988317132, 988494575, 988614261]
1721.2I88614261m2200j12355k11477l10719k05457J88410L62694R9361J37806K59221
1741.6I88779545J05619o4254l8981K47836L85404J15335m8280J371K9325J18375K08378
1764.1I89839673J86563J59263M8518P5221K32816J56284O6280O5327j2756q4102L457
1786.5I90736544j4663j51395n3764J56224J59144K5988j17898q0407O7115Q4698K7240
1808.9I90838826R6321J88231J17660M291l5166j30535k44796j56581k6822K8789J16646
1831.4I90796864P1824l2723j7941k444p1406l6002O2347j4901o0320J0133P5995P2301
1855.9I90853727J4841j2099l7492q5294j16229r3043J6213R6738M9829p6711r2923
1878.3I90517557L7491R5487L2305n5492j07646m7028N2274R9361R1314K5093j7106
$$ y = [988614261, 988572061, 988459706, 988248229, 987937510, 987732053, 987920463, 988283157, 988382518, 988520324, 988779545, 988885164, 988820910, 988781929, 989029765, 989415169, 989530504, 989482224, 989483595, 989512920, 989631295, 989839673, 990026236, 990185499, 990234017, 990309238, 990542054, 990698338, 990764618, 990829945, 990817189, 990733087, 990736544, 990721881, 990570486, 990516722, 990672946, 990832090, 990858078, 990740180, 990659773, 990726888, 990811586, 990838826, 990935147, 991123378, 991241038, 991245329, 991210163, 991079628, 990834832, 990678251, 990651429, 990680218, 990796864, 990868688, 990835965, 990818024, 990815580, 990744174, 990708172, 990770519, 990755618, 990695298, 990705431, 990781426, 990853727, 990868568, 990856469, 990818977, 990733683, 990617454, 990524411, 990540624, 990637362, 990687191, 990610480, 990517557, 990555048, 990650535, 990682840, 990627348, 990519702, 990472674, 990524948, 990624309, 990715623, 990740716, 990723610]
1900.7I90723610j1087J9253L1888M7684Q2552J2994j13427j25051k2292O7711J30892
1923.2I90844727J01625o198l3856L278K8551m232m9949m5418n96O6578M9770l0518
1947.6I90923762l0696J4007j490r775J7762o497j6808j5796l9875L0875P9989K4677
1972.1I90970135m2081j10090p7426n126K4080P2896K9326q8036j19686p6711K6226
1994.5I90603507J23441Q5115j2338k5272K5987N4598J1504r6262j82390q3566R0063
2017I90594387J10149J01030R8110j6988p0035L1531Q4042O974p2181n1797k146j8417
2041.4I90794659n8115k4557L6478J6928l6121n4061k7180L0697N2631R357l0398l9935
2065.9I90670383K2531J66833J24395j28985j73032Q702P2003M7147N9724M9651l457
$$ y = [990723610, 990712523, 990731776, 990763664, 990811348, 990893900, 990906894, 990793467, 990668416, 990646124, 990713835, 990844727, 990946352, 990940154, 990906298, 990909576, 990938127, 990933895, 990883946, 990838528, 990837932, 990904510, 990954280, 990923762, 990893066, 990907073, 990905583, 990895808, 990913570, 990907073, 990890265, 990874469, 990834594, 990865469, 990945458, 990970135, 990928054, 990817964, 990740538, 990735412, 990759492, 990832388, 990861714, 990773678, 990653992, 990577281, 990603507, 990726948, 990812063, 990799725, 990774453, 990800440, 990855038, 990866542, 990770280, 990587890, 990504324, 990594387, 990704536, 990805566, 990903676, 990886688, 990816653, 990848184, 990932226, 990939200, 990867019, 990815222, 990813076, 990794659, 990736544, 990711987, 990748465, 990765393, 990729272, 990675211, 990648031, 990678728, 990731359, 990740716, 990710318, 990670383, 990692914, 990859747, 990984142, 990855157, 990682125, 990690827, 990762830, 990809977, 990869701, 990919352, 990915895]
2088.3I90915895l8505l0279q0824r4474K5154P5936K2948k9505m6432L2902R4474
2110.8I90847290K0086m7505k9504L7015N9187j0014N842J08063M7445j18077r6798
2133.2I90823030N3943N8055n6923j2159J30415O2823n7876k6286J0014J8716q226
2155.6I90995526J9551J34289M4405j08301r8706m6134M2499O3896L57K2054M1068
2178.1I91110504n0247j19209p9751J251J2517j5437L755K0683K9146N0485M2618j1325
2202.5I90994990o3419p4625j5200Q4222J28090Q5473m3034j48714r2745O0022O7353
2225I90982413n1796p3850n4002k5869K9088J3172j0848O557J19N5909J44243Q2433
2249.4I91097569j9907m3035m6730n2095m7028k622O9320P3910J6331P749K0564k3187
$$ y = [990915895, 990877390, 990847111, 990766287, 990671813, 990696967, 990772903, 990795851, 990766346, 990719914, 990752816, 990847290, 990867376, 990819871, 990790367, 990827382, 990886569, 990876555, 990882397, 990990460, 991037905, 990919828, 990823030, 990876973, 990935028, 990878105, 990865946, 990996361, 991059184, 991001308, 990975022, 990985036, 991003752, 990995526, 991015077, 991149366, 991193771, 991085470, 990986764, 990940630, 990983129, 991047025, 991047382, 991069436, 991110504, 991060257, 990941048, 990861297, 990862548, 990875065, 990859628, 990863383, 990884066, 990913212, 990963697, 991006315, 990994990, 990931571, 990856946, 990841746, 990925968, 991054058, 991139531, 991096497, 990947783, 990855038, 990915060, 990982413, 990930617, 990856767, 990802765, 990776896, 990805984, 990819156, 990808308, 990814865, 990814984, 990870893, 991015136, 991097569, 991077662, 991034627, 990987897, 990935802, 990888774, 990886152, 990955472, 991029382, 991045713, 991053462, 991074026, 991050839]
2273.9I91050839o7710l6717K0206J6332l4750l0339M6731Q5949K563r6023l6657J2756
2298.4I90933180l2544m828L4570K027l1412K7955R9242L9458j5616L2067M8756j2517
2322.9I91120338j31011j25706N5254J54257J80244N0128j56880p4387J61589J65224
2343.3I91399050j06156j88887P2062L83496L97205P4208l6299K9445o5863j46986
2363.6I91811275j17301j45615l93033l98635L3557J71065n8233j53542n2512O5267
2384I90762293J13964P1943l8504r0182M828J14023L2485q3745k2828N8234M5001J2756
2408.5I90980268N185K444L1412N5909j0550j02461p8201K1458L7491k2113k9683N9545
2433I90950704J02400K9445k2292J9669P2659J0132p8737k6167J9372l4571j5914J2934
$$ y = [991050839, 990983129, 990946412, 990966618, 990982950, 990948200, 990917861, 990964592, 991050541, 991053104, 990957081, 990920424, 990933180, 990900636, 990895808, 990930378, 990932405, 990900993, 990928948, 991028190, 991067648, 991052032, 991084099, 991132855, 991120338, 990989327, 990863621, 990918875, 991073132, 991253376, 991303504, 991146624, 991072237, 991233826, 991399050, 991292894, 991104007, 991176069, 991559565, 991956770, 992030978, 991994679, 992024124, 991958261, 991811275, 991693974, 991548359, 991155326, 990756691, 990790248, 990961313, 990903080, 990749538, 990697026, 990762293, 990876257, 990948200, 990909696, 990819514, 990824342, 990938365, 990970850, 990887105, 990864277, 990922511, 990967512, 990980268, 990985453, 990987897, 991019309, 991075218, 991064668, 990962207, 990884006, 990905464, 990942955, 990920842, 990891159, 990950704, 991053104, 991082549, 991060257, 991079926, 991152585, 991162717, 991083980, 991057813, 991077185, 991042614, 991026700, 991039634]
2457.5I91039634o5625j35958j35839n3287P4268J02758K0087k3484j9431l5227N365
2479.9I90773261O1392K9803m7565q1777R298R9420O5029J8120o616l4452k1398K9981
2504.4I90894496P6473N6982l6001o4731o795K7121K8371M77p4029q0347P7844J78933
2528.8I91078794O2823q9585j33753n9545L6299n96j02997p5281L1650J01865J24931
2551.3I90974605N4836l3199n2810o1393m3273J0133N7161N2988k2769n3644J0133
2573.7I90892768O7770L3260n7757p6831M2499J18732J0312p3314Q404P5400M113n2750
2598.2I90992606n7340p3791j9431O8009J05262J10209M0293q4937q8334J2636K1458
2620.6I91026640l0220k2769K4438O0201O3717K9862o4790j55747j23501j8716Q6666
$$ y = [991039634, 990974009, 990838051, 990702212, 990648925, 990723193, 990825951, 990846038, 990822554, 990803123, 990767896, 990773261, 990834653, 990864456, 990816891, 990735114, 990744412, 990843832, 990908861, 990926981, 990920365, 990885913, 990864515, 990894496, 990970969, 991027951, 990991950, 990927219, 990920424, 990947545, 990975916, 990976393, 990902364, 990822017, 990899861, 991078794, 991141617, 991052032, 990918279, 990858734, 990895033, 990894437, 990791440, 990716159, 990747809, 990849674, 990974605, 991029441, 990996242, 990943432, 990882039, 990838766, 990848899, 990906060, 990959048, 990936279, 990882635, 990892768, 990960538, 990993798, 990936041, 990859210, 990901709, 991020441, 991030753, 990957439, 990965843, 991041243, 991045356, 990992606, 990935266, 990861475, 990842044, 990910053, 991015315, 991125524, 991165817, 991080880, 990992546, 991005182, 991026640, 990996420, 990973651, 990998089, 991058290, 991122007, 991151869, 991087079, 990931332, 990807831, 990789115, 990875781]
2643I90875781J47402J14977M2439k3484n1976k5391j0133k3127k5093K5570J08123
2665.5I91155088J05500K5153r9837j90139q4222j788n5909j907J00434P0452k5689
2687.9I90997136p2837n4777k7418l2723J5974J08421Q9526J3113j5318l2246m8578
2710.3I90940273l6061l4511p7486o4254K7597O7532L4213l517O795k741p6533m8876
2734.8I90732431P6175J39475J02103k8968q8930k1100J788p272L7849L9935n3167
2757.2I90930319r4712j1384P3075M5121j2637l7789m0114J9491O378p4625j9908O4253
2781.7I90847468j5556j09971m7088l397p212L6001K5332m888k2471j9312P2420O9618
2806.2I90820944p1644j13905n9843l1948l0577L338L1471P212j4246o4611j39773
$$ y = [990875781, 991023183, 991138160, 991180599, 991157115, 991105139, 991079748, 991069615, 991046488, 991021395, 991046965, 991155088, 991260588, 991285741, 991185904, 990995765, 990911543, 990909755, 990853846, 990851939, 990952373, 991022825, 990997136, 990924299, 990869522, 990842104, 990809381, 990825355, 990933776, 991023302, 991036415, 991021097, 990988851, 990940273, 990904212, 990869701, 990792215, 990727961, 990755558, 990823090, 990857303, 990853786, 990860581, 990857840, 990781307, 990732431, 990808606, 990948081, 991050184, 991021216, 990932286, 990911186, 990912974, 990905702, 990943551, 990983486, 990930319, 990835607, 990824223, 990897298, 990942419, 990929782, 990891993, 990851879, 990871370, 990877748, 990803123, 990783215, 990847468, 990831912, 990721941, 990674853, 990671456, 990664244, 990700245, 990725577, 990720689, 990698218, 990678906, 990751326, 990820944, 990749300, 990635395, 990575552, 990543604, 990513027, 990516365, 990547836, 990555048, 990540802, 990476191, 990336418]
2828.6I90336418j27613j2398P0989k8193j50204p9930k0742r894P5459m530j79052
2851I89870310j38939m5359n1558q1181j63317k10702j14382m1425p7367j16408k3961
2873.5I88805711J56641J75357N7459O080K026k146M173m8757p1227N3048J10447J312
2897.9I89250124r5070j45972j43766q9824j34886j66177o2645n901k0027n2392p8440
2920.4I88255024o0380r9837j01567Q8632K38777J28507k4736L3439J54495J68800
2940.8I88781154Q8811K4319P8797M7803r8109j32740j51157j40727J0133L1114j36316
2963.2I88403082j22249P2241J50382J67072K27630K42472K02536J67609J18613Q0108
2983.6I89709496J10448J63674J50919M4108k9266j371P570m0830o8902j5021K0981
$$ y = [990336418, 990208805, 990196407, 990267396, 990239203, 990088999, 990009069, 989988327, 989978433, 990053892, 990049362, 989870310, 989731371, 989686012, 989634454, 989553273, 989389956, 989179254, 989064872, 989023447, 988946080, 988829672, 988805711, 988962352, 989137709, 989195168, 989201248, 989203274, 989201128, 989205301, 989156544, 989085317, 989138365, 989248812, 989250124, 989155054, 989009082, 988865316, 988775492, 988640606, 988474429, 988411784, 988405883, 988385856, 988333464, 988255024, 988194644, 988094807, 987993240, 988081872, 988320649, 988449156, 988424420, 988457859, 988612354, 988781154, 988869965, 988894284, 988973081, 989020884, 988922775, 988790035, 988638878, 988498151, 988508284, 988539398, 988403082, 988280833, 988353074, 988503456, 988670528, 988898158, 989140630, 989343166, 989510775, 989629388, 989709496, 989819944, 989983618, 990134537, 990178645, 990149379, 990148008, 990155578, 990114748, 990045846, 990030825, 990051806]
3006I90051806n007R4235K11120Q3267l0577M2558N5611N3644J09554N6386j52469
3028.5I90570128k89142j41323N1618Q0407Q046q3804r9540n1498M7922R7692j7762
3050.9I90172744j10686m6432N9009R4771O9261J1742l8445M76Q6189J37389J32739
3073.3I90568757R9480J00911N0664o4671m8399L4630J3530j1980r120k741K6106m7564
3097.8I90709603j68681j2935K78175K14339p1347j30177K9981N5671j38700j76012
3118.2I90589917k0445L4094l1054j21534p2062N7161O3896J20r1196j23500j0670
3140.6I90274727J12176Q2314J729L4451O2347j9372j25050j38104k8014M7862p9512
3163.1I90225554j51635K8134O2942r0480m2557R5963J09732K5153j05500j31249j27852
$$ y = [990051806, 990046799, 990141034, 990352154, 990435421, 990404844, 990447402, 990503013, 990556657, 990666211, 990722597, 990570128, 990280986, 990139663, 990191281, 990271688, 990279734, 990195930, 990096390, 990044892, 990092814, 990190506, 990172744, 990062058, 990015626, 990074635, 990169406, 990238667, 990250409, 990211964, 990212440, 990298629, 990436018, 990568757, 990668237, 990769148, 990819812, 990755141, 990706742, 990741372, 990754902, 990742922, 990733802, 990731061, 990757167, 990709603, 990540922, 990527987, 990806162, 991020501, 990949154, 990818977, 990848958, 990904629, 990765929, 990589917, 990569472, 990603566, 990572512, 990450978, 990378916, 990436077, 990499973, 990500093, 990408897, 990285397, 990274727, 990386903, 990469217, 990470946, 990505397, 990567744, 990548372, 990423322, 990285218, 990257204, 990305066, 990225554, 990073919, 990102053, 990164995, 990074515, 990031958, 990127921, 990237653, 990262806, 990157306, 990026057, 989898205]
3185.5I89898205j22309M0591P5698j05799o0617J54793O6161j31309p2062J4961n663
3207.9I89752650l4451j29223j39356M173K2709Q94L6240j0252m6552k7299m0292L4988
3232.4I89424229J34349K1696j32203j20700K4915L6120j31249j06871P6651J00553
3252.8I89327490j09851k04146k3246K9326n1201q1360j32859p0929M77n1916J132
3275.2I88632917M6134K3187Q7082O2466q1778q1360J5497j8477j09375m3213N3405
3297.7I88586485k7597n5790k6345r3221l6300K5511p2658k9862J28806J11460j2993
3320.1I88497496q5473r6679p0572k7239m173m8995j17957j3352J45555L2186j90675
3342.5I88020122j70231M8280J00255K0921K5749j1801m6432j6392q5830j72019j13964
$$ y = [989898205, 989775896, 989816487, 989892185, 989786386, 989725769, 989880562, 989946723, 989815414, 989743352, 989758313, 989752650, 989718199, 989588976, 989449620, 989453793, 989476502, 989477396, 989513636, 989503384, 989456832, 989429533, 989389241, 989424229, 989558578, 989580274, 989448071, 989327371, 989352286, 989388406, 989257157, 989150286, 989226937, 989327490, 989217639, 989013493, 988990247, 989019573, 988968372, 988887012, 988754153, 988683224, 988683701, 988631785, 988632917, 988679051, 988702238, 988789320, 988851786, 988770008, 988688648, 988704145, 988685668, 988576293, 988533080, 988586485, 988558888, 988503098, 988476753, 988383532, 988347232, 988372743, 988300085, 988270223, 988399029, 988510489, 988497496, 988412023, 988315344, 988244772, 988217533, 988213360, 988164365, 988046408, 988033056, 988178611, 988210797, 988020122, 987849891, 987898171, 987998426, 988019347, 988045096, 988033295, 987986863, 987970471, 987884641, 987712622, 987598658]
3364.9I87598658m5121R5606L60608M12047J69635n0426p9036o1393K0326J61946J16944
3387.4I88699794J550K0802O0379n8532j88052n0068R9063Q3327N7757l2425q5116
3409.8I88608479p2240j23263j61290k0444J84118J26839O7592J52945N0247o5088
3430.2I88747895k6882l4094k9743J8299L9637L4154J2278J27435K38836J19030J1564
3452.6I89258409R8526J68800R6262O5982J10328Q2612k0206o6399L4690J01149K5391
3475.1I89955544M8519J79112J43468j5855k9087P749K1577J00076J10984J19805L7074
3497.5I90678966k41637k54691m053K1398j4663J52409K03610j5795j96934j04845
3517.9I90223765N9069M3988J2100M4584Q1777K43009L48448J70231L9458O8784N2214
$$ y = [987598658, 987553537, 987649143, 988009751, 988421798, 988591433, 988541007, 988461971, 988400578, 988420904, 988582850, 988699794, 988701344, 988722146, 988782525, 988723993, 988535941, 988485873, 988584936, 988668263, 988726020, 988693595, 988608479, 988536239, 988412976, 988251686, 988231242, 988415360, 988542199, 988609791, 988762736, 988812983, 988747895, 988721013, 988686919, 988657176, 988675475, 988715112, 988749266, 988761544, 988888979, 989127815, 989246845, 989258409, 989356935, 989525735, 989621997, 989687979, 989798307, 989880919, 989860713, 989794314, 989829004, 989930153, 989955544, 990004063, 990183175, 990326643, 990310788, 990281701, 990289450, 990311027, 990411103, 990522087, 990641892, 990678966, 990437329, 990182638, 990178585, 990199983, 990185320, 990337729, 990541339, 990525544, 990328610, 990223765, 990282834, 990326822, 990338922, 990383506, 990465283, 990708292, 991056740, 991226971, 991266429, 991335213, 991387427]
3540.3I91387427P7426J30952R2864J8954k4557j1563J43230K06470M411j18673p6950
3562.8I91829991o2942q3327J9371J95980K30551R2149j35959j15335P0632K3484m6551
3585.2I92018044J0908R298J371Q3923J14262J18435K34484J10627k15412k19762n6028
3607.6I92210150n7698K5332J42396k0146j11640O4433J82271J26302j7524j6808R1731
3630.1I92618799L0637K682K0027N7280L7671p7010k37524l33429L338M10855J21474
3652.5I92654800j1265K29299K45154J9431n2392l4094j17600p0989N2690j66833p0453
3674.9I92677748M23193L61979j1265k65777l56317l24130K1637L74019K66611O3360
3695.3I93231058j1682m6075j3768L3080j14262j94013N5551M12107K16603o1512m768
$$ y = [991387427, 991464853, 991595805, 991688669, 991707623, 991683066, 991671503, 991814733, 992021203, 992025614, 991906941, 991829991, 991767049, 991683722, 991703093, 991899073, 992129624, 992221773, 992085814, 991970479, 992041111, 992064595, 992018044, 992028952, 992038250, 992039621, 992123544, 992237806, 992356241, 992590725, 992701352, 992485940, 992266178, 992210150, 992152452, 992177784, 992320180, 992300034, 992188394, 992252827, 992435098, 992561400, 992543876, 992527068, 992618799, 992649436, 992652118, 992672145, 992729425, 992767096, 992690086, 992452562, 992119133, 992122471, 992533326, 992654800, 992643535, 992872834, 993117988, 993137419, 993085027, 993050933, 992933333, 992862344, 992915034, 992748201, 992677748, 993100941, 993462920, 993451655, 993185878, 992829561, 992505431, 992527068, 992901087, 993167698, 993231058, 993219376, 993173301, 993159533, 993192613, 993078351, 992884338, 992939889, 993351996, 993568599, 993507087, 993502319]
3717.7I93502319n0068j45555m8220o3777k35319l17275j79947K28703L42250q8215
3738.1I92944896k87771l8922L19183n0902l47674J76072N14388J91569l1650Q8752
3758.5I93477941J64508r7394k69949k39790k6166K52724K03073k6584j38462j25765
3778.9I93174136p8738r8348O259K14636J60158m4108j33991j11461j23679j31011
3799.3I92833853k8670o3717p332L38197L10898j12415l41534k30730N245J67609J20222
3821.8I92991626j24871j12713R4652K24889K43902J84417L7968q0049p3195j37985
3842.1I93248641q3506P7606q1361k43962K16604N73039l5703l52145l17812m9293
3862.5I92952108J78218O5327j6093J15871K35617R477m70638n93722k68817O9201
$$ y = [993502319, 993452251, 993306696, 993258476, 993194699, 992959380, 992642105, 992462158, 992690861, 993033111, 992944896, 992657125, 992618203, 992937386, 992886484, 992538810, 992714882, 993229270, 993420839, 993389189, 993477941, 993642449, 993545055, 993275106, 993035316, 993009150, 993261874, 993464947, 993438363, 993299901, 993174136, 993095398, 992997050, 993003309, 993217945, 993378103, 993333995, 993200004, 993088543, 992964864, 992833853, 992805183, 992741466, 992734134, 993072331, 993383229, 993270814, 992929280, 992698550, 992703795, 992871404, 992991626, 992866755, 992754042, 992848694, 993073583, 993317485, 993501902, 993539870, 993459821, 993386626, 993248641, 993165135, 993242741, 993161380, 992917418, 993134022, 993707061, 993671358, 993319213, 993001401, 992952108, 993130326, 993195653, 993179560, 993295431, 993531048, 993540525, 993069887, 992476165, 992207348, 992276549]
3882.9I92276549L80993M21882K9266j55270n7757l4511J1265J23680M1842o8843K4140
3905.4I92993236K31325K98441J4722k45333q9228J40011J9908j35123k3187M4525
3925.8I93249297q8632q5592K8729J6928O0797R2268N7816J84834K04861p4744j93417
3948.2I93453145m2558L6002o4433j38581j1980R9778O8128O1154N0307j6392j14023
3970.6I93380547k02001j27255L9100J17898J87874J02937j69813k39671K1398K91765
3991I93402779K02596n5432p3373
3997.1I93476570
$$ y = [992276549, 992657542, 993079424, 993108690, 992953420, 992895663, 992861152, 992872417, 992996097, 993037939, 992969096, 992993236, 993224561, 993523002, 993537724, 993292391, 993203163, 993343174, 993363082, 993227959, 993204772, 993249297, 993160665, 993075073, 993103802, 993120730, 993181527, 993273795, 993331611, 993516445, 993721306, 993646562, 993453145, 993410587, 993446589, 993382156, 993243575, 993231595, 993331373, 993399501, 993460655, 993510962, 993494570, 993380547, 993178546, 993051291, 993090391, 993208289, 993396163, 993499100, 993329287, 993089616, 993111014, 993402779, 993605375, 993549943, 993476570]
##END=$$ End of the data block
