##TITLE=DI 15-2121150-9 - Add 002 $$ Begin of the data block
##JCAMP-DX=5.00 $$ ACD/SpecManager v 10.08
##SPECTROMETER/DATA SYSTEM=Alpha
##DATE=18 Dec 2015 08:30:28
##DATA TYPE=INFRARED SPECTRUM
##DATA CLASS=XYDATA
##ORIGIN=
##OWNER=
##NPOINTS=1667
##FIRSTX=599.57470703
##LASTX=3997.16503906
##MAXX=3997.16503906
##MINX=599.57470703
##MAXY=0.98335338
##MINY=0.92179704
##XFACTOR=1.0000000000
##YFACTOR=1.000000000000000e-9
##FIRSTY=0.92179704
##DELTAX=2.03937006
##XUNITS=1/CM
##YUNITS=ARBITRARY UNITS
##XYDATA=(X++(Y..Y))
599.6I21797037J005769J242757J268148R50813P29382M79043J94490L10898N77986
617.9I28556323N38349M61579M55081N36442N19395L37660J35541k7299K08318N48661
638.3I32270050N30005M82022N76794N03779K35498O4194l0398o0201L2365O5089K51293
660.8I34920490P00772Q52108P34925O58274N13494L76403M22001P24673R45389Q55625
681.1I41704154O11186K59399j49726j69158L63469Q72016R49859P06017L75331P9572
701.5I45602119j04964q9109P2420J43170P2301k8193j69695l07202l56734l63946
721.9I44470167m73261o77049q01325p81893o35386m39942j61826L72231R40203J126826
742.3I42938745O53029l04878j008451q42929M70698J996040K097368J046419M43936
$$ y = [921797037, 922802806, 924045563, 925313711, 926264524, 926993906, 927472949, 927667439, 927978337, 928556323, 929094672, 929556251, 930011332, 930547774, 931067169, 931404829, 931540370, 931513071, 931721389, 932270050, 932800055, 933282077, 933858871, 934362650, 934598148, 934662342, 934631944, 934571743, 934604108, 934669197, 934920490, 935621262, 936473370, 937208295, 937866569, 938380063, 938756466, 939178467, 939903140, 940848529, 941704154, 942315340, 942574739, 942425013, 942255855, 942619324, 943491340, 944441199, 945147216, 945522547, 945602119, 945497155, 945408046, 945480466, 945623636, 945695937, 945667744, 945498049, 945190847, 944834113, 944470167, 943996906, 943319857, 942518532, 941736639, 941101253, 940661311, 940499485, 940871716, 941811919, 942938745, 943591774, 943286896, 942278445, 941435516, 941906214, 943902254, 945999622, 947046041, 947489977]
760.7I47489977O16729P42078N11408L35753L99589L47555J03831n1915p153P6354
781.1I50564206p928j65462j57357L1829L5525p5341O2526K78830L53754J53780j58012
803.5I50916350k24173k06053l97802o14166o70731o01828l21269O9260L56615N57005
823.9I48863208O70493Q05080J030207J102089R82404Q08478O04271L71874J62184
842.3I55400288J15037L13640N78582N88059M68493M98652M02809L1054j22905J23083
862.7I58396792L54052K90394J1027j19150P629J25707K15649K81394J66654j4603
883I59715545j07288j22786n4121m5001j68622j32859J01209J71661R0242J19150J89423
905.5I59756553J32263M7445O3121P6175O0141K0266k01106n07832n70416m71771m39703
$$ y = [947489977, 948106706, 948848784, 949360192, 949695945, 950095534, 950443089, 950546920, 950495005, 950487852, 950564206, 950556278, 950390816, 950233459, 950265288, 950300813, 950225472, 950287998, 950566828, 950920582, 951074362, 950916350, 950692177, 950486124, 950088322, 949474156, 948803425, 948201597, 947880328, 947949588, 948306203, 948863208, 949533701, 950338781, 951368988, 952471077, 953453481, 954261959, 954866230, 955238104, 955400288, 955515325, 955828965, 956407547, 956995606, 957464099, 957962751, 958365560, 958396614, 958273709, 958396792, 958750844, 959041238, 959052265, 958933115, 958940744, 959066451, 959282100, 959563494, 959730148, 959715545, 959608257, 959485471, 959431350, 959386349, 959217727, 959084868, 959186077, 959357738, 959447980, 959567130, 959756553, 959888816, 959936261, 959999382, 960075557, 960135698, 960155964, 959954858, 959447026, 958876610, 958404839, 957965136]
927.9I57965136l80338k14815l1173J3888K0683J40667K16603K31326K43127J53780
948.3I58358884q404j25349r0301Q2612J57595N2392p9930j26958j50680k55227l56615
970.7I57458019l88145m04656l64602l41594m19378m12345l13103k43962k23875k76566
991.1I54069793l44693l78848m50611n62012n65350m80056m02510l44932k79129j48296
1011.5I50113356m1067N424N8531O4314Q3804K84374N34653O30081O20306N94794O41644
1034I53590214Q15749R15945Q17716O93560N73754M58181M54605M78625L90410K58744
1054.4I59447503K07603J42515j848j02997p4625L7551J1802j96695l28303l84688
1074.7I58757818n45740p55489q56042o72221j28448N20229R12666R82404Q17955N05268
$$ y = [957965136, 957584798, 957369983, 957338810, 957352698, 957373381, 957514048, 957730651, 957961977, 958205104, 958358884, 958350480, 958225131, 958134830, 958217442, 958375037, 958427429, 958347499, 958220541, 958069861, 957814634, 957458019, 957069874, 956665218, 956300616, 955959022, 955539644, 955127299, 954814196, 954570234, 954346359, 954069793, 953725100, 953346252, 952895641, 952333629, 951768279, 951288223, 950885713, 950540781, 950261652, 950113356, 950072289, 950077713, 950136244, 950200558, 950284362, 950568736, 951103389, 951733470, 952353776, 952948570, 953590214, 954405963, 955321908, 956139624, 956833184, 957406938, 957865119, 958319724, 958798349, 959188759, 959447503, 959655106, 959797621, 959795773, 959692776, 959618151, 959655702, 959667504, 959470809, 959142506, 958757818, 958212078, 957456589, 956600547, 955928326, 955799878, 956320107, 957232773, 958215177, 959033132, 959538400]
1095.1I59538400K05517J7643q2731j38462j11520J7345J80959M41254P83205R11653
1115.5I61763263P70211O39200N88834M79520L71873L48687L38495L63350L63946K64287
1135.9I66291666J93357J64390J00732O2168M4167l3439j43468k65658m36723n99027
1156.3I65378165o59823o41823n70238m98950m72546l45230j14977J60932N05627P71641
1176.7I63512778Q40664Q14140P99358P15554N20527L06785J37627j1980k22922m50492
1197.1I66962039o00755p22766q52286r09508q71598q26061p93398o80387n52475n29409
1217.5I59623396m99367m68552n03838m76182m23849m34756m31359m28140n12123n95093
1237.9I54850137n29885l98398k96831j69873l8147P1585K00332L45170M56095N35130
$$ y = [959538400, 959743917, 959761560, 959678829, 959540367, 959428847, 959446192, 959627151, 960068405, 960851610, 961763263, 962533474, 963172674, 963761508, 964241028, 964612901, 964961588, 965300083, 965663433, 966027379, 966291666, 966485023, 966649413, 966750145, 966812313, 966856480, 966823041, 966679573, 966413915, 965977192, 965378165, 964718342, 964076519, 963506281, 963007331, 962534785, 962189555, 962074578, 962235510, 962741137, 963512778, 964353442, 965167582, 965966940, 966682494, 967203021, 967509806, 967647433, 967635453, 967412531, 966962039, 966361284, 965638518, 964786232, 963876724, 963005126, 962179065, 961385667, 960705280, 960152805, 959623396, 959124029, 958655477, 958151639, 957675457, 957251608, 956816852, 956385493, 955957353, 955445230, 954850137, 954320252, 953921854, 953625023, 953455150, 953417003, 953488588, 953688920, 954034090, 954490185, 955025315]
1258.3I55025315O66380Q40545R34482R10520Q70586Q69154P84994O31868O28174Q17656
1278.7I62979674J029969J154124J155019J007438P91252O33597N35607L92854K69175
1297I69948709K95579L87788L76761K30730P0393m2379j57654k57850l32892m34101
1317.4I70085084n56290p15494r09686j058578j126945j107693j034022r69350r24528
1335.8I61682498o80625P5579R66727J422227J518309J435518J308501J134336R54270
1354.2I69817340Q65817P16031M83215M68850O88911P31825O71804N81801L80278L49700
1374.5I75755572L85881J97708M2260q0764k83957k68340L9339J52052j2994r8407
1394.9I75828350J2695R6083O1333j29819k70724j74403j55568k46704l13878m53889
$$ y = [955025315, 955691695, 956532240, 957466722, 958377242, 959247828, 960116982, 960901976, 961533844, 962162018, 962979674, 964009643, 965163767, 966318786, 967326224, 968117476, 968751073, 969286680, 969679534, 969948709, 970244288, 970632076, 971008837, 971239567, 971309960, 971267581, 971109927, 970852077, 970519185, 970085084, 969528794, 968813300, 967903614, 966845036, 965718091, 964610398, 963576376, 962607026, 961682498, 961001873, 961077452, 962044179, 963466406, 964984715, 966420233, 967728734, 968863070, 969817340, 970683157, 971399188, 971882403, 972351253, 973040164, 973771989, 974443793, 975025594, 975405872, 975755572, 976141453, 976339161, 976381421, 976300657, 976016700, 975748360, 975787699, 975939751, 975926757, 975828350, 975841045, 975937128, 975998461, 975868642, 975597918, 975423515, 975267947, 975021243, 974707365, 974253476]
1415.3I74253476n76556l02613R4950N3525k3603o2645j62303k15948l24070l95060
1435.7I72339153j12176K9624k06769m34696n59926m91739k12371r6142k75493l55422
1456.1I69624043L63826P62046L71873J59442L27230L81947J86502J65165M27127M71413
1476.5I73240614K48313j14679m50671p47264j169324j476526j096666n22792m26948
1494.9I67484057k87294O8187J30058j73510r21368j537740l52323M35471K32399k07663
1515.3I64870274n40495q74519j361430j088381k14696P77603J507401J851499K643406
1533.6I67570662K720535J936198J784384J677096J223445R50277M58836P4446l7551
1552I78358328j97708l84510m28676J93655M10378J1623j74284j95086j10924J7404
$$ y = [974253476, 973676920, 973374307, 973469257, 973522782, 973499179, 973436534, 973274231, 973058283, 972734213, 972339153, 972226977, 972256601, 972049832, 971615136, 971055210, 970563471, 970351100, 970254958, 969979465, 969624043, 969987869, 970749915, 971121788, 971281230, 971608460, 971990407, 972176909, 972342074, 972769201, 973240614, 973488927, 973374248, 972923577, 972176313, 971006989, 969530463, 968433797, 967911005, 967484057, 967196763, 967264950, 967395008, 967221498, 966300130, 964762390, 964410067, 964845538, 965077937, 964870274, 964329779, 963455260, 962093830, 961005449, 960790753, 961568356, 963075757, 964927256, 967570662, 970291197, 972227395, 974011779, 975688875, 976912320, 977862597, 978321433, 978395879, 978358328, 978160620, 977776110, 977347434, 977541089, 977951467, 977963090, 977788806, 977593720, 977482796, 977500200]
1572.4I77500200m7564o0559J00673L1590k36094m67658o27279p53761o99579l84271
1592.8I74355698P689L34799M67062M24623L66867K69890J15037j8835r7215j33396
1613.2I76092219j69158q2671J66774K92420M33385N02944L76106K71558J36614o8545
1633.6I77951646j91569N7041K90036K28286j5735k46704l5107J43885j66595Q3685
1653.9I78098869P60496N86212K50756J56105K49088R2745j18494Q642J68622J37985
1674.3I80391026J84476J35302k9265j02222J81496M67419L50714L36945K32697q2851
1694.7I82065737k11477j35541p629J59025J65105J80661J10209p3075k58207m05193
1715.1I81589615k14457K96950K87295N8353J7642j35898m17888m80354l71277m8101
$$ y = [977500200, 977452636, 977392077, 977492750, 977524340, 977288246, 976820588, 976193309, 975439548, 974739969, 974355698, 974363387, 974698186, 975165248, 975589871, 975956738, 976226628, 976341665, 976322830, 976225615, 976092219, 975923061, 975840390, 976007164, 976299584, 976732969, 977235913, 977612019, 977883577, 978020191, 977951646, 977760077, 977817118, 978107154, 978335440, 978319705, 978073001, 978037894, 978181779, 978015184, 978098869, 978859365, 979445577, 979696333, 979852438, 980101526, 980194271, 980075777, 980084419, 980253041, 980391026, 980575502, 980710804, 980681539, 980579317, 980760813, 981228232, 981578946, 981915891, 982148588, 982065737, 981854260, 981718719, 981711090, 981870115, 982035220, 982215881, 982326090, 982253015, 981994808, 981589615, 981375158, 981672108, 981959403, 982017756, 982035398, 981899500, 981481612, 981001258, 980629981, 980581880]
1735.5I80581880O4849p4982r0897p153K6584q583J46568N57363N55455K89917K47658
1758I82288659K13921J91867K56419N2750j76608j04666P9095J90676K09272J38878
1778.4I83340263J3113q3565p7546J8358n5968k24531o9022J47104K4974j92940j73211
1800.8I82667029J28209J80185n3465j39535j9252R4056P2599q285k7955m5895j38998
1823.2I82708693j56165q8632m1604J45793K07067J8656o3896o7353k16067k73705
1843.6I82172787Q583K03312J71244Q6963k861o6340r0778l0517L7789k6882k38418
1866I82224882k97845K3008K10046J20938N8830P15o3657k8074K145r7870j56880K623
1890.5I81998861R7751P034J79M2498p034n4061k8372m3571r4592l4750K2113q3088
$$ y = [980581880, 980646729, 980571747, 980480850, 980473697, 980500281, 980491698, 980638266, 981195629, 981751084, 982041001, 982288659, 982502580, 982694447, 982950866, 983003616, 982827008, 982722342, 982801437, 982992113, 983201385, 983340263, 983353376, 983269811, 983192265, 983210623, 983154655, 982930124, 982861102, 983008206, 983033180, 982840240, 982667029, 982795238, 982975423, 982921958, 982782423, 982763171, 982857227, 982929826, 982921541, 982893586, 982847691, 982708693, 982552528, 982463896, 982422292, 982568085, 982775152, 982793808, 982729912, 982662559, 982446492, 982172787, 982181370, 982384682, 982555926, 982642889, 982640028, 982573688, 982482910, 982452393, 982490182, 982463300, 982224882, 981927037, 981950045, 982160091, 982281029, 982339859, 982340574, 982276917, 982248843, 982250988, 982153118, 981996238, 981998861, 982096612, 982103646, 982103825, 982146323, 982139289, 982085228, 982056856, 982013285, 981918693, 981883943, 981906056, 981822968]
1915I81822968j63734m6730M4882O7890J08122P8321L1650l4452p7307j3888Q583o7889
1939.5I81758416j39177j02282M6730J48177J04964l6001q9228J4841N7638k3603n9724
1961.9I81680751m0829m5002Q583J00792O1035m6253o4612j967J6868k3901m2677o8069
1986.4I81534719j25825j43349k3246J20223J05619J19p1644o3658k2173J311K9504
2008.8I81341600M7386j1325r4652p1883j3054m1604j9252J01268J23322L7730j0908
2031.2I81388628j7583k3961m0114m5299p093Q821j9193k4735l696P629J669o139l9160
2057.8I81179774o9380m5717J8835L4690j3768J4901O7830J8596l5345p15P212p4029
2082.2I81102884o3837K8134O3657N5910j1743m5895p868l9339o8426l3200l6120j5259
$$ y = [981822968, 981659234, 981612504, 981657386, 981725276, 981833398, 981911719, 981943369, 981908917, 981831610, 981817722, 981826305, 981758416, 981619239, 981516957, 981563687, 981711864, 981816828, 981780827, 981691599, 981706440, 981764078, 981740475, 981680751, 981639922, 981594920, 981603503, 981704295, 981765330, 981719077, 981654465, 981652498, 981669366, 981645465, 981602788, 981534719, 981408894, 981265545, 981242299, 981362522, 981468141, 981468260, 981396616, 981332958, 981310785, 981312096, 981341600, 981388986, 981377661, 981283009, 981211126, 981198072, 981156468, 981137216, 981238484, 981361806, 981399536, 981388628, 981371045, 981347084, 981306970, 981261671, 981254578, 981263399, 981244206, 981219471, 981215775, 981223404, 981225073, 981218934, 981179774, 981110394, 981064677, 981083512, 981118202, 981104434, 981119335, 981187165, 981205761, 981170416, 981169701, 981176913, 981102884, 981039047, 981067181, 981130838, 981186748, 981175005, 981129110, 981121242, 981081903, 981013477, 980980277, 980944157, 980928898]
2106.7I80928898N4061O1751M7624L8266O56n1380j08897q4520R358N5433N0425K1696
2131.2I81023371n781P152K0266k8074n9426j1325K1994j6927o6877n4300p152J2338
2155.6I80835259O2346J03176L9995j7643n5909r7454p2718n1677m8041p570L5048
2178.1I80724812M2378m351n0962l4451J3471L0994J490K444M4584M6611k801n5254
2202.5I80758965n9068l7492n602M8518N5849J6511q226l6716p0453n3942J7583N0545
2227I80676472r656p2121m9651L1173O3121K2650r53R775K6703j1862o2644k4200J0014
2253.5I80608821r835l7670j6808M1365L6001j1265l5107l6895l4869n305J5140k1100
2278I80492473l9637m5658q6844n9843Q1659J03414m2856q4817l1233l9041l9459J0968
$$ y = [980928898, 980982959, 981044710, 981092334, 981130600, 981131256, 981079876, 980970979, 980886459, 980895817, 980951250, 981001675, 981023371, 981017590, 981024742, 981045008, 981016934, 980957508, 980946183, 980968177, 980951250, 980884373, 980830073, 980822921, 980835259, 980897605, 981000781, 981040776, 981023133, 980967224, 980869770, 980797052, 980745375, 980697334, 980689764, 980724812, 980767190, 980762839, 980711877, 980677426, 980690897, 980721891, 980723381, 980725825, 980770409, 980817020, 980814219, 980758965, 980699897, 980662405, 980656803, 980705321, 980761170, 980777681, 980769455, 980732739, 980662286, 980608344, 980625927, 980676472, 980666816, 980594695, 980545044, 980576217, 980639338, 980661988, 980661035, 980670810, 980697513, 980685651, 980623007, 980598807, 980608821, 980598986, 980561316, 980544508, 980585873, 980621874, 980610609, 980575502, 980538607, 980503738, 980498433, 980513573, 980492473, 980452836, 980407178, 980320334, 980260491, 980342150, 980445564, 980402708, 980317891, 980286658, 980247617, 980208158, 980219126]
2302.5I80219126K1398j9372k9385l576j0550k2233k0086K0921J74463K28822O2525
2324.9I80622053J6928J56998J48893L5167n424k1696K9087J2219j85431l01480j41978
2347.3I80365336J03056K84791L08991P9572n1320J33217K52008P5281k16723l66210
2367.7I80967999l52860k55704j91331j99079j13488J6988Q9049J34528P0333m4405
2388.1I80122030n8592l695L1650J4186l219m8101p9751R179O8784j6033q5533j1981
2412.6I79938924R9540J20759O7413K4378k2053q4341p4148l5227k2471j8954j2696
2435I79981124L2008N3525j1325l5405K2709L8863O854l9697m8518n483J5378K4676
2459.5I80034709J7583k9087n4061m5121j3172K6881o735m3333%r179o9678n5611J0908
$$ y = [980219126, 980240524, 980221152, 980191767, 980188191, 980177641, 980155408, 980135322, 980156243, 980330706, 980559528, 980622053, 980638981, 980795979, 980944872, 980980039, 980974615, 980952919, 980982006, 980994225, 980808794, 980507314, 980365336, 980468392, 980753183, 981062174, 981141746, 981090426, 981223643, 981475651, 981550932, 981334209, 980967999, 980615139, 980359435, 980168104, 979969025, 979855537, 979872525, 979961574, 980096102, 980166435, 980122030, 980063438, 980059743, 980091393, 980105579, 980102360, 980054259, 979974508, 979983687, 980052471, 980036438, 979950905, 979938924, 980038464, 980159223, 980226636, 980251014, 980228961, 980144620, 980070472, 980035245, 980012774, 979993820, 979981124, 980013132, 980066657, 980055332, 980019927, 980042636, 980081499, 980088353, 980048656, 980000138, 979994655, 980010033, 980034709, 980052292, 980023205, 979969144, 979924023, 979910851, 979937732, 979930997, 979887664, 979887664, 979878485, 979808807, 979753196, 979764104]
2486I79764104Q9705J28984L1412o7234m5896l8385p6294q6248k7001M9234N0902k980
2510.5I79770303k1518M1605M7862n5373p8261J7941N2631q821k980M1484R54l5047
2535I79770780j8895j1325o974l993N543K5511p808n0962l7074j431M9531O6937j3233
2561.5I79766607q3208n3942j1027J729P271J7345L5942K3663j79j5557n3346n7280
2585.9I79578018P75N4836M3631m1246q5056l100M4227m0352p2122Q762M9650J4186
2610.4I79552209j9550k9027j8180K5451P4983N9724m7624j23620r3699j7881J8537
2632.8I79381323k9504n4539K1756J29402J07407j8418o3955m9591r597q285o2227
2655.3I79343772j4484O8545N2631L7730K0802q5354j20103k3127L8982J4484k4021
$$ y = [979764104, 979853809, 979982793, 980014205, 979946971, 979901075, 979862690, 979786396, 979700148, 979673147, 979722381, 979773283, 979770303, 979748785, 979790390, 979838252, 979782879, 979704618, 979722559, 979775190, 979766369, 979763389, 979804873, 979805827, 979770780, 979751885, 979740560, 979733586, 979729593, 979735136, 979760647, 979752839, 979701877, 979664803, 979663372, 979712903, 979779840, 979766607, 979683399, 979629457, 979618430, 979620159, 979627430, 979644775, 979680717, 979704380, 979704201, 979688644, 979635298, 979578018, 979578793, 979633629, 979677260, 979636014, 979550958, 979547858, 979592085, 979551733, 979479611, 979488373, 979538023, 979552209, 979532659, 979503632, 979485452, 979510903, 979585886, 979645610, 979597986, 979474366, 979380667, 979362786, 979381323, 979351819, 979297280, 979319036, 979448438, 979555845, 979537427, 979473472, 979423881, 979414284, 979405999, 979343772, 979329288, 979397833, 979450464, 979488194, 979508996, 979423642, 979303539, 979280412, 979319394, 979333878, 979309857]
2677.7I79309857j1206L4869M4048J2815j6272o0857o7353M3571R4771j0311q4698
2700.1I79289234q2612n1082r417p570l9697l9696M4882J00434M7326k5988o2346o5148
2724.6I79098320q2314n4240L6239M8817J8775j0669m7445l1472j907M3511N1856n4597
2749.1I79014874p2897K0862L8027K861k3603k1994j6034k5213J848K0206o199j6153
2773.5I78916585k6941j08361r6619L6180N1975M17o2346r5248m5896J192M2677l219
2798I78610396p5936j6630J8657o6340o4373j0014m6849j8954k444j15514j53780q2254
2822.5I77975965n2453n9664m1961o8188j70112k21789j71363j20044j75714l52443
2842.9I76542234m63247l67999j72317P153J83761L58402M07696K97427J77920J59681
$$ y = [979309857, 979298651, 979333520, 979377568, 979390383, 979374111, 979313254, 979245901, 979289472, 979384243, 979373932, 979289234, 979206622, 979155540, 979146123, 979138553, 979098856, 979059160, 979104042, 979204476, 979251802, 979225814, 979163468, 979098320, 979016006, 978961766, 978998005, 979046822, 979065597, 979054928, 979007483, 978976011, 978974104, 979017615, 979069471, 979014874, 978941977, 978962839, 979000866, 979003727, 978980124, 978958130, 978942096, 978916883, 978918731, 978938937, 978932738, 978916585, 978889644, 978781283, 978684664, 978720844, 978772819, 978773236, 978710890, 978615642, 978569746, 978570938, 978613615, 978610396, 978534460, 978517830, 978536487, 978470147, 978405774, 978395760, 978348911, 978329957, 978327513, 978211999, 978058219, 977975965, 977923512, 977863848, 977821887, 977753699, 977583587, 977361798, 977190435, 977070391, 976894677, 976542234, 976078987, 975710988, 975538671, 975545824, 975729585, 976087987, 976495683, 976793110, 976971030, 977130711]
2863.3I77130711J17838j8537q7082l9875J7166K4855P510m3154p5280J4007N2750
2885.7I77100909p3433j40608p4446q106j6749j02639j53244j51991j84060k21788
2906.1I75973845k62738l30865l40879k53320k16782k13385l9994K16186L67462M43221
2926.5I75342751M60445M57764M39227L06785K25842K57850K73585K81393J45615n5194
2946.9I78136063p3910L1173J49787J93297J40906Q4698J02282J55866J37031O4313
2967.3I79121506M1664Q2075J37270J86562J70649R6440M3154K4497K5273K5689L1233
2989.7I79986012K7478k8134q3506q2850m4286k8372k7418K9563L1710l8147l2961
3012.1I79709089n007K4080P2480M0650l4988q1062j39475j46508m8280L9577o914
$$ y = [977130711, 977248549, 977230012, 977142930, 977103055, 977120221, 977145076, 977152586, 977109432, 977034152, 977048159, 977100909, 977027476, 976886868, 976812422, 976804316, 976787567, 976684928, 976531684, 976379693, 976195633, 975973845, 975711107, 975380242, 975039363, 974786043, 974569261, 974355876, 974315882, 974532068, 974899530, 975342751, 975803196, 976260960, 976700187, 977006972, 977232814, 977490664, 977764249, 978045642, 978191257, 978136063, 978062153, 978093326, 978243113, 978436410, 978577316, 978662014, 978764296, 978920162, 979057193, 979121506, 979163170, 979245245, 979382515, 979569077, 979739726, 979836166, 979879320, 979903817, 979929090, 979954779, 979986012, 980013490, 979985356, 979901850, 979819000, 979774714, 979746342, 979718924, 979748487, 979780197, 979742050, 979709089, 979704082, 979728162, 979800642, 979841292, 979806304, 979725242, 979585767, 979439259, 979390979, 979430556, 979423642]
3034.6I79423642r3102l6300M3631L1531r894n4837k9742J430o497Q166k8193n4240
3059.1I79195595n961n126m4465r894P2956R0599p868j01387k8611P8798M6372J5795
3083.5I79296803R716p4506j16944p9691j9789k861o1989j1325J38760J38402k9028
3106I79187548j37627r3341j1384K9862J6927r775l6478j1086O6995N7876K9326K1338
3130.4I79110181n6386j08897o1632r238l5405q2672J2398J44183K5452j18614r179
3152.9I78810191J07348O1035o6459j55628j10209J4127K9087m0531L814R2566P8202
3175.3I78823543K6941m709q3923j47164n8889L0815m6074r4354P927R3639Q4042Q226
3199.8I78640020l0279O199l0160j15335p7546L1889R596r8646r8288j3113N8413N6207
$$ y = [979423642, 979330540, 979294240, 979337871, 979369402, 979359508, 979304671, 979274929, 979276359, 979269862, 979278028, 979249835, 979195595, 979189634, 979184508, 979140043, 979130149, 979203105, 979293704, 979285836, 979184449, 979155838, 979234636, 979281008, 979296803, 979306519, 979232013, 979115069, 979035378, 979015589, 979012728, 978950739, 978939414, 979078174, 979216576, 979187548, 979049921, 978956580, 978945196, 978975058, 978991985, 978982210, 978945732, 978934646, 979001641, 979059517, 979088843, 979110181, 979053795, 978944898, 978883266, 978874028, 978838623, 978755951, 978768349, 978912532, 978937984, 978819370, 978810191, 978917539, 978978574, 978912115, 978756487, 978646278, 978660405, 978689492, 978648961, 978652775, 978745341, 978823543, 978850484, 978845775, 978761852, 978614688, 978555799, 978586614, 978540540, 978446186, 978454113, 978547752, 978631794, 978640020, 978609741, 978615940, 978585780, 978470445, 978392899, 978424788, 978434384, 978335738, 978237450, 978224337, 978282750, 978338957]
3224.2I78338957J79k5690m7207j0669R9599J48893J01089n1975j49965l0399N1618
3246.7I78424430m2439l9756K7835p2121j34409m1723k3126l8147N2273J31249R5487
3269.1I78339553n8651j57952n8175N5910R8347R3878r656n7638L8505N5074j7762
3291.5I78321433J6987R0063Q8453j0371j35898q0109P0095Q3864l7313j27196m4882
3314I78235126L2603L8028P2897P8678P0572N2690J6451j0252l7789o7950q0585M113
3338.4I78404582J65522K07543M9651r5606p5400l3438p3374m7624P2420Q6665P3791
3360.9I78734732R2745k7299j33992m1544Q9884P2956O377J8597M9174P5281O0320
3383.3I78997231r656m5240k8193k1816m1961L4511J41382P3969m3332m3631J1683
$$ y = [978338957, 978339136, 978313446, 978266239, 978255570, 978355169, 978504062, 978605151, 978553176, 978403211, 978372812, 978424430, 978381991, 978342235, 978370070, 978297949, 978163540, 978121817, 978098691, 978060544, 978112817, 978244066, 978339553, 978280902, 978122950, 978064775, 978120685, 978219032, 978312910, 978303254, 978245616, 978284121, 978339195, 978321433, 978338420, 978428483, 978516936, 978506565, 978370667, 978290558, 978360653, 978444517, 978407204, 978280008, 978235126, 978267729, 978305757, 978378654, 978457332, 978527904, 978580594, 978597045, 978586793, 978549004, 978481054, 978400469, 978404582, 978570104, 978777647, 978827298, 978731692, 978656292, 978622854, 978549480, 978501856, 978574276, 978660941, 978734732, 978827477, 978800178, 978666186, 978624642, 978714526, 978787482, 978793859, 978812456, 978861630, 978936911, 978997231, 978987575, 978942335, 978914142, 978892326, 978850365, 978884876, 979026258, 979100227, 979056895, 979013264, 979024947]
3405.7I79024947O2167M8220k6285J8358R6560k2173q2970R3997J15156m7565m1127
3428.2I79239285r120m3153J0013R8110J30772J5140r7454n3167J4186M8995P0095
3450.6I79423702J49131J79052K0504m2081P1287K5928q2314j1265N3406j1802j5080
3473I79760468J18196J35541m7982j89245j10864M8935J65761J85370J1862j73092
3493.4I79904950j57237m650Q762n9843R7811K16783M5776k3961J02579P5102j9073
3515.9I80186999j0848n722q8930j23799M4703K01345J93834L6180q6129L5465J87397
3538.3I80570495J19031j16110k70963r8944J65165J70290J18673J50561P2539j08599
3558.7I80772138j37568j00851l28600l19600K87652N08725K33174J0430O795J10627
$$ y = [979024947, 979087114, 979135334, 979109049, 979127407, 979223967, 979201794, 979118824, 979212821, 979327977, 979280412, 979239285, 979230165, 979187012, 979197025, 979295135, 979425907, 979441047, 979343593, 979290426, 979304612, 979353607, 979423702, 979572833, 979751885, 979772389, 979730308, 979801595, 979827523, 979745209, 979733944, 979787350, 979775548, 979760468, 979878664, 980014205, 979966223, 979776978, 979666114, 979715049, 979880810, 980066180, 980078042, 979904950, 979747713, 979743063, 979751825, 979691982, 979789793, 980006576, 980052352, 980028391, 980130970, 980206072, 980186999, 980176151, 980170429, 980081499, 979957700, 980002403, 980203748, 980397582, 980433762, 980347633, 980383098, 980570495, 980689526, 980573416, 980302453, 980203509, 980368674, 980538964, 980657637, 980808198, 980880737, 980772138, 980634570, 980533719, 980205119, 979885519, 980173171, 980681896, 980915070, 980925500, 980932295, 981042922]
3579.1I81042922J51813m0114l77596l09229K18690K46286l2127N4300K00510P5817
3599.5I81231272j0192o318j24514k51711k02894p5400R4772J06155o2584J7642K56837
3621.9I80973065K24650j15693m07994j5437L36170K52187K58148J85847m8518j52826
3642.3I81489599k35975m43995m83573R478M28617L51071K17199K20955R0241m4703
3662.7I81598914J5020n4538l57092l46958m8816L6299K21431M11630K80499K563j78277
3685.1I81580675j65046p689M7863J1444L4571Q8036Q4340N3108K2709j32918k63870
3707.6I81353223k73943j06930K22325J99795m0055j67012k33650k16663M0114K89857
3727.9I81067061J41561l91840p68662j64926N94556M30286j12116k81155J17183J01983
$$ y = [981042922, 981194735, 981154621, 980777025, 980467796, 980686486, 980932772, 980900645, 980954945, 981155455, 981231272, 981221080, 981214762, 981090248, 980838537, 980635643, 980560243, 980655015, 980761170, 980698586, 980716228, 980973065, 981197715, 981082022, 980674028, 980658591, 980994761, 981246948, 981505096, 981690943, 981642425, 981489599, 981253624, 980809629, 980326056, 980335534, 980764151, 981115222, 981332421, 981553376, 981643617, 981598914, 981613934, 981559396, 981202304, 980855346, 980806530, 980842829, 981064260, 981475890, 981756389, 981758952, 981580675, 981415629, 981407940, 981455803, 981467247, 981501818, 981589854, 981674194, 981727302, 981750011, 981617093, 981353223, 981079280, 980972350, 981194675, 981394470, 981354415, 981187403, 980953753, 980737090, 980777204, 981067061, 981208622, 980816782, 980048120, 979883194, 980477750, 980908036, 980795920, 980514765, 980631948, 980733931]
3748.3I80733931k24173l517K67446J53542Q2135J65761O7234j24336o5207Q9705J50859
3770.8I81293380J18315M4883n8890j45495k682Q0943m8041m9531N3644N9068K8670
3793.2I81374264j4842p4506j11341j57237p9215N3585J50442J73330J28210K3603
3813.6I81466293j95622k86758k00927M1961K15471P1883M3929P7546j67728k82466
3834I80783582p2122L8564O5685J28388J78397J55091m8339l60191m78506P6115M34458
3856.4I80901122J77622j02639j92225q6725k1517j06454j22070K8193K17199J92523
3876.8I80885029j25528k86519j47283L7730K90453K80798J4960r2447p0273j32978
3897.2I80653942k17975k13265M232L20256M29570K98441J15394m5359j80185j41620
$$ y = [980733931, 980509758, 980506241, 980773687, 980927229, 981009364, 981175125, 981242359, 981118023, 981052816, 981142521, 981293380, 981411695, 981456578, 981397688, 981252193, 981249511, 981330454, 981282413, 981232882, 981286526, 981345594, 981374264, 981359422, 981284916, 981173575, 981016338, 980937123, 980990708, 981141150, 981314480, 981442690, 981466293, 981270671, 980983913, 980782986, 980824947, 981040418, 981112301, 981156230, 981233776, 981066048, 980783582, 980711460, 980750024, 980815709, 980944097, 981122494, 981277585, 981229246, 980869055, 980390549, 980466664, 980901122, 981078744, 980976105, 980783880, 980697155, 980675638, 980569184, 980447114, 980475307, 980692506, 980885029, 980759501, 980472982, 980325699, 980363429, 980653882, 980934680, 980949640, 980857193, 980786920, 980653942, 980435967, 980222702, 980226934, 980547190, 980976760, 981275201, 981390595, 981345236, 981165051, 981023431]
3917.6I81023431j7643j3590o7770q0884j34945j17004J14680K46942K19583R0718
3938I81263518j09613j53303r8526j06395j8179J63674J79470J40190M5121q0228L5226
3960.4I81260955J46628L159j33574r2507j6808O3062K05874K40862P5639j56999k08735
3982.9I81387556n2333m2022k01880j57774J22666K51115M4942
3997.1I81352270
$$ y = [981023431, 981005788, 980992198, 980924428, 980843544, 980708599, 980591595, 980706275, 980953217, 981172800, 981263518, 981153905, 981000602, 980902076, 980795681, 980777502, 980941176, 981120646, 981260836, 981305957, 981225729, 981260955, 981407583, 981410742, 981277168, 981184661, 981167853, 981230915, 981436789, 981677651, 981753290, 981596291, 981387556, 981335223, 981293201, 981091321, 980933547, 981056213, 981307328, 981352270]
##END=$$ End of the data block
