##TITLE=DI 15-2051464-8 Dystar Evo soft XP157 MPI $$ Begin of the data block
##JCAMP-DX=5.00 $$ ACD/SpecManager v 10.08
##SPECTROMETER/DATA SYSTEM=Alpha
##DATE=14 Jan 2016 08:14:54
##DATA TYPE=INFRARED SPECTRUM
##DATA CLASS=XYDATA
##ORIGIN=
##OWNER=
##NPOINTS=1765
##FIRSTX=399.76428223
##LASTX=3997.64306641
##MAXX=3997.64306641
##MINX=399.76428223
##MAXY=0.87152809
##MINY=0.57054275
##XFACTOR=1.0000000000
##YFACTOR=1.000000000000000e-9
##FIRSTY=0.82581955
##DELTAX=2.03961372
##XUNITS=1/CM
##YUNITS=ARBITRARY UNITS
##XYDATA=(X++(Y..Y))
$$ plain form
399.8 825819552 829943717 831488967 832083464 832207918 831122398 830573618 830265105 828022242 825319707
418.1 825319707 825246096 826107502 826748490 826951325 826042056 825201750 824410796 822648227 821009278 819768846
438.5 819768846 818644285 819273055 820703447 820476532 819841385 819165409 817513347 816310763 816168070
456.9 816168070 816933274 819137812 821060300 820808411 819845140 819003463 816913426 814932644 814002693
475.2 814002693 812281191 810987592 811871767 814133763 817766845 821687281 823435962 823981583 824733794
493.6 824733794 824332833 823604763 823899627 823529601 822623789 822215796 820915222 819337010 818973184
511.9 818973184 818661809 818386018 819639683 821517408 823102117 824316919 824000835 822914124 822673261
530.3 822673261 822388411 822157323 823189497 823947668 823732138 823990941 823794305 822751403 822534800
$$ packed form
399.8H25819552M124165J545250N94497J24454j085520n48780l08513k242863k702535
418.1H25319707p3611Q61406O40988K02835r09269q40306p90954j762569j638949j240432
438.5H19768846j124561O28770J430392k26915o35147o75976j652062j202584j42693
456.9H16168070P65204K204538J922488k51889r63271q41677k090037j980782r29951
475.2H14002693j721502j293599Q84175K261996L633082L920436J748681N45621P52211
493.6H24733794m00961p28070K94864l70026r05812m07993j300574j578212l63826
511.9H18973184l11375k75791J253665J877725J584709J214802l16084j086711k40863
530.3H22673261k84850k31088J032174P58171k15530K58803j96636j042902k16603
$$ plain form
548.7 822534800 822234511 821071506 820493877 819757402 817964613 816393673 814539075 811794341 809584856
567 809584856 807364762 804056346 800799131 797692299 794918001 794463515 796264172 798952699 802714407
585.4 802714407 806659579 809176028 811366260 813760400 815052867 815776229 816393793 816254675 816301465
603.7 816301465 817052424 817516863 818062127 818908274 818844020 818311691 818484724 818713188 818760693 819069743
624.1 819069743 818987966 818496227 818134189 817239523 815684199 814217746 812451184 810223222 808431447
642.5 808431447 806948364 805530906 804855227 804421902 803376019 802889705 804068625 806762099 810767472
660.8 810767472 814809859 816714406 816312551 816362381 817490101 817908466 817853451 817512631 817391455 818183184
681.2 818183184 819147885 820084274 821497440 822730720 823565841 824707329 825787544 826650679 827987850
$$ packed form
548.7H22534800l00289j163005n77629p36475j792789j570940j854598k744734k209485
567H09584856k220094l308416l257215l106832k774298m54486J800657K688527L761708
585.4H02714407L945172K516449K190232K394140J292467P23362O17564j39118M6790
603.7H16301465P50959M64439N45264Q46147o4254n32329J73033K28464M7505L09050
624.1H19069743q1777m91739l62038q94666j555324j466453j766562k227962j791775
642.5H08431447j483083j417458o75679m33325j045883m86314J178920K693474M005373
660.8H10767472M042387J904547m01855M9830J127720M18365n5015l40820j21176P91729
681.2H18183184R64701R36389J413166J233280Q35121J141488J080215Q63135J337171
$$ plain form
699.6 827987850 829012394 828883290 828207552 826352417 821448445 811549008 795221031 778719187
715.9 778719187 773422480 780300617 791709661 803459585 813983738 821907282 828034222 833154798
732.2 833154798 836512029 838577509 840505183 842280149 844114840 846080422 847180843 847440839 847769260
750.6 847769260 847983301 847986341 848083854 847468972 845659733 843674183 842406094 842619240 844763815 847304761
771 847304761 848586500 849033833 849319160 849551558 850500286 852183163 853306949 853734255 853894413 853456259
791.4 853456259 852950871 853204429 853862464 854744494 855694592 855489552 853634715 850949943 848138452
809.7 848138452 846535027 848224521 853203356 859198272 864350021 867673814 869301975 870422542
826 870422542 871171296 871193171 871130109 870968938 870124936 869108081 868064523 866482496 864905119 863631964
$$ packed form
699.6H27987850J024544j29104o75738j855135m903972r899437j6327977j6501844
715.9G78719187n296707O878137J1409044J1749924J0524153P923544O126940N120576
732.2H33154798L357231K065480J927674J774966J834691J965582J100421K59996L28421
750.6H47769260K14041L040R7513o14882j809239j985550j268089K13146K144575K540946
771H47304761J281739M47333K85327K32398R48728J682877J123786M27306J60158m38154
791.4H53456259n05388K53558O58035Q82030R50098k05040j854837k684772k811491
809.7H48138452j603425J689494M978835N994916N151749L323793J628161J120567
826H70422542P48754K1875o3062j61171q44002j016855j043558j582027j577377j273155
$$ plain form
846.4 863631964 862117231 860717952 859782398 858858466 858420312 859080195 860131323 861283123 862839460
864.8 862839460 864159763 864952087 865717947 866084754 865829468 865717888 865637600 864887297 863447785 860971034
885.2 860971034 857539535 854672194 853005528 852682114 855184913 860335886 865395665 868946016 871056795
903.5 871056795 871528089 870837510 869567931 867544174 865634859 865143299 865588903 866158903 866728425
921.9 866728425 866622686 865770221 865284443 865310073 865240455 864827633 863113046 859247684 854427040 850637496
942.3 850637496 848487139 847451270 847822011 850741804 855708957 860125482 862351060 863307416 863852561
960.7 863852561 863463521 862261534 860572398 857957006 855225623 853659868 852783382 852072418 851295471
979 851295471 849124908 845484316 842586100 841921091 843422174 846359849 849145770 850697637 851407170
$$ packed form
846.4H63631964j514733j399279r35554r23932m38154O59883J051128J151800J556337
864.8H62839460J320303P92324P65860L66807k55286j11580q0288p50303j439512k476751
885.2H60971034l431499k867341j666666l23414K502799N150973N059779L550351K110779
903.5H71056795M71294o90579j269579k023757j909315m91560M45604N70000N69522
921.9H66728425j05739q52465m85778K5630o9618m12822j714587l865362m820644l789544
942.3H50637496k150357j035869L70741K919793M967153M416525K225578R56356N45145
960.7H63852561l89040j201987j689136k615392k731383j565755q76486p10964p76947
979H51295471k170563l640592k898216o65009J501083K937675K785921J551867P09533
$$ plain form
997.4 851407170 851403356 850566983 849442065 847947955 845950723 844715178 844790697 845170319 845565140 846127629
1017.8 846127629 846415699 846602738 847043335 847289264 847349942 847422123 846858859 845517933 843934357 842301428
1038.2 842301428 841030121 840357304 839583278 838620126 838243365 838158607 837647378 836906970 835666597
1056.5 835666597 833435118 831465006 831337214 832841396 835129857 837711275 839959502 841506720
1072.8 841506720 842195749 841833532 840831995 839391530 837053835 834406018 832268298 829368353 824581981
1091.2 824581981 820080817 819375277 823577106 830398679 836354494 840066671 842340291 843610883
1107.5 843610883 843869328 843651533 843103290 842047036 840889454 839685798 837926924 835693300 833629787
1125.9 833629787 832813025 834302247 837204516 839130521 839259863 838705361 838744462 839956045 841738641
$$ packed form
997.4H51407170l814q36373j124918j494110j997232j235545P5519L79622L94821N62489
1017.8H46127629K88070J87039M40597K45929O0678P2181n63264j340926j583576j632929
1038.2H42301428j271307o72817p74026r63152l76761q4758n11229p40408j240373
1056.5H35666597k231479j970112j27792J504182K288461K581418K248227J547218
1072.8H41506720O89029l62217j001537j440465k337695k647817k137720k899945m786372
1091.2H24581981m501164p05540M201829O821573N955815L712177K273620J270592
1107.5H43610883K58445k17795n48243j056254j157582j203656j758874k233624k063513
1125.9H33629787q16762J489222K902269J926005J29342n54502L9101J211583J782596
$$ plain form
1144.2 841738641 842917860 843351662 843479395 842975438 841623306 839744687 837305307 834743798 833310127
1162.6 833310127 833465517 834914863 837261975 839362562 840343356 840743005 840879917 840281188 838824809
1180.9 838824809 836274981 832181096 827756107 825772941 827306867 830465913 832703590 832735956 830678225
1199.3 830678225 827078998 822370529 817560196 813985229 812772572 814691246 818472743 820890248
1215.6 820890248 820282996 817253709 812715292 808059216 804502428 801887274 801155090 804316998 809871733
1234 809871733 813786149 814555585 813407123 811802328 810185790 808209717 806482077 806601346 808401108
1252.3 808401108 809890151 810070753 809552073 808851480 807389617 804520726 801173210 799445748 799966753
1270.7 799966753 801359832 802888453 805023611 807271361 808226585 807608187 806279838 805171669 804785609
$$ packed form
1144.2H41738641J179219M33802J27733n03957j352132j878619k439380k561509j433671
1162.6H33310127J55390J449346K347112K100587R80794L99649J36912n98729j456379
1180.9H38824809k549828m093885m424989j983166J533926L159046K237677L2366k057731
1199.3H30678225l599227m708469m810333l574967j212657J918674L781497K417505
1215.6H20890248o07252l029287m538417m656076l556788k615154p32184L161908N554735
1234H09871733L914416P69436j148462j604795j616538j976073j727640J19269J799762
1252.3H08401108J489043J80602n18680p00593j461863k868891l347516j727462N21005
1270.7G99966753J393079J528621K135158K247750R55224o18398j328349j108169l86060
$$ plain form
1289 804785609 804893076 805104017 805530369 806227148 806842864 807314575 807784379 807700336 806586087 805192411
1309.4 805192411 804535925 805209398 807525992 810920715 813990235 815742373 816090703 815276861 814113915
1327.8 814113915 813898027 814971447 816246748 816464961 815234065 813465297 812004924 810402751 808615804
1346.2 808615804 807108521 805454254 802955389 799899638 797062397 794639051 792481959 791013598
1362.5 791013598 790444851 789669812 787970781 785329223 781362116 776481926 772258282 769190550 766680002
1380.8 766680002 763860583 760706067 757869184 755408406 752995372 751475155 752970695 757704079
1397.1 757704079 763841271 769297242 773032844 776274681 779248297 780808389 780999482 780002058 777113020
1415.5 777113020 772110999 766940176 764681339 765654385 768062890 768343627 765738249 763332307 762431860
$$ packed form
1289H04785609J07467K10941M26352O96779O15716M71711M69804q4043j114249j393676
1309.4H05192411o56486O73473K316594L394723L069520J752138L48330q13842j162946
1327.8H14113915k15888J073420J275301K18213j230896j768768j460373j602173j786947
1346.2H08615804j507283j654267k498865l055751k837241k423346k157092j468361
1362.5G91013598n68747p75039j699031k641558l967107m880190m223644l067732k510548
1380.8G66680002k819419l154516k836883k460778k413034j520217J495540M733384
1397.1G57704079O137192N455971L735602L241837K973616J560092J91093r97424k889038
1415.5G77113020n002021n170823k258837R73046K408505K80737k605378k405942r00447
$$ plain form
1433.9 762431860 762740910 765110552 768182695 770395041 771413147 770914078 769620538 768391311 766311109
1452.2 766311109 762509584 757275999 753354490 750542819 744786143 734459519 722396255 711052835
1468.5 711052835 701984227 706171215 726591706 745601296 756485999 762624741 767417014 770824850
1484.9 770824850 772022724 772118211 773141026 774159908 773539245 771964431 771547616 771995068 771285355
1503.2 771285355 768332064 766983271 770396292 773261428 773970485 772644520 770251155 767667711
1519.5 767667711 764961183 762873888 760695696 757650077 753580689 747506917 740052044 733599186
1535.8 733599186 726103127 715323508 708013117 706013203 704996526 702638149 698818028 695398927
1552.2 695398927 693092108 692073166 697169960 711893737 722746611 729841590 735406220 739768863
$$ packed form
1433.9G62431860L09050K369642L072143K212346J018106m99069j293540j229227k080202
1452.2G66311109l801525n233585l921509k811671n756676j0326624j2063264j1343420
1468.5G11052835r068608M186988K0420491J9009590J0884703O138742M792273L407836
1484.9G70824850J197874R5487J022815J018882o20663j574814m16815M47452p09713
1503.2G71285355k953291j348793L413021K865136P09057j325965k393365k583444
1519.5G67667711k706528k087295k178192l045619m069388o073772p454873o452858
1535.8G33599186p496059j0779619p310391j999914j016677k358377l820121l419101
1552.2F95398927k306819j018942N096794J4723777J0852874P094979N564630M362643
$$ plain form
1568.5 739768863 744997084 749737620 752701104 756735027 761863768 765552104 768295109 770697474
1584.8 770697474 772451818 773700416 774721980 775113463 775008976 774739504 773715794 771731973 769289970
1603.2 769289970 766167104 762081087 757534981 752622247 746683300 738760114 730260313 724776268
1619.5 724776268 721260011 719220281 718429387 716531217 712525666 706414163 696667492 681545794
1635.8 681545794 666641951 653732717 640525341 629738390 627307236 636858523 647960246 659445882
1652.1 659445882 678597331 694174469 704662800 713894784 723134220 732005537 738513768 743816495
1668.4 743816495 750220716 756417215 761967361 767731726 772477508 775519252 777599037 782297671
1684.7 782297671 788740218 793345273 796870530 798969924 799125791 798727870 799335003 801621139 804131627
$$ packed form
1568.5G39768863N228221M740536K963484M033923N128741L688336K743005K402365
1584.8G70697474J754344J248598J021564L91483j04487k69472j023710j983821k442003
1603.2G69289970l122866m086017m546106m912734n938947p923186q499801n484045
1619.5G24776268l516257k039730p90894j898170m005551o111503r746671j5121698
1635.8F81545794j4903843j2909234j3207376j0786951k431154R551287J1101723J1485636
1652.1F59445882J9151449J5577138J0488331R231984R239436Q871317O508231N302727
1668.4G43816495O404221O196499N550146N764365M745782L041744K079785M698634
1684.7G82297671O442547M605055L525257K099394J55867l97921O07133K286136K510488
$$ plain form
1703.1 804131627 805632710 807084978 808271825 808423519 807306767 805295944 805202067 808569551 812028110
1721.5 812028110 814655721 817137003 819018841 820296466 821241856 822858274 826459706 829512477
1737.8 829512477 831211865 832740128 834242404 834913969 834746063 835157990 836889386 838336766 838894308
1756.1 838894308 839336336 839876652 841064632 842803776 843648195 843568563 843159378 843423307 845410824
1774.5 845410824 847461879 848336518 848823249 849628329 850329518 850899100 850956023 850050867 849846423 851121545
1794.9 851121545 851988852 851966977 852204800 853135765 853970587 854288995 854158282 854169428 854826331 855452776
1815.3 855452776 855632961 855826199 855825067 855213284 854689717 854466736 854309261 855088055 856179595 856459320
1835.7 856459320 856458127 856473327 855728865 854658604 854917526 855884910 856506467 856846631 856903672 856740773
$$ packed form
1703.1H04131627J501083J452268J186847J51694j116752k010823r3877L367484L458559
1721.5H12028110K627611K481282J881838J277625R45390J616418L601432L052771
1737.8H29512477J699388J528263J502276O71565j67906M11927J731396J447380N57542
1756.1H38894308M42028N40316J187980J739144Q44419p9632m09185K63929J987517
1774.5H45410824K051055Q74639M86731Q05080P01189N69582N6923r05156k04444J275122
1794.9H51121545Q67307k1875K37823R30965Q34822L18408j30713J1146O56903O26445
1815.3H55452776J80185J93238j132o11783n23567k22981j57475P78794J091540K79725
1835.7H56459320j193J5200p44462j070261K58922R67384O21557L40164N7041j62899
$$ plain form
1856.1 856740773 856618643 856548071 856360495 855899990 854846954 853843987 854323626 855444491 855822146
1874.4 855822146 855730832 855652332 855510175 855338514 855166078 854679763 853987277 853818119 853911638 853808165
1894.8 853808165 853898287 854056001 854002416 853931606 853784680 853406727 853128135 853189468 853251040 852958679
1915.2 852958679 852471590 852294981 852346420 852464139 852733970 852905214 852876782 852719367 852545917 852451563
1935.6 852451563 852259040 851754189 851173818 851100683 851440370 851702273 851742744 851575971 851352870 851195514
1956 851195514 851056457 850927234 850773573 850429356 850024223 849964380 850139916 850195527 850139737 850016177
1976.4 850016177 849867046 849793494 849731386 849581599 849365115 849026203 848578751 848432362 848633349 848689675
1996.8 848689675 848561943 848418593 848190069 847950757 847779214 847548008 847234190 846838593 846242547 845648527
$$ packed form
1856.1H56740773j22130p0572j87576m60505j053036j002967M79639J120865L77655
1874.4H55822146r1314p8500j42157j71661j72436m86315o92486j69158R3519j03473
1894.8H53808165R0122J57714n3585p0810j46926l77953k78592O1333O1572k92361
1915.2H52958679m87089j76609N1439J17719K69831J71244k8432j57415j73450r4354
1935.6H52451563j92523n04851n80371p3135L39687K61903M0471j66773k23101j57356
1956H51195514j39057j29223j53661l44217m05133n9843J75536N5611n5790j23560
1976.4H50016177j49131p3552o2108j49787k16484l38912m47452j46389K00987N6326
1996.8H48689675j27732j43350k28524k39312j71543k31206l13818l95597n96046n94020
$$ plain form
2017.2 845648527 845313013 844963670 844345868 843878925 844139278 844832897 845342815 845540822 845547736 845544338
2037.6 845544338 845496297 845374346 845376313 845425367 845333934 845264494 845276535 845205545 845159650 845195413 845107079
2060 845107079 844931006 844818473 844723582 844668984 844685495 844608665 844443381 844357431 844248950 844081700 844037056
2082.5 844037056 843995214 843827844 843712330 843642652 843509614 843437135 843397737 843269646 843195558 843175173 843032956
2104.9 843032956 842917860 842930138 842853606 842733443 842687786 842549741 842369735 842312336 842218637 842061102
2125.3 842061102 841988325 841888964 841720283 841621339 841497183 841284215 841150403 841015697 840786040 840663314
2145.7 840663314 840623379 840532005 840515792 840537310 840445518 840396821 840419710 840339661 840262294 840219617 840036809
2168.1 840036809 839896441 839945972 839912593 839776814 839704454 839580119 839404404 839310169 839188159 839023232
$$ packed form
2017.2H45648527l35514l49343o17802m66943K60353O93619N09918J98007O914l398
2037.6H45544338m8041j21951J967M9054r1433o9440J2041p0990m5895L5763q8334
2060H45107079j76073j12533r4891n4598J6511p6830j65284q5950j08481j67250m4644
2082.5H44037056m1842j67370j15514o9678j33038p2479l9398j28091p4088k0385j42217
2104.9H43032956j15096J2278p6532j20163m5657j38045j80006n7399r3699j57535
2125.3H42061102p2777r9361j68681r8944j24156k12968j33812j34706k29657j22726
2145.7H40663314l9935r1374j6213K1518r1792m8697K2889q0049p7367m2677j82808
2168.1H40036809j40368M9531l3379j35779p2360j24335j75715r4235j22010j64927
$$ plain form
2188.5 839023232 838944614 838823974 838600099 838456392 838348269 838178813 838078618 837986469 837781012 837632298
2208.9 837632298 837570369 837450325 837323606 837199152 837000072 836856782 836800158 836657882 836472750 836323619
2229.3 836323619 836119950 835923970 835806072 835626543 835397363 835224926 835002065 834706306 834465027 834238827
2249.7 834238827 833993912 833814681 833645284 833431661 833255470 833080411 832836092 832594216 832360268 832093835
2270.1 832093835 831875861 831729472 831589997 831476569 831376195 831203938 830975235 830718756 830397129 830035686
2290.5 830035686 829664350 829238713 828794777 828409970 828010798 827519536 826932192 826198995 825366080 824613333
2310.9 824613333 824000359 823399425 822632194 821639299 820599794 819793224 819245100 818666637 817960441
2329.3 817960441 817395806 817039847 816661060 816221118 815836847 815617561 815870166 816980362 818245053
$$ packed form
2188.5H39023232p8618j20640k23875j43707j08123j69456j00195r2149k05457j48714
2208.9H37632298o1929j20044j26719j24454j99080j43290n6624j42276j85132j49131
2229.3H36323619k03669j95980j17898j79529k29180j72437k22861k95759k41279k26200
2249.7H34238827k44915j79231j69397k13623j76191j75059k44319k41876k33948k66433
2270.1H32093835k17974j46389j39475j13428j00374j72257k28703k56479l21627l61443
2290.5H30035686l71336m25637m43936l84807l99172m91262n87344p33197q32915p52747
2310.9H24613333o12974o00934p67231r92895j039505q06570n48124n78463p06196
2329.3H17960441n64635l55959l78787m39942l84271k19286K52605J110196J264691
$$ plain form
2347.6 818245053 818373144 817076921 815094471 813311517 812072337 811487734 811570406 812226772 813287079
2366 813287079 814565301 815944672 817368627 818794072 820220828 821610928 822858393 823854804 824504018
2384.3 824504018 824819088 824947357 824955881 824842930 824706733 824593961 824463546 824371457 824331999 824253500
2404.7 824253500 824155629 824085534 824035883 824057817 824153841 824199140 824149728 824081659 824005365 823932350 823919296
2427.2 823919296 823913395 823878229 823887467 823925018 823949933 824008763 824069858 824063599 824036360 824018776 823984444 823963523
2451.6 823963523 823957682 823924780 823883057 823833048 823745847 823676825 823648095 823595703 823556304 823554218 823519111 823478281
2476.1 823478281 823457241 823395550 823321223 823333919 823448718 823632658 823878169 824110150 824250400 824346125
2496.5 824346125 824407220 824403822 824410975 824449480 824454069 824441195 824437201 824429214 824451089 824504197 824536741 824544728 824513257
$$ packed form
2347.6H18245053J28091j296223j982450j782954j239180n84603Q2672O56366J060307
2366H13287079J278222J379371J423955J425445J426756J390100J247465R96411O49214
2384.3H24504018L15070J28269Q524j12951j36197j12772j30415r2089l9458p8499
2404.7H24253500r7871p0095m9651K1934R6024M5299m9412o8069p6294p3015j3054
2427.2H23919296n901l5166R238L7551K4915N8830O1095o259k7239j7584l4332k0921
2451.6H23963523n841l2902m1723n0009q7201o9022k8730n2392l9399k086l5107m0830
2476.1H23478281k1040o1691p4327J2696J14799J83940K45511K31981J40250R5725
2496.5H24346125O1095l398P153L8505M589j2874l994p987K1875N3108L2544P987l1471
$$ plain form
2523 824513257 824431837 824376106 824416816 824532270 824694991 824903846 825093150 825223267 825331509 825389922 825356543
2545.5 825356543 825262785 825114250 824907422 824696243 824545145 824499249 824578285 824765742 825000703 825235069
2565.8 825235069 825445592 825583696 825631261 825622797 825546205 825402260 825290799 825237393 825167477 825072289 824928224
2588.3 824928224 824678659 824354231 823982000 823579013 823248088 823022366 822806120 822592676 822424173 822201490
2608.7 822201490 821878791 821524680 821108758 820627689 820185184 819792271 819423318 819096804 818759739 818386495
2629.1 818386495 818040133 817701459 817364037 817134917 816999376 816850662 816719353 816638708 816544652 816442490
2649.5 816442490 816344678 816223621 816161931 816198647 816250145 816312432 816385806 816412568 816439152 816534519 816637158
2671.9 816637158 816708386 816808701 816934049 817039073 817108214 817125440 817139328 817192852 817224562 817222297 817262650
$$ packed form
2523H24513257q1420n5731M0710J15454J62721K08855J89304J30117J08242N8413l3379
2545.5H25356543r3758j48535k06828k11179j51098m5896P9036J87457K34961K34366
2565.8H25235069K10523J38104M7565q464p6592j43945j11461n3406o9916r5188j44065
2588.3H24928224k49565l24428l72231m02987l30925k25722k16246k13444j68503k22683
2608.7H22201490l22699l54111m15922m81069m42505l92913l68953l26514l37065l73244
2629.1H18386495l46362l38674l37422k29120j35541j48714j31309q0645r4056j02162
2649.5H16442490r7812j21057o1690L6716N1498O2287P3374K6762K6584R5367J02639
2671.9H16637158P1228J00315J25348J05024O9141J7226J3888N3524L1710k265M0353
$$ plain form
2694.3 817262650 817350149 817431211 817502141 817559600 817568362 817558587 817562938 817505896 817370713 817229271 817075849
2716.8 817075849 816897333 816716850 816486120 816140652 815651357 815081835 814661622 814516127 814507127 814482391
2737.2 814482391 814411700 814308465 814224899 814237475 814293504 814242363 814062059 813837290 813591301 813304782
2757.6 813304782 812992692 812679768 812352538 811963797 811508834 811037064 810564518 810044169 809414625 808687627
2778 808687627 807924330 807155728 806403160 805670142 804909468 804040432 803006470 801875353 800785303
2796.3 800785303 799664259 798356235 796968400 795603335 794188023 792693913 791059554 789189875
2812.6 789189875 787125111 784901202 782419622 779618502 776501656 772960246 768861473 764126360
2828.9 764126360 758545280 751782596 743461549 732992887 719429553 701668978 678911030 652380288
$$ packed form
2694.3H17262650Q7499Q1062P0930N7459Q762r775M351n7042j35183j41442j53422
2716.8H17075849j78516j80483k30730l45468m89295n69522m20213j45495r000k4736
2737.2H14482391p0691j03235q3566J2576N6029n1141j80304k24769k45989k86519
2757.6H13304782l12090l12924l27230l88741m54963m71770m72546n20349o29544p26998
2778H08687627p63297p68602p52568p33018p60674q69036j033962j131117j090050
2796.3H00785303j121044j308024j387835j365065j415312j494110j634359j869679
2812.6G89189875k064764k223909k481580k801120l116846l541410m098773m735113
2828.9G64126360n581080o762684q321047j0468662j3563334j7760575k2757948k6530742
$$ plain form
2845.3 652380288 628590465 618018448 625646114 645434260 667414188 686022341 700479686
2859.5 700479686 711773217 720801830 727693319 731930077 733456254 733582914 734010518 735118628
2875.9 735118628 735908270 735244811 732777596 728958368 724476814 719777226 715009928 710178435 705164135
2894.2 705164135 699766219 693829894 687164068 679179370 668768108 654459894 634839296 610543072
2910.5 610543072 587161422 572837651 570542753 576572120 586464047 598047137 610203564 622054636
2926.8 622054636 633062720 642937481 651716769 659763336 667370498 674658000 681774616 688720882
2943.2 688720882 694907010 699192703 700421393 698153138 693514645 689224780 687845170 690075576
2959.5 690075576 695011258 701248050 707752407 714088202 720090270 725712538 730916500 735616744
$$ packed form
2845.3F52380288k3789823j0572017P627666J9788146K1979928J8608153J4457345
2859.5G00479686J1293531R028613O891489M236758J526177J26660M27604J108110
2875.9G35118628P89642o63459k467215l819228m481554m699588m767298m831493n014300
2894.2G05164135n397916n936325o665826p984698j0411262j4308214j9620598k4296224
2910.5F10543072k3381650j4323771k294898O029367R891927J1583090J2156427J1851072
2926.8F22054636J1008084R874761Q779288Q046567P607162P287502P116616O946266
2943.2F88720882O186128M285693J228690k268255m638493m289865j379610K230406
2959.5F90075576M935682O236792O504357O335795O002068N622268N203962M700244
$$ plain form
2975.8 735616744 739841461 743586540 746698916 749180019 751269579 753207088 755111575 756919801
2992.1 756919801 758536518 760032117 761374176 762484491 763482213 764428854 765331447 766265929 767202914
3010.5 767202914 767992377 768547356 768906474 769146800 769329488 769476175 769554377 769604206 769740462 769981563
3030.9 769981563 770269811 770431101 770389378 770400167 770532787 770536840 770314872 769977987 769663870 769351542
3051.3 769351542 768922150 768381894 767723143 766919494 766089261 765436769 765109241 764985204 764864862 764830470
3071.7 764830470 765041530 765499175 766068816 766595542 767116904 767727077 768365502 769041181 769823015 770600259
3092.1 770600259 771298766 772087276 773029447 773945391 774774373 775623739 776522696 777366340 778040946 778621495
3112.4 778621495 779270411 779936492 780436158 780690193 780774593 780856133 781073272 781365812 781497419 781464994
$$ packed form
2975.8G35616744M224717L745079L112376K481103K089560J937509J904487J808226
2992.1G56919801J616717J495599J342059J110315R97722R46641R02593R34482R36985
3010.5G67202914P89463N54979L59118K40326J82688J46687P8202M9829J36256K41101
3030.9G69981563K88248J61290m1723J0789J32620M053k21968l36885l14117l12328
3051.3G69351542m29392n40256o58751q03649q30233o52492l27528j24037j20342l4392
3071.7G64830470K11060M57645N69641N26726N21362O10173O38425O75679P81834P77244
3092.1G70600259O98507P88510R42171R15944Q28982Q49366Q98957Q43644O74606N80549
3112.4G78621495O48916O66081M99666K54035Q4400Q1540K17139K92540J31607l2425
$$ plain form
3132.8 781464994 781518221 781720996 781861424 781745791 781466842 781237841 781096160 780997515 780889392 780596197
3153.2 780596197 780052423 779445171 778911352 778403401 777817667 777133226 776395202 775635362 774846673 773982286
3173.6 773982286 773013175 771970332 770878971 769718587 768507302 767273426 766022146 764784098
3189.9 764784098 763574541 762366176 761190474 760143399 759209096 758300602 757422388 756573439 755716920
3208.3 755716920 754900932 754142046 753398597 752692640 752031147 751392066 750765681 750098288 749384224 748702168
3228.7 748702168 748062253 747326374 746299267 745005131 743646681 742319524 741026282 739784360 738530695
3247.1 738530695 737114966 735571802 734061539 732570469 730948448 729120433 727050900 724658310
3263.4 724658310 721924245 718850374 715265632 710800231 705278933 698951066 692233145 685688376
$$ packed form
3132.8G81464994N3227K02775J40428j15633k78949k29001j41681r8645j08123k93195
3153.2G80596197n43774o07252n33819n07951n85734o84441p38024p59840p88689q64387
3173.6G73982286r69111j042843j091361j160384j211285j233876j251280j238048
3189.9G64784098j209557j208365j175702j047075r34303r08494q78214q48949q56519
3208.3G55716920q15988p58886p43449p05957o61493o39081o26385o67393p14064o82056
3228.7G48702168o39915p35879j027107j294136j358450j327157j293242j241922j253665
3247.1G38530695j415729j543164j510263j491070j622021j828015k069533k392590
3263.4G24658310k734065l073871l584742m465401n521298o327867o717921o544769
$$ plain form
3279.7 685688376 680041969 675904632 673460782 672366321 672020912 671980083 672214210 672802925 673498571
3298 673498571 674117208 674780130 675381660 675604284 675416052 674995780 674463570 673820734 672906220 671532810
3318.4 671532810 669573903 666975856 663779497 660122216 656589508 654130578 653329849 654193997 656208754
3336.8 656208754 658456624 660216689 661217749 661454439 661388278 661650419 662193537 662565172 662621439
3355.2 662621439 662431419 661962032 661091387 659954369 658882499 657813549 656342864 654394329 652392507
3373.5 652392507 650694609 649212480 647732437 646181822 644664586 643357337 642354250 641565025
3389.8 641565025 640613079 639294624 637998939 637138724 636480272 635422945 633977950 632734478 631848812
3408.2 631848812 631071150 630261302 629335463 628330767 627450824 626781583 626288056 625984371 625918150 626000822
$$ packed form
3279.7F85688376n646407m137337k443850j094461l45409m0829K34127N88715O95646
3298F73498571O18637O62922O01530K22624j88232m20272n32210o42836r14514j373410
3318.4F71532810j958907k598047l196359l657281l532708k458930q00729Q64148K014757
3336.8F56208754K247870J760065J001060K36690o6161K62141N43118L71635N6267
3355.2F62621439j90020m69387q70645j137018j071870j068950j470685j948535k001822
3373.5F52392507j697898j482129j480043j550615j517236j307249j003087p89225
3389.8F41565025r51946j318455j295685q60215o58452j057327j444995j243472q85666
3408.2F31848812p77662q09848r25839j004696q79943o69241m93527l03685o6221Q2672
$$ plain form
3428.6 626000822 626015484 626077533 626351237 626536489 626438916 626354873 626570046 627053022 627756298 628651857
3449 628651857 629581749 630474031 631434143 632571816 633803964 634924650 636119127 637700438 639376163
3467.3 639376163 640605807 641375244 642216563 643475175 644995809 646367013 647472560 648711920 650211215
3485.7 650211215 651672721 653053105 654490948 655987263 657521307 658969879 660262048 661585510
3502 661585510 663010061 664354682 665704787 667420626 669469655 671355247 672870696 674266636 675758839
3520.4 675758839 677415371 679068863 680588543 682293177 684351981 686473191 688493609 690412939
3536.7 690412939 692236364 694000363 695621431 697176754 698921323 700785220 702628374 704634786
3553 704634786 706748128 708686113 710508883 712165415 713178575 713818908 715857327 719549954 722860098
$$ packed form
3428.6F26000822J4662O2049K73704J85252r7573q4043K15173M82976P03276Q95559
3449F28651857R29892Q92282R60112J137673J232148J120686J194477J581311J675725
3467.3F39376163J229644P69437Q41319J258612J520634J371204J105547J239360J499295
3485.7F50211215J461506J380384J437843J496315J534044J448572J292169J323462
3502F61585510J424551J344621J350105J715839K049029J885592J515449J395940J492203
3520.4F75758839J656532J653492J519680J704634K058804K121210K020418J919330
3536.7F90412939J823425J763999J621068J555323J744569J863897J843154K006412
3553G04634786K113342J937985J822770J656532J013160O40333K038419L692627L310144
$$ plain form
3571.3 722860098 725237429 727373004 729694724 732243180 734786987 736773789 738071978 739994347
3587.7 739994347 743234456 746149302 748287261 750575781 753156126 755713642 758387864 760736942
3604 760736942 762281179 763942480 766357601 768915951 771458209 773633063 775673151 778891504 782336354
3622.3 782336354 784165978 784237564 784639657 787567258 790887713 793371856 795318246 796788990 797954798
3640.7 797954798 798685730 798236609 796524823 796096385 799071431 802183568 803762913 805285275 807190180
3659 807190180 808409333 808856189 808676004 807449996 805797279 805317640 804899216 804423511 806153178
3677.4 806153178 808699727 810472250 811286569 810985029 809919000 809732199 811445773 813524842 814774215
3695.8 814774215 815062821 814670205 814578891 815310836 815561891 814440072 812881589 813176632 815222919
$$ packed form
3571.3G22860098K377331K135575K321720K548456K543807J986802J298189J922369
3587.7G39994347L240109K914846K137959K288520K580345K557516K674222K349078
3604G60736942J544237J661301K415121K558350K542258K174854K040088L218353L444850
3622.3G82336354J829624P1586M02093K927601L320455K484143J946390J470744J165808
3640.7G97954798P30932m49121j711786m28438K975046L112137J579345J522362J904905
3659H07190180J219153M46856j80185j226008j652717m79639m18424m75705J729667
3677.4H06153178K546549J772523Q14319l01540j066029j86801J713574K079069J249373
3695.8H14774215K88606l92616r1314P31945K51055j121819j558483K95043K046287
$$ plain form
3714.1 815222919 816619396 816663206 815939724 815205038 814946771 815344095 815753281 814991355 812958300
3732.5 812958300 811574578 812748075 814795732 815225005 813765705 812448919 812483788 812044084 811940968
3750.8 811940968 813921273 815819800 816283226 816398382 817191064 817729473 817459226 817046106 817060530
3769.2 817060530 817847967 818784893 818945765 818401337 818028152 818262339 818476856 818674207 819163918 819526792
3789.6 819526792 819383204 818572402 817322969 816149235 814952314 814530253 815313876 815913498 816708207
3807.9 816708207 817753196 817746520 816400170 814836204 813875794 813236415 814001441 815525413 816266060
3826.3 816266060 816440284 816168487 815560222 814775467 813633740 812932372 813597620 815065444 816601813
3844.6 816601813 817323864 816360235 813520432 810691297 811764121 814505398 815782309 815424263 814426720
$$ packed form
3714.1H15222919J396477M3810p23482p34686k58267L97324M09186p61926k033055
3732.5H12958300j383722J173497K047657M29273j459300j316786L4869m39704j03116
3750.8H11940968J980305J898527M63426J15156P92682N38409k70247m13120J4424
3769.2H17060530P87437R36926J60872n44428l73185K34187K14517J97351M89711L62874
3789.6H19526792j43588q10802j249433j173734j196921m22061P83623N99622P94709
3807.9H16708207J044989o676j346350j563966r60410o39379P65026J523972P40647
3826.3H16266060J74224k71797o08265p84755j141727p01368O65248J467824J536369
3844.6H16601813P22051r63629k839803k829135J072824K741277J276911l58046r97543
$$ plain form
3863 814426720 814129531 814004660 813384771 813464880 814445376 815524280 815831125 815012574 814415872 814432681
3883.4 814432681 814557850 814932704 814890802 814702094 815253317 815514266 814514816 812969744 812134206 812588930
3903.8 812588930 814155638 815704823 816431344 816434860 815859437 814988673 814642191 814945221 815125823 815125346
3924.2 815125346 815358579 815434158 815129578 815202236 815884888 816407979 816350281 815870881 815470517 815471888
3944.6 815471888 815441728 815295994 815511405 815946043 816134989 816096544 816038847 815988302 816002905 816073060 816050470
3967 816050470 815893352 815679550 815479040 815337241 815267324 815230131 815259576 815398276 815539360 815545738 815473735
3989.5 815473735 815478683 815549135 815641105 815772593
3997.6 815772593
$$ packed form
3863H14426720k97189j24871o19889Q0109R80496J078904L06845q18551n96702J6809
3883.4H14432681J25169L74854m1902j88708N51223K60949r99450j545072q35538M54724
3903.8H12588930J566708J549185P26521L516n75423q70764l46482L03030J80602m77
3924.2H15125346K33233P5579l04580P2658O82652N23091n7698m79400m00364J371
3944.6H15471888l0160j45734K15411M34638J88946l8445n7697n0545J4603P0155k2590
3967H16050470j57118k13802k00510j41799o9917l7193K9445J38700J41084O378p2003
3989.5H15473735M948P0452R1970J31488
3997.6H15772593
##END=$$ End of the data block
