##TITLE=DI 15-1837929-1 Monoalcool nao saturado $$ Begin of the data block
##JCAMP-DX=5.00 $$ ACD/SpecManager v 10.08
##SPECTROMETER/DATA SYSTEM=Alpha
##DATE=25 Nov 2015 09:11:28
##DATA TYPE=INFRARED SPECTRUM
##DATA CLASS=XYDATA
##ORIGIN=
##OWNER=
##NPOINTS=1667
##FIRSTX=599.64648438
##LASTX=3997.64306641
##MAXX=3997.64306641
##MINX=599.64648438
##MAXY=1.08754349
##MINY=0.46244851
##XFACTOR=1.0000000000
##YFACTOR=0.000000010000000
##FIRSTY=1.05388772
##DELTAX=2.03961372
##XUNITS=1/CM
##YUNITS=ARBITRARY UNITS
##XYDATA=(X++(Y..Y))
599.6A05388772m3344j1063j2946k9468k0016L136M100q213j6737l1614o1512o3336
624.1A05097759r227M5800O6698O0618L8373L5870M0317J9061l600k5940m9495l4678
648.6A05281556p296j5390k0230K492J4817J0539L302q6928k59411j43814J30164P1943
673.1A04981744k6357k7180J1599N3108P5758O0951N0605Q8072J01292O5601M5931
695.5A05481124N8520O2406N2082M4847K8527J084l6990p1144j07062j93620l50690
717.9A04969084m96721n05793l19219J4675K73228K99143K26450J87171J58524J16611
738.3A04923153P5054M1449P177l2604n5134n4646m5884j5711L9696Q1992R1136Q8191
762.8A05143869P5388M5931M4525R6500J62732K31445K89917K92456K50757K10631
$$ plain form
599.6 105388772 105345428 105334365 105321419 105291951 105271935 105275071 105279171 105270958 105254221 105222607 105161095 105097759
624.1 105097759 105088532 105134332 105201030 105261648 105300021 105335891 105376208 105395269 105391669 105365729 105316234 105281556
648.6 105281556 105274260 105258870 105238640 105241132 105255949 105266488 105269790 105182862 104923451 104779637 104909801 104981744
673.1 104981744 104955387 104928207 104939806 104992914 105068672 105129623 105180228 105268300 105369592 105435193 105481124
695.5 105481124 105539644 105602050 105654132 105698979 105727506 105728590 105691600 105620456 105513394 105319774 104969084
717.9 104969084 104472363 103966570 103647351 103662026 103935254 104234397 104460847 104648018 104806542 104923153
738.3 104923153 104998207 105039656 105046833 105014229 104959095 104904449 104858565 104842854 104882550 104964542 105055678 105143869
762.8 105143869 105219257 105265188 105309713 105406213 105568945 105800390 106090307 106382763 106633520 106844151
783.2A06844151J88637J69313J25861P3969M3297K5952J2755j0514o3109j11652j13082
805.6A07185578p8237m6062l4881l3450m6945o9534o0082j0216L4976K7966j6236o3622
830.1A06789255j14894j67930k13206k60305l58677n50604q22699j160574j522660
848.5A01617706j759315j674145j195431m55546L50940J036781J409823J420682J211405
866.8A01962900R53734P36356N75399M47202L04246J28758k9290r2828n472J47546
887.2A05128551J70290L4297j17946j88852j52122j4639J68454L16882L53909K71022
907.6A05969846J51778O6912L1340K3067P307l9267j13881k15542l72446n65302o84762
930.1A04259050o03294l20650J0968K35879L12686K93064K33162J62327O7115o3968
$$ plain form
783.2 106844151 107032788 107202101 107327962 107401931 107445228 107471180 107483935 107473421 107410312 107298660 107185578
805.6 107185578 107107341 107061279 107026398 106992948 106946003 106876469 106816387 106806171 106841147 106869113 106852877 106789255
830.1 106789255 106674361 106506431 106293225 106032920 105674243 105123639 104300940 103140366 101617706
848.5 101617706 99858391 98184246 96988815 96533269 96884209 97920990 99330813 100751495 101962900
866.8 101962900 102916634 103652990 104228389 104675591 104979837 105108595 105079305 104986477 104981005 105128551
887.2 105128551 105298841 105333138 105215192 105026340 104874218 104859579 105028033 105344915 105698824 105969846
907.6 105969846 106121624 106188536 106219876 106242943 106250250 106210983 106097102 105881560 105509114 104943812 104259050
930.1 104259050 103655756 103335106 103346074 103581953 103894639 104187703 104420865 104583192 104650307 104586339
950.5A04586339j90294k87401l92437n21374o08361n79417l96931o2990K96354M52996
970.9A02296484L19445K5248k84958n48231p41852q60047q95178q69674q49789q40759
991.3I6750689p91926p17228o81484p20191q23039r46438j026017j006388q79628o63316
1011.6H8495034l82090p7027K39331N62608Q46368J034510J105142J057231Q99488
1030I3780595O83200M67438K38877k9516k43276k87718j99800j11491j11037j79154
1050.4I4008118j67012O4748M24546O70445O26695L29155J0061q4936J80530O60664
1070.8I6723014R89777J023281R20987Q39734Q05306P65920O81055N60855M15790K38455
1091.2A03964174L6621j75166l80862n33319n82456n33283m91333n51092o11771n14239
$$ plain form
950.5 104586339 104396045 104108644 103716207 103194833 102586472 102007055 101610124 101547134 101843488 102296484
970.9 102296484 102615929 102641177 102356219 101807988 101066136 100206089 99310911 98441237 97591448 96750689
991.3 96750689 95958763 95241535 94560051 93839860 93016821 92070383 91044366 90037978 89158350 88495034
1011.6 88495034 88112944 88035917 88275248 88837856 89684224 90718734 91823876 92881107 93780595
1030 93780595 94463795 94931233 95170110 95140594 94897318 94609600 94409800 94298309 94187272 94008118
1050.4 94008118 93841106 93905854 94330400 95000845 95627540 95956695 95966756 95881820 96062350 96723014
1070.8 96723014 97712791 98736072 99657059 100496793 101302099 102068019 102749074 103309929 103725719 103964174
1091.2 103964174 104000795 103825629 103444767 102911448 102328992 101795709 101304376 100753284 100141513 99627274
1111.6I9627274k42436J23334M47214N54317M13418K12145J58071L05426N54240P59232
1132A02912235Q25322P61628O37686M89426L48461K39491J56987R9683O1202L4809
1152.4A06566930J9598N054k1088n3489p8714r7561j03950j00875j15657j49250j82939
1174.8A05688059k08473k15375j82295j19209o7032m1508m1998n8114o0034m6468m9937
1197.3A04597616p0119j01268j55365k13993k39611j82819l7110J07241J57571J11675
1217.7A03973818L4487l3057q3863r2578m7815K7942R1208J00243M9471m4965j59741
1240.1A03815150k67660l48592m00722m36771m51267m17817l21006j86396o4731K7609
1260.5A00947797P9489P5424M0257r763n4455n3132j6868J6999M3798M7719n078j26231
$$ plain form
1111.6 99627274 99384838 99508172 99955386 100509703 100923121 101135266 101293337 101598763 102153003 102912235
1132 102912235 103737557 104499185 105136871 105626297 105974758 106214249 106371236 106470919 106532121 106566930
1152.4 106566930 106586528 106591582 106570494 106517005 106438291 106340730 106236780 106135905 106020248 105870998 105688059
1174.8 105688059 105479586 105264211 105081916 104962707 104895675 104854167 104812169 104754055 104694021 104647553 104597616
1197.3 104597616 104527497 104426229 104270864 104056871 103817260 103634441 103597331 103704572 103862143 103973818
1217.7 103973818 104008305 103975248 103891385 103798807 103750992 103778934 103870142 103970385 104019856 103974891 103815150
1240.1 103815150 103547490 103198898 102798176 102361405 101910138 101492321 101171315 100984919 100920188 100947797
1260.5 100947797 101027286 101102710 101142967 101133204 101078749 101025617 101008749 101025748 101069546 101117265 101112187 100985956
1285A00985956k72500l75438m25857m38542m31865m65679o00022p49117o36518j40858
1305.4I6449560M34321O82837N81705M11481L07757K58207K80088K94566K36202J87385
1325.8A00124109J99997K39539K22612O7282k03848l80957j83929K13123L53312K45464
1346.2A00896704Q4055m5503j39105k10452k67470l89308n50019m66627j37192j04755
1366.6I8670328l93606p19112j047015j183438q20798J2958R07844J102061N84507
1384.9I7113729K21169L32486L21806N7739k0659J28197K57534K75695R5928K8271
1405.3I8811895J41006J10835L4470j8061k14392l95739r9784K19542O8688j37633
1425.7I8520827m05454o69021o53243o88213q54748n40668j55366k46483m67473p36803
$$ plain form
1285 100985956 100713456 100338018 99912161 99473619 99041754 98576075 97976053 97226936 96590418 96449560
1305.4 96449560 96883881 97566718 98148423 98559904 98867661 99125868 99405956 99700522 99936724 100124109
1325.8 100124109 100324106 100563645 100786257 100853539 100649691 100268734 100084805 100297928 100651240 100896704
1346.2 100896704 100980759 100935256 100796151 100585699 100318229 99928921 99378902 98912275 98775083 98670328
1366.6 98670328 98276722 97557610 96510595 95327157 94506359 94519317 95427161 96529222 97113729
1384.9 97113729 97334898 97667384 97989190 98046929 98026270 98154467 98412001 98687696 98783624 98811895
1405.3 98811895 98952901 99063736 99098206 99080145 98865753 98470014 98370230 98589772 98658460 98520827
1425.7 98520827 98115373 97446352 96793109 96104896 95250148 94709480 94554114 94307631 93840158 93103355
1446.1I3103355j024014j233357j532364j857322j972968q63397M49616N98234P58916
1464.5H6426699J422739K067524K681649L404540L038657J931810J196098P24864M54009
1482.8A03348589J59550j91725j41966M44317N41115M2534j23668K67637L42440j57726
1503.2A04531097r06848o48881P30920P82335K10595k46060k99370k10345p0989L21365
1523.6A04193819M00829L83377K65825j15049j28365M5121m73642q85928J05834Q18074
1544A04609895P22944L24691P725r2161l00837p16102q02624O83081J095796M15206
1564.4A05947614j2303j96850M8459K04765j61147j17635M01234L60823J18685K0718
1584.8A06614363j0431l5417m4107m7541j8334L9542K2685m4012m8935l9530p1383
$$ plain form
1446.1 93103355 92079341 90845984 89313620 87456298 85483330 84619933 85069549 85667783 86426699
1464.5 86426699 87849438 89916962 92598611 96003151 99041808 100973618 102169716 102894580 103348589
1482.8 103348589 103508139 103316414 103174448 103618765 104159880 104202414 104078746 104346383 104688823 104531097
1503.2 104531097 103624249 102975368 103706288 104488623 104699218 104453158 104153788 103943443 103872454 104193819
1523.6 104193819 104594648 104978025 105243850 105128801 105000436 105045557 104571915 103685987 103791821 104609895
1544 104609895 105332839 105657530 105665255 105573094 105272257 104556155 103753531 104436612 105532408 105947614
1564.4 105947614 105935311 105738461 105786920 105991685 105830538 105712903 106114137 106474960 106593645 106614363
1584.8 106614363 106603932 106568515 106524408 106476867 106458533 106498075 106520760 106476748 106427813 106388283 106316900
1607.2A06316900l5333K1708j49501m12953j55377K01893n7161j87552M7898J38426
1627.6A05728948J54674m3070n47159n58936L35037N54991J55735l56281o75237j71459
1648A04577243P5007n03326k3317Q90017M44305j95420m68755k76816k86245m97210
1668.4A03735483p1764M42898M38082M71616L08859j74975n83863j09911O70230M92895
1688.8A05619550K14457r9385n48172n89025k47478K16734L94357J96123K49827K81405
1709.2A05688393j848l70216o00839k09915O12020O38843K83921R9146p8976l01469
1729.6A05759060m43017k79904L07978L00860Q261K0290N4848p6866k12801l7348L81625
1752A05782986L60620O4659j8788l2556L4035J67799j7226k91288l73650j01471L69788
$$ plain form
1607.2 106316900 106281567 106303275 106153774 105740821 105585444 105787337 105730176 105542624 105590522 105728948
1627.6 105728948 105883622 105840552 105293393 104734457 105069494 105624485 105780220 105423939 104748702 104577243
1648 104577243 104652250 104148924 104125607 105015624 105459929 105264509 104795754 104518938 104232693 103735483
1668.4 103735483 103663719 104106617 104544699 105016315 105325174 105150199 104566336 104456425 105126655 105619550
1688.8 105619550 105834007 105734622 105186450 104597425 104349947 104566681 104961038 105157161 105406988 105688393
1709.2 105688393 105686545 105316329 104715490 104505575 105117595 105756438 106040359 106139505 106060529 105759060
1729.6 105759060 105316043 105036139 105344117 105644977 105653238 105673528 105728376 105651510 105438709 105401361 105782986
1752 105782986 106143606 106208265 106189477 106156921 106190956 106358755 106341529 106050241 105676591 105575120 105944908
1774.5A05944908L67617Q2243k8968M1211P9011N8592j35458l62038j24479K51806
1794.9A06174445J59574o0487k7335J69242J77323L255j17564k6501J30308J01757
1815.3A06684017J5509L839o8844j93870j65259j06323n0724K04516K57671P0083j502
1837.7A06649113m1569k20131k50125Q3935K71070J97363R1970K0909o664j7524j1384
1860.2A06766963j3101j04332k75934k22230J65236L17192J48881J8537p737o187p844
1882.6A06779444j9932p5101j07277J3363P8834K0730L9280O1523J8991p546k6024
1905A06776285o5744n1725L3796M0829q6069j43659k9862K0755M2283J23549R8633
1927.5A06759071K9528P713M459J8215J0765p3112j25086k718J17207R9182M3857O104
$$ plain form
1774.5 105944908 106312525 106394768 106365800 106407011 106486022 106544614 106409156 106047118 105922639 106174445
1794.9 106174445 106334019 106273532 106246197 106415439 106592762 106596017 106478453 106451952 106582260 106684017
1815.3 106684017 106699526 106703365 106634521 106440651 106275392 106169069 106118345 106322861 106580532 106650615 106649113
1837.7 106649113 106607544 106387413 106137288 106221223 106492293 106689656 106781626 106802535 106795871 106778347 106766963
1860.2 106766963 106753862 106649530 106373596 106151366 106316602 106633794 106782675 106801212 106793475 106787288 106779444
1882.6 106779444 106759512 106684411 106577134 106590497 106669331 106690061 106729341 106790864 106809855 106802309 106776285
1905 106776285 106710541 106658816 106692612 106733441 106647372 106503713 106473851 106494606 106536889 106660438 106759071
1927.5 106759071 106788599 106796312 106800771 106818986 106829751 106756639 106631553 106628835 106746042 106845224 106889081 106895185
1951.9A06895185l291J4317K5726J0121j2386m9985o3336J7500Q3685N0664J0658K098
1976.4A06980956k981m29J0026q11l3855n9760o0344O676P9870O1202J8192L945K587
2002.9A07005274O092J418l349K50j0467l8373k5058K8062L8469J2767L243J1790J3804
2029.4A07043922N531N317M578q870j7595j91K4605K6167J2350O509J1813J0491L075
2056A07127702M196J0920j419j8131N304L4082K3628N603J2028K2554J5628J1755J6558
2082.5A07270408J0502l076p987N460J9121J3483M125L564R990J0490L994L159K634
2109A07345867j454l874K861J2743J2290P391O259N758L946L445J776k253p27Q487
2137.5A07402515J2446J1480J1468N769k62l81N48J79J514N758N352K289M423O246
$$ plain form
1951.9 106895185 106891894 106906211 106931937 106942058 106929672 106879687 106816351 106833851 106917536 106968200 106978858 106980956
1976.4 106980956 106977975 106977546 106987572 106986761 106952906 106893146 106832802 106839478 106919348 106980550 106998742 107002687 107005274
2002.9 107005274 107011366 107012784 107009435 107009685 106999218 106960845 106935787 106963849 107002318 107015085 107018328 107030118 107043922
2029.4 107043922 107049453 107054770 107059348 107050478 107032883 107032692 107057297 107083464 107095814 107102323 107114136 107124627 107127702
2056 107127702 107131898 107142818 107141399 107123268 107128572 107162654 107186282 107191885 107203913 107226467 107242095 107253850 107270408
2082.5 107270408 107280910 107277834 107269847 107275307 107294428 107307911 107312036 107315600 107325590 107336080 107340074 107343233 107345867
2109 107345867 107344413 107340539 107343400 107356143 107368433 107375824 107382083 107387841 107391787 107395232 107397008 107394755 107394028 107402515
2137.5 107402515 107414961 107426441 107437909 107443678 107443416 107443035 107443583 107443762 107445276 107451034 107456386 107458675 107463098 107469344
2166.1A07469344Q214O830L22q10M53L469L779j002K098J4019K2245J4770K205P212
2194.6A07553148K1339J6653K671N102J5497J6165J0335J0228J4746J5903J3399P641
2219.1A07702827J538K933P486J2624J8752J4663P224Q178R739Q011L230k312j025
2245.6A07793868O401Q619M77n579l350q94L397O831k944j2100k897Q333P164L636
2274.2A07810962R060J9431K1458J0168n650j8406k5535k7060l0637l2508k5642k3937
2298.7A07681704l8565n4073n8293o4552p4244p6019p1037p0775q8787j10447r9957
2321.1A06874955n8222l4607n3083q3268p3493j8143J1933o295k4903j5997L3474J50978
2345.6A06703329J91975M2116j56140k53665k29156j50645m7410M6599R4295J16217
$$ plain form
2166.1 107469344 107477558 107484388 107484710 107483900 107484353 107487822 107491601 107490599 107492697 107506716 107528961 107543731 107545936 107553148
2194.6 107553148 107574487 107591140 107593811 107598913 107614410 107630575 107640910 107651138 107665884 107681787 107695186 107702827
2219.1 107702827 107704365 107707298 107714784 107727408 107746160 107760823 107768047 107776225 107785964 107793975 107797205 107794893 107793868
2245.6 107793868 107800269 107808888 107809365 107803786 107800436 107799542 107802939 107809770 107806826 107794726 107791829 107800162 107807326 107810962
2274.2 107810962 107820022 107839453 107860911 107871079 107865429 107847023 107821488 107794428 107763791 107731283 107705641 107681704
2298.7 107681704 107643139 107589066 107530773 107466221 107391977 107315958 107244921 107174146 107085359 106974912 106874955
2321.1 106874955 106816733 106782126 106729043 106645775 106572282 106554139 106566072 106559777 106534874 106518877 106552351 106703329
2345.6 106703329 106895304 106937420 106781280 106527615 106298459 106147814 106100404 106147003 106241298 106357515
2366A06357515J52469J99353K06280J85382J88613K07293K09606J82009J34527P9072
2386.4A08102119K7990L779Q083J0657l22k694O187N627P1M125L874j407P356J9645
2414.9A08195090J5557O402J0132J4294P200m53k754j776P844K3579L0423K4569J5700
2441.4A08345807J0621J1456J6618J8132J2099M924N388K551n281p99P666J1921J3589
2467.9A08454692M948n019j192N519L159m780m196J2409K2448J0395k635N639J8823
2494.5A08520210J2791k682o974n460q917p105j919o676j7535j9610j8180j7011o067
2521A08414865L278Q893J1158J0574R024l791n424Q249N49j7286j1348M947J585j6951
2549.5A08418322k0421n197K360q58o80j109o091o306J979K932q285q833K50M947K265
$$ plain form
2366 106357515 106509984 106709337 106915617 107100999 107289612 107496905 107706511 107888520 108023047 108102119
2386.4 108102119 108130109 108133888 108141971 108152628 108152306 108149612 108155799 108161426 108161497 108165622 108169496 108168089 108175445 108195090
2414.9 108195090 108210647 108217049 108227181 108241475 108248675 108248222 108245468 108243692 108251536 108275115 108305538 108330107 108345807
2441.4 108345807 108356428 108367884 108384502 108402634 108414733 108419657 108425045 108427596 108422315 108421516 108429182 108441103 108454692
2467.9 108454692 108459640 108454621 108453429 108458948 108462107 108457327 108453131 108465540 108487988 108498383 108495748 108501387 108520210
2494.5 108520210 108533001 108530319 108523345 108517885 108508968 108501863 108499944 108493268 108475733 108456123 108437943 108420932 108414865
2521 108414865 108418143 108427036 108438194 108448768 108457792 108454001 108448577 108456826 108457375 108440089 108428741 108433688 108435273 108418322
2549.5 108418322 108397901 108392704 108395064 108394206 108393526 108392417 108386326 108380020 108381999 108384931 108376646 108367813 108368063 108373010 108375275
2580.1A08375275o163n531j0002k8503k7561n806P403K003j1075j1825o68J622n854
2606.6A08273315q070n484j3458k7538k6643k0289k3210k3199j6379j3912k0015k5463
2631.1A08049655k6059k6906k1839o175K718o127j6082j8799j8620j9682k9385m0615
2655.6A07822084l8707l1710l3748l2973k3925j5748p319M649J5664J5092R942J0931
2680.1A07694232J6094K0730J0205j0062j5759q953k02j240j4830k5940l4034l9530
2704.5A07590711m8530o8784p8022p0405o8057p2622p8118q4758q7940q6165n7995
2727A06789315l350L0935M0376M7743N5826O0248M7362K4629O854J944J6641K5749
2751.4A07144272O414k5356m2033m2868m3762m7695m9210m5788n2083p8547q8644n9402
$$ plain form
2580.1 108375275 108369112 108363581 108353579 108325076 108297515 108291709 108299112 108301115 108290040 108278215 108277547 108279169 108273315
2606.6 108273315 108265245 108259761 108246303 108218765 108192122 108171833 108148623 108125424 108109045 108095133 108075118 108049655
2631.1 108049655 108023596 107996690 107974851 107968676 107971394 107965267 107949185 107930386 107911766 107892084 107862699 107822084
2655.6 107822084 107783377 107751667 107717919 107684946 107661021 107645273 107637954 107642603 107658267 107673359 107683301 107694232
2680.1 107694232 107710326 107731056 107741261 107731199 107715440 107706487 107706285 107705045 107690215 107664275 107630241 107590711
2704.5 107590711 107542181 107473397 107395375 107324970 107256913 107184291 107106173 107021415 106933475 106847310 106789315
2727 106789315 106785965 106816900 106857276 106905019 106960845 107021093 107068455 107093084 107099938 107101882 107118523 107144272
2751.4 107144272 107150686 107125330 107083297 107040429 106996667 106948972 106899762 106853974 106801891 106723344 106634700 106575298
2775.9A06575298m8470q2755j09852j10054j21700j47677j39880j17755j35136j72996
2796.3A05389023j77872j53959j60694j95945k22444k44427k58708k68829k94244l34573
2816.7A03077328l85296m34494m72772n17082n85664o67572p53635q76188j070452
2835.1I7314173j340997j675046k094096k613330l107804l356427l273856l043497
2851.4G6809120k892297k746392k234840j129651K42972J167220J106203J57088q84688
2869.7F9594735r44644L69048K179175L218067L077853K259648J354891O23661R0486
2888.1H1822920k93476n60915p10648p65336q16297r48853j175511j464432j752085
2906.5G3335367j981943k153796k278555k333891k325559k320570k384573k528608
$$ plain form
2775.9 106575298 106526828 106444073 106334221 106224167 106102467 105954790 105814910 105697155 105562019 105389023
2796.3 105389023 105211151 105057192 104896498 104700553 104478109 104233682 103974974 103706145 103411901 103077328
2816.7 103077328 102692032 102257538 101784766 101267684 100682020 100014448 99260813 98384625 97314173
2835.1 97314173 95973176 94298130 92204034 89590704 86482900 83126473 79852617 76809120
2851.4 76809120 73916823 71170431 68935591 67805940 68048912 69216132 70322335 70479423 69594735
2869.7 69594735 68650091 69019139 71198314 74416381 77494234 79753882 81108773 81732434 81822920
2888.1 81822920 81529444 80968529 80257881 79492545 78676248 77727395 76551884 75087452 73335367
2906.5 73335367 71353424 69199628 66921073 64587182 62261623 59941053 57556480 55027872
2922.8E5027872k673733k624693k189541j295054P7021J716038L084279L740871L641277
2941.1E8504337K963305J846075L46923j353544k796311l505861l353149k550930j337737
2959.5D8763108K64037K181357M038703N335087N754298N353737M457587L439653K588576
2977.8H2176143K056080J849377J846653J874835J820355J661510J460158J288772
2994.2I6033883J140267J009321R01878P84188O72317N86641M84872L72624L11589
3012.5A02297580L09479L06893K73406K31982J87361J57201J59693J47402J09661R8622
3032.9A04279280J35183J65558J24776O7640O5791P9227N9414J3363j7393j9061j0824
3055.3A04942954J3208L8576L9828L9184N3561Q5890J22643J08492L6693k9862m8018
$$ plain form
2922.8 55027872 52354139 49729446 47539905 46244851 46321872 48037910 51122189 54863060 58504337
2941.1 58504337 61467642 63313717 63660640 62307096 59510785 56004924 52651775 50100845 48763108
2959.5 48763108 49027145 51208502 55247205 60582292 66336590 71690327 76147914 79587567 82176143
2977.8 82176143 84232223 86081600 87928253 89803088 91623443 93284953 94745111 96033883
2994.2 96033883 97174150 98183471 99085349 99869537 100541854 101128495 101613367 101985991 102297580
3012.5 102297580 102607059 102913952 103187358 103419340 103606701 103763902 103923595 104070997 104180658 104279280
3032.9 104279280 104414463 104580021 104704797 104772437 104838228 104917455 104976869 104990232 104972839 104953778 104942954
3055.3 104942954 104956162 104994738 105034566 105073750 105127311 105213201 105335844 105444336 105481029 105451167 105403149
3077.8A05403149j8358J8728K7322J8621j419j6677p236q714l7658p2384p5579l2198
3102.2A05197597j1719m8649p3779o0033p3624j19889j23525q0204l1268P87j2732
3124.7A04562962o2966j03152j10865r3698q3614j05667j19972r4557p9000r8169j21963
3147.1A03489339j47640j64318j36948j00207j01173j09244j12748j22666j29450j37829
3167.5A02227116j47713j56653j70564j82605j79398j61970j51753j64569j76739j72687
3187.9A00562465j77824j90592j95652j98037j99294j98305j96850k07591k32899k46233
3208.3I8519188k37840k32172k33919k37018k47800k53427k55847k64966k65950k67738
3228.7I6022511k89047l01004k81292k64329k72506k92903l11214l20518l15350l04562
$$ plain form
3077.8 105403149 105384791 105403519 105430841 105449462 105448043 105431366 105424130 105415416 105377758 105305374 105229795 105197597
3102.2 105197597 105185878 105137229 105063450 105003417 104929793 104809904 104686379 104606175 104574907 104575694 104562962
3124.7 104562962 104499996 104396844 104285979 104192281 104108667 104003000 103883028 103788471 103709471 103611302 103489339
3147.1 103489339 103341699 103177381 103040433 102940226 102839053 102729809 102617061 102494395 102364945 102227116
3167.5 102227116 102079403 101922750 101752186 101569581 101390183 101228213 101076460 100911891 100735152 100562465
3187.9 100562465 100384641 100194049 99998397 99800360 99601066 99402761 99205911 98998320 98765421 98519188
3208.3 98519188 98281348 98049176 97815257 97578239 97330439 97077012 96821165 96556199 96290249 96022511
3228.7 96022511 95733464 95432460 95151168 94886839 94614333 94321430 94010216 93689698 93374348 93069786
3249.1I3069786l11852l27807l26175l12990l15618l30371l30985l25524l32016l46488
3269.5H9809960l49164l35348l26991l29959l34209l31539l23570l16006l08192l07583
3289.9H6547399l08353k98298k90542k91759k93815k90269k76619k66636k63321k55966
3310.3H3711821k44713k24894k10542k09427j96659j75983j71018j71029j59192j44530
3330.7H1803834j25181r4640p3106o7949o1417n0085m7761l7593n794J3799J0580N060
3355.2H1269747J6803M1979O2645Q0919R9730J15472J15389J01817J03676J28228J58262
3377.6H2294667J65736J46533J47140J76531J95378J89370J85746K02763K15536K19661
3398H4139061K22528K24054K29335K27266K20770K36797K61855K62958K44838K22916
$$ plain form
3249.1 93069786 92757934 92430127 92103952 91790962 91475344 91144973 90813988 90488464 90156448 89809960
3269.5 89809960 89460796 89125448 88798457 88468498 88134289 87802750 87479180 87163174 86854982 86547399
3289.9 86547399 86239046 85940748 85650206 85358447 85064632 84774363 84497744 84231108 83967787 83711821
3310.3 83711821 83467108 83242214 83031672 82822245 82625586 82449603 82278585 82107556 81948364 81803834
3330.7 81803834 81678653 81584013 81510907 81442958 81381541 81331456 81283695 81246102 81240308 81254107 81264687 81269747
3355.2 81269747 81286550 81328529 81391174 81472093 81571823 81687295 81802684 81904501 82008177 82136405 82294667
3377.6 82294667 82460403 82606936 82754076 82930607 83125985 83315355 83501101 83703864 83919400 84139061
3398 84139061 84361589 84585643 84814978 85042244 85263014 85499811 85761666 86024624 86269462 86492378
3418.4H6492378K28375K73853L03400K90733K75392K79510K95144K98071K81543K70837
3438.8H9289236K80714K86538K61819K72184L42173L72583L49199L18218K86918K73329
3459.2I2332911K84321L04269L07322L00336L14051L17543K93494K85041K84100K56782
3479.6I5280170K62601L15225L21072L05462L28714L20595K65265K45022K51085K13426
3500I8108637J76311K46584L27671L03995K92629L19458L03298K70903K31850J56295
3520.4A00737631J07003J61683K45440K89941L20613K83707J90496J81270K26926J56284
3540.8A02900994P403J967K11584L36576K33137J93382K54953K00760P2420j1158j09506
3563.2A04292512k12944K1553M69435M91798K56741J14429P7855P3731L9089j16706
$$ plain form
3418.4 86492378 86720753 86994606 87298006 87588739 87864131 88143641 88438785 88736856 89018399 89289236
3438.8 89289236 89569950 89856488 90118307 90390491 90732664 91105247 91454446 91772664 92059582 92332911
3459.2 92332911 92617232 92921501 93228823 93529159 93843210 94160753 94454247 94739288 95023388 95280170
3479.6 95280170 95542771 95857996 96179068 96484530 96813244 97133839 97399104 97644126 97895211 98108637
3500 98108637 98284948 98531532 98859203 99163198 99455827 99775285 100078583 100349486 100581336 100737631
3520.4 100737631 100844634 101006317 101251757 101541698 101862311 102146018 102336514 102517784 102744710 102900994
3540.8 102900994 102908397 102910364 103121948 103458524 103691661 103885043 104139996 104340756 104413176 104402018 104292512
3563.2 104292512 104079568 104101121 104570556 105062354 105319095 105433524 105511379 105585110 105624199 105507493
3583.6A05507493k75779n7530L25370K37262n806r644N3549N8627R2590J9467j86157
3606A05759442k38729j17409q4937p8570q0729p4375J95909M08220K03514j58512j16408
3628.5A05617416M87375O15549L68762K30909J42562N5933o4301l44480o81769m96996
3648.8A05930960L87514O85763L41129J65737K32721J93989O4301j51479m36306n03588
3669.2A06910741k11823j67215j43480M02689O06072L89481J04308k39456n02717k27619
3689.6A06920981M16649N32782K74610M3035j04606p0441R3627m804l22890m22788
3710A07356155J2684M47809L20304j1039j98316j73104m3667R0921P8500k17104n71859
3732.5A07091284m62890J79076M91155J90520k28799k74527k8669j09745l1924M55094
$$ plain form
3583.6 105507493 105231714 105174184 105499554 105736816 105731010 105721366 105774915 105833542 105926132 105945599 105759442
3606 105759442 105520713 105403304 105318367 105239797 105159068 105084693 105280602 105688822 105892336 105733824 105617416
3628.5 105617416 106104791 106720340 107089102 107320011 107462573 107518506 107454205 107109725 106427956 105930960
3648.8 105930960 106318474 107004237 107345366 107511103 107743824 107937813 108002114 107850635 107414329 106910741
3669.2 106910741 106698918 106531703 106388223 106790912 107396984 107786465 107890773 107651317 107148600 106920981
3689.6 106920981 107337630 107870412 108145022 108188057 108083451 108013010 108106637 108101833 107778943 107356155
3710 107356155 107368839 107816648 108136952 108125913 107927597 107754493 107710826 107801747 107880247 107663143 107091284
3732.5 107091284 106628394 106807470 107298625 107489145 107260346 106985819 106957150 106847405 106815481 107270575
3752.9A07270575M55582J14834L2973K07007J61469m2128r3341J371K00820K67338
3773.3A08576500N8926j82772j66226N9784J18410R4986J23036P1705l0327j72627
3793.7A08551395k95436k73490k73228j29664K00129K10034K24901K86853M9508k99883
3814.1A08251119l87454k23279j36555J60957L64470K03109O6769o2406j92928k58208
3834.4A07785594l08144j32131K25723L58712L24035J76680j52135n57923n90491K01213
3854.8A07331133N85794K92826o3348k21240q0908l1471j47843P98K31398K78580J17099
3877.3A08292818j73724j63042L838O0690J45995M3309k6452J39820O4445k48468l68703
3899.7A07770526j81472J27184L99840M10402K02465J7262j22643k09474j05751N2440
$$ plain form
3752.9 107270575 107726157 107840991 107873964 108080971 108242440 108200312 108106971 108108342 108309162 108576500
3773.3 108576500 108635426 108452654 108286428 108346212 108464622 108559608 108682644 108754349 108724022 108551395
3793.7 108551395 108255959 107982469 107709241 107579577 107779706 107989740 108214641 108501494 108551002 108251119
3814.1 108251119 107863665 107640386 107503831 107664788 108029258 108232367 108299136 108236730 108043802 107785594
3834.4 107785594 107477450 107345319 107571042 107929754 108253789 108430469 108278334 107720411 107129920 107331133
3854.8 107331133 107916927 108209753 108146405 107925165 107844257 107812786 107664943 107665741 107897139 108175719 108292818
3877.3 108292818 108119094 107956052 107959890 108020580 108166575 108209884 108183432 108323252 108387697 108139229 107770526
3899.7 107770526 107589054 107716238 108116078 108526480 108728945 108746207 108623564 108414090 108308339 108360779
3920.1A08360779N0581J2493M1139q857j04952k4378J48689J53375K0015r6619q1265
3942.5A08471000K6560K1625k0755M0901Q3554N1248Q404j8883k0814J6928L3569k265
3967A08691072k7120l2270l6501j7190K0408L7897J8954j2827j1444O509L874J919
3991.5A08643281J0908J5497J5211
3997.6A08684897
$$ plain form
3920.1 108360779 108411360 108423853 108464992 108456135 108351183 108326805 108475494 108628869 108648884 108552265 108471000
3942.5 108471000 108497560 108519185 108498430 108539331 108622885 108674133 108682537 108663654 108642840 108659768 108693337 108691072
3967 108691072 108663952 108631682 108595181 108577991 108598399 108636296 108655250 108642423 108630979 108637488 108641362 108643281
3991.5 108643281 108654189 108669686 108684897
3997.6 108684897
##END=$$ End of the data block
