##TITLE=DI 15-1037358-8 - lado fosco $$ Begin of the data block
##JCAMP-DX=5.00 $$ ACD/SpecManager v 10.08
##SPECTROMETER/DATA SYSTEM=Alpha
##DATE=29 Jun 2015 09:06:24
##DATA TYPE=INFRARED SPECTRUM
##DATA CLASS=XYDATA
##ORIGIN=
##OWNER=
##NPOINTS=1667
##FIRSTX=599.57470703
##LASTX=3997.16503906
##MAXX=3997.16503906
##MINX=599.57470703
##MAXY=0.98223978
##MINY=0.82846951
##XFACTOR=1.0000000000
##YFACTOR=1.000000000000000e-9
##FIRSTY=0.83451062
##DELTAX=2.03937006
##XUNITS=1/CM
##YUNITS=ARBITRARY UNITS
##XYDATA=(X++(Y..Y))
$$ plain form
599.6 834510624 833361030 832072556 830781281 829696715 828988791 828469515 828472793 829070747 829434574
617.9 829434574 829585493 830204546 831207216 832064569 832704782 833114445 833372176 833942294 834815323 835683227
638.3 835683227 836560905 837466538 838333189 839201927 840011477 840810895 841907501 843099356 843929231
656.7 843929231 844547749 845141351 845606863 846019506 846385777 846234560 845660329 845359087 845429242 845474184
677.1 845474184 845531106 846014321 846712232 847276926 847610652 847758353 847960413 848348022 848964155 849727452
697.5 849727452 850436985 851250708 852268815 853350163 854538083 855626881 856461644 857385099 858251631
715.8 858251631 858616710 858696342 858856320 859003603 858976185 858941793 859102190 859448910 859853268 860077858
736.2 860077858 860079646 860161960 860365391 860493183 860719919 861197650 861783862 862293661 862613797 862770081
$$ packed form
599.6H34510624j149594j288474j291275j084566p07924n19276L278N97954L63827
617.9H29434574J50919O19053J002670Q57353O40213M09663K57731N70118Q73029Q67904
638.3H35683227Q77678R05633Q66651Q68738Q09550P99418J096606J191855Q29875
656.7H43929231O18518N93602M65512M12643L66271j51217n74231l01242P0155M4942
677.1H45474184N6922M83215O97911N64694L33726J47701K02060L87609O16133P63297
697.5H49727452P09533Q13723J018107J081348J187920J088798Q34763R23455Q66532
715.8H58251631L65079P9632J59978J47283k7418l4392J60397L46720M04358K24590
736.2H60077858J788Q2314K03431J27792K26736M77731N86212N09799L20136J56284
$$ plain form
756.6 862770081 862607539 862157881 861705601 861119092 860478520 860079944 859958649 860456288 861863852 863677442
777 863677442 865181148 866288781 867221057 867956519 868340790 868412137 868498206 868679285 868772209 868767738 868651092
799.4 868651092 868369281 868003964 867753386 867948771 868627369 869173348 869300783 869313598 869311452 869352102
819.8 869352102 869552970 869861245 870082080 870161593 870249927 870424509 870713353 871026933 871354342 871771395
840.2 871771395 872081101 872233570 872348964 872415006 872546434 872848213 873151779 873253584 873218775 873115182
860.6 873115182 872907281 872743487 872711480 872725606 872687221 872625887 872733772 872977853 873041391 872893989 872886837
883 872886837 873145998 873443365 873579323 873621523 873818219 874149561 874266326 874099135 873950481 873870373
903.4 873870373 873703897 873467207 873228967 873093128 873033047 872890234 872780025 872782469 872775912 872772336 872733593
$$ packed form
756.6H62770081j62542m49658m52280n86509o40572l98576j21295M97639J407564J813590
777H63677442J503706J107633R32276P35462L84271P1347Q6069J81079R2924m471j16646
799.4H68651092k81811l65317k50578J95385O78598N45979J27435J2815k146M0650
819.8H69352102K00868L08275K20835P9513Q8334J74582K88844L13580L27409M17053
840.2H71771395L09706J52469J15394O6042J31428L01779L03566J01805l4809j03593
860.6H73115182k07901j63794l2007J4126l8385o1334J07885K44081O3538j47402p152
883H72886837K59161K97367J35958M2200J96696L31342J16765j67191j48654q0108
903.4H73870373j66476k36690k38240j35839o0081j42813j10209K444o557l576l8743
$$ plain form
925.9 872733593 872672677 872699320 872730851 872739732 872816563 872933090 872943759 872840047 872787237 872839749 872944653
948.3 872944653 872970641 872796476 872470677 872202337 872209489 872470915 872799814 873010635 873158216 873443127
968.7 873443127 873738527 873861015 873873711 873874128 873954892 874185622 874481976 874658465 874625564 874484479 874366581
991.1 874366581 874263227 874071598 873811722 873677135 873695910 873721480 873600543 873255074 872805893 872310758
1011.5 872310758 871734262 871175408 870793164 870658755 870721161 870983243 871490300 872099519 872567952 872828484
1031.9 872828484 872991443 873146057 873299003 873488128 873771787 874113202 874395311 874505639 874407828 874184012
1052.3 874184012 873912752 873502076 872944891 872434855 871972382 871493220 871137261 870883465 870694041 870766103
1072.7 870766103 871081948 871487319 871946633 872386515 872848451 873609006 874828517 876400232 878041327
$$ packed form
925.9H72733593o0916K6643L1531Q881P6831J16527J0669j03712n2810N2512J04904
948.3H72944653K5988j74165l25799k68340P152K61426L28899K10821J47581K84911
968.7H73443127K95400J22488J2696M17Q0764K30730K96354J76489l2901j41085j17898
991.1H74366581j03354j91629k59876j34587J8775K5570j20937l45469m49181m95135
1011.5H72310758n76496n58854l82244j34409O2406K62082N07057O09219M68433K60532
1031.9H72828484J62959J54614J52946J89125K83659L41415K82109J10328r7811k23816
1052.3H74184012k71260m10676n57185n10036m62473m79162l55959k53796j89424P2062
1072.7H70766103L15845M05371M59314M39882M61936P60555J219511J571715J641095
$$ plain form
1091.1 878041327 879428148 880476713 881246507 881800294 882138431 882291794 882464647 882618666 882639945
1109.4 882639945 882565856 882202268 881492198 880679369 879841924 878954530 877951086 876821160 875717640
1127.8 875717640 874705911 873798668 873048365 872554660 872416139 872613728 873135269 873879731 874549687
1146.1 874549687 874939144 875048161 874948919 874583662 873838365 872858226 871911466 871143878 870614886 870284975
1166.5 870284975 870047033 869895577 869902015 870021105 870153725 870338380 870696843 871307313 872088611 872826815
1186.9 872826815 873471439 874062657 874546647 874931395 875341237 875827193 876258373 876555979 876729190 876810908
1207.3 876810908 876940966 877143025 877350032 877645612 878050447 878401816 878492892 878211796 877604067 876744568
1227.7 876744568 875734627 874759078 874034584 873643219 873524010 873705804 874220610 874927342 875643671
$$ packed form
1091.1H78041327J386821J048565P69794N53787L38137J53363J72853J54019K1279
1109.4H82639945p4089l63588p10070q12829q37445q87394j003444j129926j103520
1127.8H75717640j011729r07243p50303m93705j38521J97589N21541P44462O69956
1146.1H74549687L89457J09017r9242l65257p45297r80139r46760p67588n28992l29911
1166.5H70284975k37942j51456O438J19090J32620J84655L58463O10470P81298P38204
1186.9H72826815O44624N91218M83990L84748M09842M85956M31180K97606J73211Q1718
1207.3H76810908J30058K02059K07007K95580M04835L51369R1076k81096o07729q59499
1227.7H76744568j009941r75549p24494l91365j19209J81794N14806P06732P16329
$$ plain form
1246.1 875643671 876308680 876932502 877551079 878196537 878825545 879395783 880057812 881053507 882479429
1264.4 882479429 884326339 886408567 888457596 890345812 891995370 893375397 894493103 895369887
1280.7 895369887 896117091 896846294 897616386 898546219 899779916 901239991 902655423 903827906 904664814
1299.1 904664814 905205548 905604482 906006217 906514406 907154024 907868743 908574224 909136117 909440637 909608603
1319.5 909608603 909796298 909968793 910067260 910057008 909946978 909801006 909671366 909546852 909472823 909683168
1339.9 909683168 910115719 910333633 910298288 910200417 909984052 909762323 909789979 910037994 910331786 910560131
1360.3 910560131 910789669 911171556 911626339 911941051 911930025 911614895 911367476 911518991 912068009 912924469
1380.7 912924469 913889050 914793670 915787101 916967928 918028116 918843567 919486165 919975698 920541346
$$ packed form
1246.1H75643671O65009O23822O18577O45458O29008N70238O62029R95695J425922
1264.4H82479429J846910K082228K049029J888216J649558J380027J117706Q76784
1280.7H95369887P47204P29203P70092R29833J233697J460075J415432J172483Q36908
1299.1I04664814N40734L98934M01735N08189O39618P14719P05481N61893L04520J67966
1319.5I09608603J87695J72495R8467j0252j10030j45972j29640j24514p4029K10345
1339.9I09683168M32551K17914l5345r7871k16365k21729K7656K48015K93792K28345
1360.3I10560131K29538L81887M54783L14712j1026l15130k47419J51515N49018Q56460
1380.7I12924469R64581R04620R93431J180827J060188Q15451O42598M89533N65648
$$ plain form
1399 920541346 921202242 921573699 921573043 921327591 920750797 919855714 918874264 917972624 917216480 916666806
1419.4 916666806 916312516 915969193 915606499 915208220 914654970 914117277 913814783 913753152 914097965 914752901
1439.8 914752901 915413439 915884197 916009128 915826201 915449500 914896548 914166570 913190246 912282646 911960304
1460.2 911960304 911934078 912088513 912491977 913081586 913927197 915355682 917384505 919533372 921518207
1478.6 921518207 923183858 924324870 924813390 924795926 924378633 923726559 922998071 921961188 920427799
1496.9 920427799 918654501 917016208 915505171 913511574 910724998 908930004 908151567 907497942 906959176
1515.3 906959176 906747222 906960964 907597482 908478200 909413636 910544872 911739767 912812531 913857102
1533.6 913857102 914740920 915388346 915960610 916513562 917225897 918089688 918832362 919455528 920135975 920973480
$$ packed form
1399I20541346O60896L71457o56k45452n76794q95083r81450r01640p56144n49674
1419.4I16666806l54290l43323l62694l98279n53250n37693l02494o1631L44813O54936
1439.8I14752901O60538M70758J24931j82927l76701n52952p29978r76324r07600l22342
1460.2I11960304k6226J54435M03464N89609Q45611J428485K028823K148867J984835
1478.6I21518207J665651J141012M88520j7464m17293o52074p28488j036883j533389
1496.9I20427799j773298j638293j511037j993597k786576j794994p78437o53625n38766
1515.3I06959176k11954K13742O36518Q80718R35436J131236J194895J072764J044571
1533.6I13857102Q83818O47426N72264N52952P12335Q63791P42674O23166O80447Q37505
$$ plain form
1554 920973480 921814978 922741413 924208045 925552070 926604688 927597642 928668916 929859221 930836618
1572.4 930836618 931643069 932544351 933357418 934030175 934723139 935386360 935820520 935960054 935935915 935890555
1592.8 935890555 935782313 935570300 935374796 935194671 934957981 934659779 934256673 933757186 933231592 932647347
1613.2 932647347 931877136 930851996 929887652 928968370 927997351 927209795 926497340 925844431 925355256
1631.5 925355256 924907625 924654603 924859405 925235987 925603151 925895929 926160038 926558137 926866949 926901937
1651.9 926901937 927034438 927396417 927572668 927504897 927192807 926729858 926227391 925583422 924789011 923928559
1672.3 923928559 922659397 920880020 919028819 917225122 915604830 914511800 914457500 915171444 916244030
1690.7 916244030 917348564 918597400 920077622 921250701 922091186 922441602 922194779 921432912 920250058
$$ packed form
1554I20973480Q41498R26435J466632J344025J052618R92954J071274J190305R77397
1572.4I30836618Q06451R01282Q13067O72757O92964O63221M34160J39534k4139m5360
1592.8I35890555j08242k12013j95504j80125k36690k98202m03106m99487n25594n84245
1613.2I32647347p70211j025140r64344r19282r71019p87556p12455o52909m89175
1631.5I25355256m47631k53022K04802L76582L67164K92778K64109L98099L08812L4988
1651.9I26901937J32501L61979J76251o7771l12090m62949n02467o43969p94411q60452
1672.3I23928559j269162j779377j851201j803697j620292j093030n4300P13944J072586
1690.7I16244030J104534J248836J480222J173079Q40485L50416k46823p61867j182854
$$ plain form
1709 920250058 918655276 916655540 914304018 911703825 909504294 907920241 906438291 905097067 904244304
1727.4 904244304 903954685 904313207 905804217 908547580 911706030 915746033 920608282 925458848 930076182
1745.7 930076182 934237063 938017309 941266656 943454027 944862723 946048617 947164357 948453963
1762 948453963 949890077 951148272 952164769 952929676 953506470 953954101 954253793 954446197 954572082
1780.4 954572082 954577327 954512775 954520822 954562306 954529464 954541504 954630911 954640448 954540551 954440057 954465389 954554141
1804.9 954554141 954573750 954474807 954412878 954511464 954574347 954512060 954487145 954530895 954554141 954563379 954550683 954524696
1829.3 954524696 954592764 954719543 954793870 954770029 954693019 954601526 954425871 954355359 954524100 954676092 954715192
1851.8 954715192 954747677 954778850 954733908 954650700 954623461 954667151 954694748 954656780 954702079 954876363 954967201
$$ packed form
1709I20250058j594782j999736k351522k600193k199531j584053j481950j341224q52763
1727.4I04244304k89619L58522J491010K743363L158450M040003M862249M850566M617334
1745.7I30076182M160881L780246L249347K187371J408696J185894J115740J289606
1762I48453963J436114J258195J016497P64907N76794M47631K99692J92404J25885
1780.4I54572082N245o4552Q047M1484l2842J2040Q9407R537r9897j00494K5332Q8752
1804.9I54554141J9609r8943o1929R8586O2883o2287k4915M3750K3246R238j2696k5987
1829.3I54524696O8068J26779P4327k3841p7010r1493j75655p0512J68741J51992L9100
1851.8I54715192L2485L1173m4942q3208k7239M3690K7597l7968M5299J74284R0838
$$ plain form
1874.2 954967201 954943538 954984963 955073655 955100834 955115139 955133736 955090225 955079377 955152929 955208123 955249906
1896.6 955249906 955286145 955295086 955315769 955339670 955308795 955302596 955418110 955540836 955531895 955425024 955389857
1919.1 955389857 955461323 955564320 955728531 955903888 955974758 955945253 955869555 955824196 955851078 955845654 955773890
1941.5 955773890 955770254 955851316 955954075 956075668 956137002 956127822 956170738 956224024 956196785 956160545 956170619
1963.9 956170619 956208289 956231773 956207991 956212521 956300259 956400454 956482828 956579030 956712365 956818163 956792712
1986.4 956792712 956710756 956725359 956854522 956987917 957081497 957156837 957184374 957194567 957187772 957096040 956972063
2008.8 956972063 956963599 957065701 957111597 957097828 957156181 957271755 957352877 957428575 957516015 957582891 957643807
2031.2 957643807 957647324 957585394 957577288 957665503 957773864 957868695 957983375 958081484 958074927 957983851 957922459 957982481
$$ packed form
1874.2I54967201k3663M1425Q8692K7179J4305J8597m3511j0848P3552N5194M1783
1896.6I55249906L6239Q941K0683K3901l0875o199J15514J22726q941j06871l5167
1919.1I55389857P1466J02997J64211J75357P0870k9505p5698m5359K6882n424p1764
1941.5I55773890l636Q1062J02759J21593O1334r180M2916N3286k7239l6240J0074
1963.9I56170619L7670K3484k3782M530Q7738J00195Q2374R6202J33335J05798k5451
1986.4I56792712q1956J4603J29163J33395R3580P5340K7537J0193o795r1732j23977
2008.8I56972063q464J02102M5896j3769N8353J15574Q1122P5698Q7440O6876O0916
2031.2I57643807L517o1930q106Q8215J08361R4831J14680R8109o557r1076o1392O0022
$$ plain form
2055.7 957982481 958142996 958235621 958190084 958111584 958075702 958108962 958232403 958407819 958488941 958430469 958373308
2078.1 958373308 958435595 958580613 958657920 958667576 958698630 958729506 958781242 958856106 958876669 958902597 959022701
2100.6 959022701 959146202 959178567 959151328 959138691 959167123 959196448 959219635 959273398 959354520 959434330 959492087
2123 959492087 959518731 959540784 959550440 959540665 959582686 959653735 959685266 959694624 959701240 959725976 959764302 959797442 959848404
2149.5 959848404 959924161 959962726 959933698 959934473 960029900 960107267 960081637 960064709 960125804 960199296 960243642 960275769
2174 960275769 960364401 960463464 960472882 960486352 960547268 960565925 960545361 960567892 960642874 960710108 960771263 960772395
2198.5 960772395 960705817 960725248 960847020 960963070 961023510 961036384 961014390 960950792 960887671 960913479 960994840
2220.9 960994840 961020529 961022198 961065590 961063802 960954070 960886359 960949421 961047769 961100876 961013496 960852087
$$ packed form
2055.7I57982481J60515R2625m5537p8500l5882L3260J23441J75416Q1122n8472n7161
2078.1I58373308O2287J45018P7307R656L1054L0876N1736P4864K0563K5928J20104
2100.6I59022701J23501L2365k7239j2637K8432K9325K3187N3763Q1122P9810N7757
2123I59492087K6644K2053R656r775M2021P1049L1531R358O616K4736L8326L3140N0962
2149.5I59848404P5757L8565k9028P75R5427P7367k5630j6928O1095P3492M4346L2127
2174I60275769Q8632R9063R418J3470O0916J8657k0564K2531P4982O7234O1155J132
2198.5I60772395o6578J9431J21772J16050O0440J2874k1994o3598o3121K5808Q1361
2220.9I60994840K5689J669M3392j788j09732o7711O3062R8348N3107q7380j61409
$$ plain form
2243.3 960852087 960837185 960907280 960871398 960773826 960723579 960705280 960690081 960672557 960658550 960695267 960782826
2265.8 960782826 960878849 960968316 961048305 961092234 961080611 961106896 961267650 961493313 961670756 961764097 961795151
2288.2 961795151 961808145 961869836 962049127 962259591 962398767 962479830 962500393 962505102 962511897 962524354 962575376
2310.6 962575376 962646842 962707400 962702930 962702930 962763548 962807059 962836325 962868690 962894559 962901771 962972045 963133395
2335.1 963133395 963220537 963252008 963397026 963504970 963432908 963393271 963398814 963364899 963253856 962937653 962673485
2357.5 962673485 962800205 962998807 963039875 963186026 963433206 963570833 963644207 963631988 963535726 963528275 963727117
2380 963727117 964077711 964369774 964440823 964383721 964398026 964491189 964581728 964696050 964765429 964679778 964556754
2402.4 964556754 964537978 964634895 964732647 964752793 964822471 964894712 964856744 964809179 964792311 964806795 964845002
$$ packed form
2243.3I60852087j4902P0095l5882r7572n0247j8299j5199j7524j4007L6717Q7559
2265.8I60782826R6023Q9467P9989M3929j1623K6285J60754K25663J77443R3341L1054
2288.2I61795151J2994O1691J79291K10464J39176Q1063K0563M709O795J2457N1022
2310.6I62575376P1466O0558m470%O0618M3511K9266L2365K5869P212P0274J61350
2335.1I63133395Q7142L1471J45018J07944p2062l9637N543l3915j11043l16203k64168
2357.5I62673485J26720J98602M1068J46151K47180J37627P3374j2219r6262p451J98842
2380I63727117L50594K92063P1049n7102J4305R3163R0539J14322O9379q5651j23024
2402.4I64556754j8776R6917R7752K0146O9678P2241l7968m7565j6868J4484L8207
$$ plain form
2424.8 964845002 964932799 965107560 965248764 965331197 965339124 965209067 965108037 965089023 965064824 965121508 965288043
2447.3 965288043 965431571 965468407 965458512 965514958 965616643 965665281 965684056 965716004 965719402 965699971 965749502
2469.7 965749502 965811968 965756893 965691030 965733767 965800762 965818286 965832353 965886831 965958357 965966403 965925038 965970814
2494.2 965970814 966061354 966020763 965892076 965873063 965984464 966123343 966232121 966271043 966278315 966282725 966253042
2516.6 966253042 966245830 966271937 966284692 966372609 966510117 966487169 966367304 966399252 966533244 966608405 966638148
2539 966638148 966650784 966672719 966730237 966747344 966699421 966678977 966700077 966685414 966669858 966744006 966816723 966802120
2563.5 966802120 966719270 966663778 966808975 967079341 967240989 967253208 967240453 967252433 967242599 967204392 967149675
2585.9 967149675 967134893 967254400 967435896 967460692 967384636 967391968 967434406 967472315 967495501 967442095 967340291
$$ packed form
2424.8I64845002Q7797J74761J41204Q2433P927j30057j01030j9014k4199N6684J66535
2447.3I65288043J43528L6836r895N6446J01685M8638J8775L1948L398j9431M9531
2469.7I65749502O2466n5075o5863M2737O6995J7524J4067N4478P1526Q046m1365M5776
2494.2I65970814R0540m0591j28687j9013J11401J38879J08778L8922P272M410k9683
2516.6I66253042p212K6107J2755Q7917J37508k2948j19865L1948J33992P5161K9743
2539I66638148J2636K1935N7518J7107m7923k0444K1100j4663j5556P4148P2717j4603
2563.5I66802120q2850n5492J45197K70366J61648J2219j2755J1980r834l8207n4717
2585.9I67149675j4782J19507J81496K4796p6056P332M2438L7909K3186n3406j01804
$$ plain form
2608.4 967340291 967320085 967425525 967538118 967585742 967586458 967542112 967505097 967538893 967635751 967759192 967820406
2630.8 967820406 967772484 967684031 967633188 967699885 967887759 968019545 967995346 967904568 967827141 967792153 967789650
2653.2 967789650 967848182 967985928 968101621 968108654 968023300 967972338 968024313 968059301 968035758 968042135 968079388
2675.7 968079388 968129456 968210042 968223751 968104959 968002796 968027949 968149364 968248010 968274951 968332887 968409956
2698.1 968409956 968484521 968561947 968539655 968440831 968394339 968402982 968442559 968494058 968450427 968370080 968430340 968524635
2722.6 968524635 968494892 968432426 968445599 968525946 968610764 968644023 968639016 968620896 968617082 968612373 968537509 968499184
2747 968499184 968655765 968889117 968993306 968963563 968899548 968810439 968714654 968708158 968767405 968778849 968776226 968828917
2771.5 968828917 968834400 968771219 968750715 968810081 968906522 968906403 968793511 968721390 968755126 968816817 968777239 968649089
$$ packed form
2608.4I67340291k0206J05440J12593M7624P16m4346l7015L3796R6858J23441O1214
2630.8I67820406m7922q8453n0843O6697J87874J31786k4199r0778p7427l4988k503
2653.2I67789650N8532J37746J15693P033q5354n0962N1975L4988k3543O377L7253
2675.7I68079388N0068Q0586J3709j18792j02163K5153J21415R8646K6941N7936P7069
2698.1I68409956P4565P7426k2292r8824m6492Q643L9577N1499m3631q0347O0260R4295
2722.6I68524635k9743o2466J3173Q0347Q4818L3259n007j8120l814m709p4864l8325
2747I68499184J56581K33352J04189k9743o4015q9109r5785o496N9247J1444k623N2691
2771.5I68828917N483o3181k0504N9366R6441j19j12892p2121L3736O1691l9578j28150
$$ plain form
2796 968649089 968567133 968577623 968637884 968636215 968568742 968535721 968479753 968363464 968195140 968016326 967986047
2818.4 967986047 968067825 968085527 968031347 967942119 967781901 967570484 967368424 967180073 966983080 966755986
2838.8 966755986 966489792 966112792 965572357 965007603 964586616 964320362 964162111 964131355 964246213 964482069
2859.2 964482069 964762926 964987278 965129614 965275705 965501070 965706229 965793312 965782821 965725541 965711832
2879.6 965711832 965779781 965857327 965801835 965602756 965353668 965079129 964862585 964709640 964492798 964212298
2900 964212298 963891387 963497519 963141799 962914944 962705910 962371051 961898029 961465955 961248755 961160779
2920.4 961160779 961067319 961052835 961128354 961220980 961443067 961798787 962139964 962461412 962842822 963296056
2940.8 963296056 963756144 964162171 964562893 964988530 965357780 965711296 966062248 966288865 966463447 966740608
$$ packed form
2796I68649089q1956J0490O0261j669o7473l3021n5968j16289j68324j78814l0279
2818.4I67986047Q1778J7702n4180q9228j60218k11417k02060j88351j96993k27094
2838.8I66755986k66194l77000n40435n64754m20987k66254j58251l0756J14858K35856
2859.2I64482069K80857K24352J42336J46091K25365K05159Q7083j0491n7280j3709
2879.6I65711832O7949P7546n5492j99079k49088k74539k16544j52945k16842k80500
2900I64212298l20911l93868l55720k26855k09034l34859m73022m32074k17200q7976
2920.4I61160779r3460j4484P5519R2626K22087L55720L41177L21448L81410M53234
2940.8I63296056M60088M06027M00722M25637L69250L53516L50952K26617J74582K77161
$$ plain form
2961.2 966740608 967127740 967514277 967875123 968322694 968798935 969194353 969560146 969964445 970453203 970981121
2981.6 970981121 971428752 971788943 972103000 972326577 972466707 972649455 972885251 973051667 973186612 973363578
3002 973363578 973494649 973474383 973392308 973501205 973749578 973845363 973772883 973689616 973706067 973817229 973847866
3024.4 973847866 973696351 973492682 973388970 973392606 973476410 973618925 973670959 973611176 973604441 973597586 973475993
3046.8 973475993 973362267 973363400 973428726 973540306 973640680 973646641 973599911 973550975 973535776 973575532 973659992
3069.2 973659992 973739445 973744154 973679960 973631561 973678470 973773658 973805130 973797321 973836422 973879814 973847091 973784328
3093.7 973784328 973806560 973877251 973814905 973659039 973608017 973629653 973648727 973679602 973703742 973758936 973797500
3116.2 973797500 973716974 973640561 973684072 973726869 973691702 973708093 973890781 974052966 973970890 973834515 973819375
$$ packed form
2961.2I66740608L87132L86537L60846M47571M76241L95418L65793M04299M88758N27918
2981.6I70981121M47631L60191L14057K23577J40130J82748K35796J66416J34945J76966
3002I73363578J31071k0266q2075J08897K48373R5785p2480q3267J6451J11162L0637
3024.4I73847866j51515k03669j03712L636Q3804J42515N2034n9783o735o855j21593
3046.8I73475993j13726J133O5326J11580J00374N961m6730m8936j5199L9756Q4460
3069.2I73659992P9453M709o4194m8399M6909R5188L1472p809L9101M3392l2723o2763
3093.7I73784328K2232P0691o2346j55866n1022K1636J9074L0875K4140N5194L8564
3116.2I73797500q0526p6413M3511M2797l5167J6391J82688J62185q2076j36375j5140
$$ plain form
3138.6 973819375 973829746 973772287 973636270 973598599 973752439 973857343 973816454 973806798 973813117 973782957 973818958
3161 973818958 973866224 973880410 973916769 973874748 973713219 973633587 973700285 973725915 973645687 973568201 973533511 973536372
3185.5 973536372 973554671 973488510 973394930 973441958 973620415 973795474 973833621 973774493 973727763 973668277 973565996
3207.9 973565996 973485351 973519266 973627508 973651171 973576546 973499596 973430455 973372102 973325372 973268867 973198891
3230.4 973198891 973131299 973072588 972983539 972991586 973211825 973411500 973369598 973135233 972938061 972994268 973247707
3252.8 973247707 973464251 973494470 973377764 973248839 973209918 973253489 973254979 973191023 973158598 973156571 973116636
3275.2 973116636 973044813 973059952 973234236 973341644 973232687 973151147 973233163 973341525 973369956 973371625 973330736
3297.7 973330736 973216653 973221481 973287106 973224342 973203719 973330021 973458230 973537624 973586559 973604202 973637581
$$ packed form
3138.6I73819375J0371n7459j36017l7671J53840J04904m0889r656O319l0160L6001
3161I73818958M7266J4186L6359m2021j61529p9632O6698K5630q0228p7486l4690K861
3185.5I73536372J8299o6161r3580M7028J78457J75059L8147n9128m6730n9486j02281
3207.9I73565996q0645L3915J08242K3663p4625p6950o9141n8353m6730n6505o9976
3230.4I73198891o7592n8711q9049Q047K20239J99675m1902k34365j97172N6207K53439
3252.8I73247707K16544L0219j16706j28925l8921M3571J490o3956l2425k027l9935
3275.2I73116636p1823J5139J74284J07408j08957q1540Q2016J08362K8431J669m0889
3297.7I73330736j14083M828O5625o2764k0623J26302J28209P9394M8935J7643L3379
$$ plain form
3320.1 973637581 973639131 973573685 973604143 973742723 973847806 973879397 973803759 973750234 973872483 974034905 974123836
3342.5 974123836 974165022 974138796 974080205 974100292 974136472 974142611 974190891 974229217 974214256 974149466 974079192 974079370
3367 974079370 974115193 974262238 974560082 974762440 974775970 974676669 974588752 974642098 974726379 974798620 974908769
3389.4 974908769 975009978 975088239 975168407 975235105 975203812 975177050 975281954 975332737 975243092 975214422 975282013
3411.9 975282013 975335121 975430369 975636244 975881517 976103604 976241112 976155281 975942850 975848913 975869298
3432.2 975869298 975925863 976054728 976322532 976618528 976759434 976755500 976704478 976655662 976670206 976822853 977069616
3454.7 977069616 977288485 977368593 977292180 977242947 977307558 977331161 977339029 977444887 977572918 977606833 977514803
3477.1 977514803 977389216 977323890 977452874 977684736 977691054 977489948 977346301 977462590 977689445 977700710
$$ packed form
3320.1I73637581J550o5446L0458J38580J05083L1591p5638n3525J22249J62422Q8931
3342.5I74123836M1186k6226n8591K0087L6180O139M8280L8326j4961o4790p0274J78
3367I74079370L5823J47045K97844K02358J3530r9301q7917N3346Q4281P2241J10149
3389.4I74908769J01209P8261Q0168O6698l1293k6762J04904N0783q9645k8670O7591
3411.9I75282013N3108R5248K05875K45273K22087J37508q5831k12431r3937K0385
3432.2I75869298N6565J28865K67804K95996J40906l934n1022m8816J4544J52647K46763
3454.7I77069616K18869Q0108p6413m9233O4611K3603P868J05858J28031L3915r2030
3477.1I77514803j25587o5326J28984K31862O318k01106j43647J16289K26855J1265
$$ plain form
3497.5 977700710 977562189 977497995 977574587 977714956 977715969 977580249 977573872 977685630 977786779 977864981 977818370
3519.9 977818370 977745950 977878511 978045821 978013396 977998614 978179336 978385985 978527725 978623271 978547454
3540.3 978547454 978307188 978145123 978170395 978302896 978417516 978535116 978668690 978653312 978513181 978423297
3560.7 978423297 978312492 978119791 978158176 978456199 978670359 978789687 978851020 978848338 978808939 978743434 978708923
3583.2 978708923 978682220 978702605 978879094 978999615 979040265 979194105 979286134 979185522 979082525 978971064
3603.5 978971064 978735447 978626370 978791058 978931427 979011178 979135513 979197860 979212999 979242921 979146302
3623.9 979146302 978944778 978889406 979124069 979401290 979558229 979698002 979831219 979881108 979795277 979430676
3644.3 979430676 978986681 979072690 979641020 979928136 979858398 979839802 979987025 979994833 979888201 979805112 979615211
$$ packed form
3497.5I77700710j38521o4194P6592J40369J013j35720o377J11758J01149P8202m6611
3519.9I77818370p2420J32561J67310l2425j4782J80722K06649J41740R5546p5817
3540.3I78547454k40266j62065K5272J32501J14620J17600J33574j5378j40131q9884
3560.7I78423297j10805j92701L8385K98023K14160J19328O1333k682l9399o5505l4511
3583.2I78708923k6703K0385J76489J20521M0650J53840R2029j00612j02997j11461
3603.5I78971064k35617j09077J64688J40369P9751J24335O2347J5139K9922r6619
3623.9I79146302k01524n5372K34663K77221J56939J39773J33217M9889q5831l64601
3644.3I79430676m43995Q6009N68330K87116o9738j8596J47223P808j06632q3089j89901
$$ plain form
3666.8 979615211 979336321 979282022 979463220 979707420 979905307 980008245 980179369 980311453 980291903 980256498
3687.2 980256498 980147183 979994059 979849577 979663908 979729652 980051219 980204284 980173409 980189800 980185151
3707.6 980185151 979976058 979779959 979923666 980115652 980156898 980114222 980086029 980099559 980151534 980321527
3727.9 980321527 980387151 980017722 979556799 979701221 980186462 980380714 980163753 979775906 979673922 979759455
3748.3 979759455 979827702 979987323 980174601 980192840 980177224 980328262 980374515 980288446 980379045 980563343 980684638
3770.8 980684638 980822682 980881095 980742455 980559587 980444491 980399489 980558515 980864704 981032431 980979323
3791.2 980979323 980822086 980723381 980754077 980761826 980704725 980717003 980735481 980807960 981002986 981061935 980850637
3813.6 980850637 980573833 980460227 980421901 980531275 980898678 981167376 981051683 980828822 980860710 980977058
$$ packed form
3666.8I79615211k78890n4299J81198K44200J97887J02938J71124J32084j9550l5405
3687.2I80256498j09315j53124j44482j85669O5744L21567J53065l0875J6391m649
3707.6I80185151k09093j96099J43707J91986M1246m2676k8193J3530N1975J69993
3727.9I80321527O5624l69429m60923J44422M85241J94252k16961l87847j01984Q5533
3748.3I79759455O8247J59621J87278J8239j5616J51038M6253q6069R0599J84298J21295
3770.8I80684638J38044N8413j38640j82868j15096m5002J59026L06189J67727n3108
3791.2I80979323j57237r8705L0696P749n7101J2278J8478P2479J95026N8949k11298
3813.6I80850637k76804j13606l8326J09374L67403K68698j15693k22861L1888J16348
$$ plain form
3834 980977058 980993211 980902076 980758786 980745912 980880320 981095076 981204331 981099606 981030166 981210828 981297851
3856.4 981297851 981182694 980975151 980767667 980727315 980752230 980567813 980327725 980547071 981057882 981197715
3876.8 981197715 980966449 980798244 980852664 980988443 981126904 981284082 981393337 981340647 981132567 980954587
3897.2 980954587 980911493 980878651 980947196 981269896 981550813 981659472 981676936 981551528 981317163 981251776
3917.6 981251776 981522381 981731892 981542706 981334865 981471062 981566191 981358171 981191218 981209993 981307149
3938 981307149 981398821 981367409 981339335 981515467 981742084 981880009 981899738 981789768 981651843 981608391 981747031
3960.4 981747031 981902778 981938124 981928110 981832266 981747329 981926262 982160926 982083023 981809139 981705725
3980.8 981705725 981970429 982239783 982108355 981869638 981877565 981957376 981968701 982085586
$$ packed form
3834I80977058J6153r1135j43290j2874J34408K14756J09255j04725o9440J80662Q7023
3856.4I81297851j15157k07543k07484m0352K4915j84417k40088K19346N10811J39833
3876.8I81197715k31266j68205N4420J35779J38461J57178J09255n2690k08080j77980
3897.2I80954587m3094l2842O8545L22700K80917J08659J7464j25408k34365o5387
3917.6I81251776K70605K09511j89186k07841J36197R5129k08020j66953J8775R7156
3938I81307149R1672l1412k8074J76132K26617J37925J9729j09970j37925m3452J38640
3960.4I81747031J55747L5346j0014r5844q4937J78933K34664p7903k73884j03414
3980.8I81705725K64704K69354j31428k38717P927P9811J1325J16885
$$ plain form
3997.1 982085586
$$ packed form
3997.1I82085586
##END=$$ End of the data block
