##TITLE=DI 15-1037358-8 - lado brilhoso $$ Begin of the data block
##JCAMP-DX=5.00 $$ ACD/SpecManager v 10.08
##SPECTROMETER/DATA SYSTEM=Alpha
##DATE=29 Jun 2015 09:06:24
##DATA TYPE=INFRARED SPECTRUM
##DATA CLASS=XYDATA
##ORIGIN=
##OWNER=
##NPOINTS=1667
##FIRSTX=599.57470703
##LASTX=3997.16503906
##MAXX=3997.16503906
##MINX=599.57470703
##MAXY=0.98634392
##MINY=0.57242584
##XFACTOR=1.0000000000
##YFACTOR=1.000000000000000e-9
##FIRSTY=0.77222192
##DELTAX=2.03937006
##XUNITS=1/CM
##YUNITS=ARBITRARY UNITS
##XYDATA=(X++(Y..Y))
599.6G72221923k6345432k5571227j8801868r548843k412021J646399M231096O313801
$$ 772221923 745876491 720305264 701503396 691954553 689542532 691188931 695420027 701733828
615.9G01733828P942855Q453488P957816P340730O232559M606366L560126N041480
$$ 701733828 709676683 718130171 726087987 733428717 739661276 744267642 747827768 752869248
632.2G52869248P941962Q826852P806479P155180P107377P038236P048130P371247
$$ 752869248 760811210 769638062 777444541 784599721 791707098 798745334 805793464 813164711
648.5H13164711Q170426R203613R631991Q522451O561220M461348J996636j34408k505362
$$ 813164711 821335137 830538750 840170741 848693192 855254412 859715760 861712396 861577988 859072626
666.9H59072626o104112o098568n109728n320430n389630m615307k848208j414597
$$ 859072626 852968514 846869946 841760218 836439788 831050158 826434851 823586643 822172046
683.2H22172046j075745j478136j712858j225770l80158O17683J976192L596425N172014
$$ 822172046 821096301 819618165 817905307 816679537 816299379 816917062 818893254 822489679 827661693
701.5H27661693O250382O839394P274985O929696N136490K123237k702713j0775507
$$ 827661693 833912075 840751469 848026454 854956150 860092640 862215877 859513164 848737657
717.9H48737657k3887992m4751704p0974707q2287610n4409802J578629N1166535P7308058
$$ 848737657 824849665 780097961 709123254 626835644 572425842 574004471 625171006 702479064
734.2G02479064P9956830O4531624M1683257K2363901J0672212M968643K338588Q55386
$$ 702479064 782435894 846967518 888650775 911014676 921686888 926655531 928994119 929849505
750.5I29849505n2392n13971o25610n16594m44293m27723l93033l57568k33710K56896
$$ 929849505 929797113 929283142 928657532 928140938 927696645 927268922 926875889 926518321 926284611 926541507
770.9I26541507R85086J357436J062513M65154R7216l27409j297533k660394m228771
$$ 926541507 927526593 928884029 929946542 930411696 930508912 930181503 928883970 926223576 921994805
789.2I21994805n364775l972411O61611M287958L003776n13792k349078k480030j958311
$$ 921994805 916630030 912657619 913319230 917607188 920610964 920097172 917748094 915268064 913309753
807.6I13309753j249313q41499n93245k30253j18792l43859p96199j459658k253473
$$ 913309753 912060440 911218941 910625696 910395443 910276651 909932792 909136593 907676935 905423462
825.9I05423462l017187l235042k700209k078712j677633j101315m22537J01149L36409
$$ 905423462 902406275 899171233 896471024 894392312 892714679 891613364 891190827 891291976 891628385
844.3H91628385K96890L84987N81741O07729M62234q047p71522j636267k853453m787266
$$ 891628385 891925275 892310262 892892003 893499732 893961966 893953919 893182397 891546130 888692677 883905411
864.7H83905411p583201j0928154j2701333r454369j071692P736504J2194515J1573374
$$ 883905411 876322210 865394056 852692723 843238354 842166662 849903166 862097681 873671055
881H73671055Q500218N465806L228724J761317Q50439K51353j60039o05821j026750
$$ 873671055 882171273 887637079 890865803 892627120 893477559 893728912 893568873 892963052 891936302
899.4H91936302j001775p86781j039565j563728j841247j915336k020001k190769k330303
$$ 891936302 890934527 890147746 889108181 887544453 885703206 883787870 881767869 879577100 877246797
917.7H77246797k528548k880871l378273l842651l796876l372967l143370k910972
$$ 877246797 874718249 871837378 868459105 864616454 860819578 857446611 854303241 851392269
934H51392269k152443r93907R9957Q19742J013041O74665J10447j91450k95758q63135
$$ 851392269 849239826 848245919 848345876 849165618 850178659 850853324 850963771 850772321 850476563 849613428
954.4H49613428k268195m079223n548417o267488o142557n040944l056943r32276P83264
$$ 849613428 847345233 843266010 837717593 831450105 825307548 820266604 817209661 816277385 817060649
972.8H17060649K248288L708660N098939O240308P096589P493913P002056N686223
$$ 817060649 819308937 823017597 828116536 834356844 841453433 848947346 855949402 861635625
989.1H61635625M171670K718985J259744r2208j276434k453029l875017o094277r663820
$$ 861635625 865807295 868526280 869786024 869693816 868417382 865964353 862089336 855995059 846331239
1007.4H46331239j4973581k3907840l6671162l9770007j6960383J6711116L0447543
$$ 846331239 831357658 807449818 770778656 731008649 714048266 730759382 761206925
1021.7G61206925K2783816J2464523P935822O849766O069422M786908L254175J550138
$$ 761206925 783990741 796455264 804391086 811240852 817310274 822097182 825351357 826901495
1038H26901495J25170l49998J75833J324118K550125L359616L662884L578126L198743
$$ 826901495 827026665 826676667 826852500 828176618 830726743 834086359 837749243 841327369 844526112
1056.4H44526112K690673K044976J204848L33905n93960j772165l289581n277812q046985
$$ 844526112 847216785 849261761 850466609 850800514 850206554 848434389 845144808 839866996 831820011
1074.7H31820011j1617482j5365302j8240154j9199431j8509269j8134236j9482374
$$ 831820011 820202529 804837227 786597073 767397642 748888373 730754137 711271763
1089G11271763k1836519k3149610k1283507j5230120n560755O200313J7935694K6096940
$$ 711271763 689435244 666285634 645002127 629772007 624211252 630411565 648347259 674444199
1105.3F74444199K6051282J6319931K473474o677330o991804j014173O825924J4046431
$$ 674444199 700495481 716815412 719288886 712611556 705619752 704605579 711431503 725477934
1121.7G25477934J9478142K2234738K2118866J9879103J6716182J3687015J1285782
$$ 725477934 744956076 767190814 789309680 809188783 825904965 839591980 850877762
1135.9H50877762R306550P407248N402028L175796Q16702j418888l202796m409015
$$ 850877762 860184312 867591560 872993588 876169384 876986086 875567198 872364402 867955387
1152.2H67955387n289197n973459o327629o306648n876839n035520l932595k654910
$$ 867955387 862666190 856692731 850365102 844058454 838181615 833146095 829213500 826558590
1168.6H26558590j068294Q11338K471328L398836L496825K931715K014398R34720k10166
$$ 826558590 825490296 826301634 828772962 832171798 835668623 838600338 840614736 841549456 841339290
1186.9H41339290j209676j982749k517819k832770l010631l153443l444672m084110
$$ 841339290 840129614 838146865 835629046 832796276 829785645 826632202 823187530 819103420
1203.2H19103420n335927p131696q950651j0473191j1644245j2716114j4332175j6765714
$$ 819103420 813767493 806635797 797685146 787211955 775567710 762851596 748519421 731753707
1219.5G31753707j9501805k1549464k1837115j9950986j6492247j2574494r162963
$$ 731753707 712251902 690702438 668865323 648914337 632422090 619847596 610684633
1233.8F10684633o564498m438340k135814R90272M949987Q833706J1642099J2686014
$$ 610684633 604120135 599681795 597545981 598536253 603486240 612319946 623962045 636648059
1250.1F36648059J1597156Q372665L482044j443744l706157j622916L555894Q998156
$$ 636648059 648245215 656617880 660099924 658656180 654950023 653327107 656883001 665881157
1266.5F65881157J2817144J4838934J5659571J5877902J5937865J5842974J5346885
$$ 665881157 678698301 693537235 709196806 725074708 741012573 756855547 772202432
1280.7G72202432J4583945J3929666J3497114J3243317J3049603J2678206J1815727
$$ 772202432 786786377 800716043 814213157 827456474 840506077 853184283 865000010
1295H65000010J0356187Q352697N985379L988564L197074L310860L277361K706230
$$ 865000010 875356197 883708894 889694273 893682837 896879911 900190771 903468132 906174362
1311.3I06174362J883924J104533O07074N85377Q68916J080573J141369J145482J121581
$$ 906174362 908058286 909162819 909769893 910355270 911224186 912304759 913446128 914591610 915713191
1329.7I15713191J037359R31978J034320J529932K327323K707600K128959R84430k53617
$$ 915713191 916750550 917682528 918716848 920246780 922574103 925281703 927410662 928395092 928141475
1348I28141475j300276j937210k185345k425015l124296m807473p720530j0189593
$$ 928141475 926841199 924903989 922718644 920293629 917169333 912361860 904641330 894451737
1364.3H94451737j0730207j0147154p628620k751410L108502P786929J0293365J1316240
$$ 894451737 883721530 873574376 865945756 863194346 866302848 874089777 884383142 895699382
1380.7H95699382J1006713R755790Q281827O225765L720760J738966k22922k297938
$$ 895699382 906706095 916461885 924743712 930969477 934690237 936429203 936206281 933908343
1397I33908343l848612m765272o129503q330465p408321j409053N441606P803440N343079
$$ 933908343 930059731 925294459 919164956 910834491 903426170 902017117 907458723 915262163 920605242
1415.3I20605242J796365j163602k919137l688038l630638k480268j696527j648009
$$ 920605242 922401607 921238005 918318868 914630830 911000192 908519924 906823397 905175388
1431.6I05175388j072824J069546M450380O212295O523787N933941M399478K805353
$$ 905175388 904102564 905172110 909622490 915834785 922358572 928292513 932691991 935497344
1448I35497344J348257K34246k70248k18331K26557O82175R12547J227737J456976
$$ 935497344 936845601 937079847 936809599 936591268 936817825 937500000 938412547 939640284 941097260
1466.3I41097260J147091J75834r52244J21534L535688O040334O347716M930377K942205
$$ 941097260 942244351 942420185 941467941 941589475 945125163 951165497 957513213 962443590 965385795
1484.7I65385795J658558R75311M25577J3471k83182p19130j566171k691388l105462
$$ 965385795 967044353 968019664 968445241 968458712 968175530 967456400 965890229 963198841 960093379
1503I60093379j752257J977265L716349K289951J214445N55694J71542L8743m9770
$$ 960093379 958341122 960318387 964034736 966324687 967539132 968094826 968266368 968305111 968255341
1521.4I68255341o3121l7909J7941J60754J73509J19329J65402J25230o9678r2149
$$ 968255341 968192220 968154311 968172252 968333006 968506515 968625844 968791246 968916476 968846798 968754649
1541.8I68754649Q7559J02520n1081j68741j32739p4625j04368l26812l79920j01209
$$ 968754649 968842208 968944728 968893647 968724906 968592167 968517542 968413174 968086362 967706442 967605233
1562.2I67605233j56998l39210o15538j050353j240253j513958j685262l72290J292526
$$ 967605233 967448235 967109025 966493487 965443134 964202881 962688923 961003661 960631371 961923897
1580.5I61923897K095759J852572J048207M53473K04026M2618n5790j20521k43247
$$ 961923897 964019656 965872228 966920435 967373908 967577934 967620552 967564762 967444241 967200994
1598.9I67200994l90291m64320m47571n36442o83963o31213l86477r8407L37422N59806
$$ 967200994 966810703 966346383 965898812 965362370 964678407 964047194 963660717 963562310 963899732 964459538
1619.3I64459538K48075q7380p3135o1155j24097q7678j75118k74957j51634j22368
$$ 964459538 964707613 964620233 964547098 964485943 964361846 964274168 964099050 963824093 963672459 963550091
1639.7I63550091k38121l01957n04851o13928k81930l59833p21336m10974k90751n45025
$$ 963550091 963311970 963010013 962505162 961891234 961609304 961249471 960528135 960117161 959826410 959281385
1660.1I59281385q87990j182616j197338j290977j441240j209140j303017j621962
$$ 959281385 958393395 957210779 956013441 954722464 953281224 952072084 950769067 949147105
1676.4I49147105j636982j628458j963377k775908k714932k485394l133059l674745
$$ 949147105 947510123 945881665 943918288 941142380 938427448 935942054 932808995 929134250
1692.7I29134250n174041p273913r542644j5260458j8407344k3943901l3759475l7126124
$$ 929134250 923960209 916686296 907143652 891883194 873475850 849531949 815772474 778646350
1709G78646350l5582721l0601263k2832275j3415515k625346M869580R359896J2127280
$$ 778646350 743063629 712462366 689630091 676214576 673589230 678458810 687818706 699945986
1725.3F99945986J3055980J3231159J3137102J5481412J7061472J4640033J6371727
$$ 699945986 713001966 726233125 739370227 754851639 771913111 786553144 802924871
1739.6H02924871J9169212J9556880K0089805K0362139K0632982J9026160J4352322
$$ 802924871 822094083 841650963 861740768 882102907 902735889 921762049 936114371
1753.9I36114371J0694742Q323491N613982L805995K580166J608312J102329Q02993
$$ 936114371 946809113 955132604 960746586 964552581 967132747 968741059 969843388 970646381
1770.2I70646381O13809M48406L45170K69711K42293J53840J47402K61545L10123K71976
$$ 970646381 971260190 971708596 972053766 972323477 972565770 972719610 972867012 973128557 973438680 973710656
1790.6I73710656K96533K71201J88291J81437J18196Q2076R4354Q5413K1160j3113
$$ 973710656 974007189 974278390 974466681 974648118 974766314 974848390 974942744 975028157 975049317 975036204
1811I75036204K4795L0280k3008k7060J0848q524L7909Q8870R9600J67250J88530J02520
$$ 975036204 975060999 975091279 975068271 975041211 975052059 975043535 975081444 975170314 975269914 975437164 975625694 975728214
1835.5I75728214O0081J15574R6261m4286p153K08497J98722R6858J21176J41621L0577
$$ 975728214 975788295 975903869 976000130 975955844 975948691 976157188 976355910 976452768 976573944 976715565 976746142
1857.9I76746142n5194k6643K5451O0677L4929K1815P0155O5446j073M1187J21474
$$ 976746142 976690948 976664305 976689756 976750433 976785362 976807177 976877332 976942778 976941705 976982892 977104366
1880.3I77104366P6949R895K980j6451m7266m3571l0995L9518L3677o3360n2333l5941
$$ 977104366 977181315 977191210 977194190 977177739 977130473 977086902 977055907 977095425 977129102 977065742 977013409 976977468
1904.8I76977468r0361m4286N5074J9968q7798j21057k2530O6578K9564m4942o7294
$$ 976977468 976887107 976842821 976897895 976917863 976830065 976709008 976686478 976753056 976782620 976737678 976670384
1927.2I76670384o0379p9572j20700j19328o3896p0036j52826j50621n5671k2292l3200
$$ 976670384 976610005 976530433 976409733 976290405 976226509 976156473 976003647 975853026 975797355 975775063 975741863
1949.7I75741863j192Q7500J72376J43767O3002R5248J47402Q1778J2219J5676N4896
$$ 975741863 975740671 975828171 976000547 976144314 976207316 976302564 976449966 976531744 976543963 976559639 976614535
1972.1I76614535O7234K0981j1206M470L8863M4882L576J2279O1929M5061Q2255J80900
$$ 976614535 976681769 976702750 976691544 976696014 976734877 976779759 976783335 976795614 976857543 976902604 976984859 977165759
1996.6I77165759P3135j18435o5386L9756l8743j18434k6107P9691L2962j431P4864
$$ 977165759 977238894 977120459 977055073 977094829 977056086 976937652 976911545 976991236 977024198 977022767 977097631
2019I77097631J27553P7010p75n0187o4731k1636n782n5552p0631j5557O4135J00970
$$ 977097631 977225184 977302194 977301419 977251232 977186501 977164865 977159083 977103531 977032900 977017343 977081478 977182448
2043.5I77182448O5505L4988J5438l8803p4625l0815N0902L3736l8445j2576O0439
$$ 977182448 977247953 977282941 977298379 977259576 977184951 977154136 977205038 977238774 977200329 977187753 977248192
2065.9I77248192P2837M7505J5318l3438p1764n9784M2618J55091J27792M0591L58
$$ 977248192 977321029 977368534 977383852 977350414 977278650 977218866 977261484 977416575 977544367 977584958 977585316
2088.3I77585316m7922o8546n3525q1062m8995N9605Q8989O7413J2756q3089n4598
$$ 977585316 977537394 977468848 977415323 977334261 977285266 977344871 977433860 977501273 977514029 977430940 977376342
2110.8I77376342K6166m77J4842J04725R0182q404n4956o4969o0141j371N5313N0247
$$ 977376342 977402508 977402031 977416873 977521598 977611780 977603376 977548420 977483451 977423310 977421939 977477252 977527499
2135.2I77527499J0789j7107J8716R4891P9989j19k0266J6391L2843q405J3113O5446
$$ 977527499 977538288 977521181 977539897 977634788 977714777 977714658 977694392 977710783 977743626 977735221 977748334 977813780
2159.7I77813780K8313K38O378k504P212N9545P4983j252o4730k3604O9976J19269
$$ 977813780 977842093 977842331 977848709 977846205 977853417 977912962 977987945 977986693 977921963 977898359 977968335 978087604
2184.2I78087604P1645l2187r179J04964O7890o1810j19806p4207K5749O9976K4259
$$ 978087604 978159249 978127062 978117883 978222847 978290737 978228927 978109121 978034914 978060663 978130639 978154898
2206.6I78154898o7056p3671M3988Q7798K7120L2902P0572J1861r8169r7155N2809
$$ 978154898 978087842 978014171 978058159 978145957 978173077 978205979 978276551 978288412 978190243 978093088 978145897
2229.1I78145897J07170J9788n960Q94k9504m8340J8776J16467M3631j21534j24753
$$ 978145897 978253067 978272855 978266895 978267789 978238285 978189945 978208721 978325188 978368819 978247285 978122532
2251.5I78122532k2828L5107P391o8486j5437Q8095M3094l8027k3783N8115P9512J9193
$$ 978122532 978099704 978134811 978142202 978073716 978058279 978146374 978189468 978151441 978127658 978185773 978265285 978284478
2276I78284478k6047m2677m3094m5300l0160k0802o4015l5286Q6486J40489J08897
$$ 978284478 978258431 978215754 978172660 978127360 978097200 978076398 978012383 977977097 978063583 978204072 978312969
2298.4I78312969K5213m1246m8280q2016N781J68205J20520r298n2392M4822P2479
$$ 978312969 978338182 978296936 978248656 978166640 978172421 978340626 978461146 978451848 978399456 978444278 978516757
2320.8I78516757j97052l45946j15394J79708K04145J20l4988J23858J19150m3333
$$ 978516757 978319705 977973759 977858365 978038073 978242218 978242338 978207350 978331208 978450358 978407025
2341.2I78407025j60217k03311l1710J57416J03473o1333j26242l4929J29760j1087
$$ 978407025 978246808 978043497 978011787 978169203 978272676 978211343 978085101 978050172 978179932 978168845
2361.6I78168845j93715k2113N9128K5510Q9407M7922j09732j45614M2558K60115K52187
$$ 978168845 977975130 977953017 978012145 978037655 978127062 978174984 978065252 977919638 977962196 978222311 978474498
2384I78474498P3552m2141l1352J908m77J3113N4896J6391r4533r9063j4901J6630
$$ 978474498 978548050 978505909 978474557 978476465 978475988 978489101 978543997 978560388 978465855 978366792 978351891 978368521
2408.5I78368521Q1360J86861J25169l0458p8141m3571J4662L5942N0664Q1122K4855
$$ 978368521 978449881 978636742 978761911 978731453 978653312 978609741 978624403 978660345 978711009 978792131 978816986
2430.9I78816986p272n603n8531k7359M3392L1472J2397K5750M6849O0975J6570J79
$$ 978816986 978809714 978804111 978745580 978718221 978761613 978793085 978805482 978831232 978878081 978939056 978955626 978955805
2455.4I78955805P0393L8207n3346M470M9532k2591j8537J0193j5140r53K5689o437
$$ 978955805 979026198 979064405 979011059 979015529 979065061 979042470 979023933 979034126 979018986 979018033 979043722 979037285
2479.9I79037285l5465J4186L6359j9729q2672q0168K9802Q8155n304l7849L8623K2769
$$ 979037285 979001820 979016006 979052365 979032636 978949964 978869796 978899598 978987753 978982449 978944600 978983223 979005992
2504.4I79005992k3424O199j0133p4744n8294J7584K2411l9279j8418R6202R9837m5597
$$ 979005992 978982568 978988767 978978634 978903890 978845596 978863180 978885591 978846312 978827894 978924096 979023933 978978336
2528.8I78978336r0003p868P15M18N5432N3346L0875O1095K9564p0274n2214O0261
$$ 978978336 978888333 978880465 978881180 978881598 978937030 978990376 979021251 979082346 979111910 979041636 978989422 979049683
2553.3I79049683K0027j27614r3281Q106k2590q3864m6611J15991J91748R9778Q4281
$$ 979049683 979069710 978942096 978848815 978856921 978834331 978750467 978703856 978819847 979011595 979111373 979195654
2575.7I79195654J01328o5088j58846n4658k0027j8358N2690P1883q583j5854M9591
$$ 979195654 979296982 979231894 979073048 979018390 978998363 978980005 979032695 979104578 979095995 979080141 979129732
2598.2I79129732j0670p8439j5140K0743m3333m0293M6134R3520J09732P5162l3081
$$ 979129732 979119062 979040623 979025483 979046226 979002893 978962600 979008734 979102254 979211986 979287148 979254067
2620.6I79254067j29879r8347O1154J85013J38462j1564j09613j15990j431J75119
$$ 979254067 979124188 979025841 979086995 979272008 979410470 979398906 979289293 979173303 979171872 979346991
2641I79346991J95205P3671m5359j57416j81556m1067J15692J21653l5583j83404j71721
$$ 979346991 979542196 979615867 979570508 979413092 979231536 979190469 979306161 979427814 979392231 979208827 979037106
2663.4I79037106q3387j3947K8014P4863Q8036M173q3626m6730K7120L2545N9783O7830
$$ 979037106 978953719 978939772 978967786 979042649 979130685 979134858 979051232 979004502 979031622 979064167 979123950 979191780
2687.9I79191780R358q464N6088P8976n483j2815M3392k9683j39535p6830P4088J23322
$$ 979191780 979201138 979192674 979248762 979327738 979322255 979309440 979352832 979323149 979183614 979106784 979180872 979304194
2712.4I79304194N2751r1851j25230k9563n8830j39714q5234J3947Q4639Q2970N662
$$ 979304194 979356945 979265094 979139864 979110301 979051471 978911757 978826523 978840470 978925109 979008079 979013741
2734.8I79013741n8055p9453n4419j1265L3498R5784J55807J55926Q3923K7299j7762
$$ 979013741 978955686 978876233 978821814 978810549 978844047 978939831 979095638 979251564 979335487 979362786 979345024
2757.2I79345024q5235p0512K7418Q106j72377k01225p331N0664L874K5928M709J6093
$$ 979345024 979259789 979189277 979216695 979224801 979052424 978851199 978843868 978894532 978898406 978924334 978929043 978945136
2781.7I78945136K4319j16289j96338q1122L7075L57j26958j69515p9453k9445j05739
$$ 978945136 978969455 978853166 978656828 978575706 978612781 978613138 978486180 978316665 978237212 978207767 978102028
2804.1I78102028j58012k32160l55482k96414j88470j68085o3419K9266m9532j78217
$$ 978102028 977944016 977711856 977356374 977059960 976871490 976703405 976639986 976669252 976619720 976441503
2824.5I76441503k24710k33829k71380l61860m97162o24895p69794r98080j349091
$$ 976441503 976216793 975982964 975711584 975349724 974852562 974227667 973457873 972459793 971110702
2842.9I71110702j722634j858712j698911j379311q65578j16587N58019Q72969R37998
$$ 971110702 969388068 967529356 965830445 964451134 963585556 963468969 964026988 964899957 965837955
2861.2I65837955R08137P55012N09500L39210L05653L02494K08318P3075r239j55270
$$ 965837955 966746092 967501104 968010604 968349814 968655467 968957961 969166279 969239354 969230115 969074845
2881.6I69074845l85880n41270o30498p43985q63075r77814j126230j320899j508236
$$ 969074845 968688965 968147695 967517197 966773212 965910137 964932323 963806093 962485194 960976958
2900I60976958j702487j860202j742720j462579j217484r53794q73923r52482q37982
$$ 960976958 959274471 957414269 955671549 954208970 952991486 952037692 951163769 950211287 949373305
2918.3I49373305o65307o33121m66704q1718K46882M99487P90537J021564J117527
$$ 949373305 948707998 948074877 947608173 947526455 947773337 948272824 949063361 950084925 951202452
2936.7I51202452J180768J263797J190901R26554P16925N95212L92556J82808J80423
$$ 951202452 952383220 953647017 954837918 955764472 956481397 957076609 957469165 957651973 957832396
2955I57832396K00927k8729j59681N9962K65360M59016Q18192J104355J294792J454532
$$ 957832396 958033323 958004594 957844913 957904875 958170235 958629251 959447443 960551798 961846590 963301122
2975.4I63301122J526892J636267J773894J781940J708448J548350J237810R78470
$$ 963301122 964828014 966464281 968238175 970020115 971728563 973276913 974514723 975493193
2991.8I75493193Q82744P55370N17190L63826L17634K94566L08215K91884K80679K32994
$$ 975493193 976375937 977131307 977648497 978012323 978329957 978624523 978932738 979224622 979505301 979738295
3012.1I79738295J14322J23560J74880J61469J81735J20818j9550j9789Q3268J22368
$$ 979738295 979852617 979976177 980151057 980312526 980494261 980615079 980595529 980575740 980659008 980781376
3032.5I80781376O1870m8161n6862N841m1247o3717k5392r8049j24574K5213J42157
$$ 980781376 980843246 980795085 980738223 980744064 980702817 980639100 980613708 980515659 980391085 980416298 980558455
3055I80558455L8564j14977q2970k384j9670L4988J52707J44005O5983J4901L6657
$$ 980558455 980597019 980482042 980399072 980396688 980377018 980412006 980564713 980708718 980774701 980789602 980826259
3077.4I80826259R7990J11401O0797J8954L5763N2273N2750m7207j56701q9049o258
$$ 980826259 980924249 981035650 981096447 981115401 981151164 981203437 981256187 981208980 981052279 980963230 980956972
3099.8I80956972M232M5716Q9527J25527J27554K2054j8180q166j48356k11894k3782
$$ 980956972 980961204 981006920 981096447 981221974 981349528 981371582 981353402 981345236 981196880 980984986 980961204
3122.3I80961204J49369Q7678j6570M3333N9902m5359p748J34468J72078M7863j99735
$$ 980961204 981110573 981198251 981181681 981225014 981284916 981239557 981231809 981366277 981538355 981586218 981386483
3144.7I81386483k45750J0252J50323Q6546M8041N8770J24991J28806o5148j33634
$$ 981386483 981140733 981150985 981301308 981387854 981435895 981494665 981619656 981748462 981683314 981549680
3165.1I81549680O9380J15216n1856j01447r1076j05262o9737j4902R597r358m947
$$ 981549680 981619060 981734276 981682420 981580973 981489897 981384635 981314898 981299996 981309593 981300235 981295288
3187.5I81295288J7404R179N484K7358O6638J18316J34110L8564n9187q5771m9532
$$ 981295288 981312692 981321871 981327355 981354713 981421351 981539667 981673777 981712341 981653154 981567383 981517851
3210I81517851n185n7817p9214n4896q8096j32859p3671J08898J79767M2141j24157
$$ 981517851 981512666 981454849 981375635 981320739 981232643 981099784 981026113 981135011 981314778 981356919 981232762
3232.4I81232762j41263k2232R3639J56939J36912K8431n0783N364J15097J15096K9326
$$ 981232762 981091499 981069267 981162906 981319845 981456757 981485188 981434405 981439769 981554866 981669962 981699288
3254.8I81699288r2507j51813j1563J20104J28090L9697j42515j85967j23918m8399
$$ 981699288 981606781 981454968 981443405 981563509 981691599 981731296 981588781 981402814 981278896 981230497
3275.2I81230497J64867L21269J75953j20521k31981j42098n5968L4392J17182J32978
$$ 981230497 981395364 981716633 981892586 981772065 981540084 981397986 981342018 981376410 981493592 981626570
3295.6I81626570N8353m7564l3856n0783j07884m828J15275J30236Q5712J5199j3709
$$ 981626570 981684923 981637359 981603503 981552720 981444836 981440008 981555283 981685519 981771231 981786430 981772721
3318I81772721M4405N5731o5327j71900j72496l9816J38581J47879J6392L218J40965
$$ 981772721 981817126 981872857 981807530 981635630 981463134 981423318 981561899 981709778 981726170 981729388 981870353
3340.5I81870353J60516M4703j6570j9968L2246K623m3988J05440J21952n5433o7889
$$ 981870353 982030869 982075572 982059002 982039034 982071280 982073903 982029915 982135355 982257307 982201874 982133985
3362.9I82133985K4974m3750j38283J7941K13981K20716J10805n7757j85728j88827
$$ 982133985 982158959 982115209 981976926 981994867 982208848 982429564 982540369 982482612 982296884 982108057
3383.3I82108057j29104n0962P0333J66595J63257R9123n6028j98186l3319K30789
$$ 982108057 981978953 981927991 981998324 982164919 982328176 982427299 982371271 982173085 982139766 982370555
3403.7I82370555K11239L7372j07407j60456M590J97827R3759j11044j00374L2127
$$ 982370555 982581794 982619166 982511759 982351303 982355893 982553720 982647479 982536435 982436061 982468188
3424.1I82468188J0848j50800j63138m3094j7405j7702J27137K56598J67131k4855
$$ 982468188 982479036 982328236 982165098 982122004 982104599 982086897 982214034 982470632 982637763 982612908
3444.5I82612908m2915J30891J73331L7551Q1360J82927l9101k30372j23441m1306
$$ 982612908 982569993 982700884 982874215 982911766 982993126 983176053 983136952 982906580 982783139 982741833
3464.9I82741833j00196n0068P2122N5134P6354J06037Q8930J54197J19328n7578q2850
$$ 982741833 982641637 982591569 982663691 982718825 982795179 982901216 982990146 983144343 983263671 983206093 983123243
3487.3I83123243m3273l9697J46747J79946n7637j59026j40488r8347K4259R2685k563
$$ 983123243 983079970 983040273 983187020 983366966 983309329 983150303 983009815 982911468 982935727 983028412 983025849
3509.7I83025849o1631N483J48535K36869J39058k8551j40250j51515l1709J31309
$$ 983025849 982964218 982969701 983118236 983355105 983494163 983465612 983325362 983173847 983142138 983273447
3530.1I83273447J30891Q5175J28985J9133k20239k00629K7835M291j16109r54J35541
$$ 983273447 983404338 983489513 983618498 983637631 983417392 983216763 983244598 983248889 983132780 983131826 983267367
3552.6I83267367J64866J32203N4598M053j9967n7459l1829R0301J37806O3002K444
$$ 983267367 983432233 983564436 983619034 983623087 983603120 983545661 983513832 983604133 983741939 983804941 983807385
3575I83807385K8849O7293L1710j1683n9604q0466K7298K6167p033P1942Q5175N1678
$$ 983807385 983836234 983903527 983935237 983923554 983863950 983783484 983810782 983836949 983829916 983901858 983987033 984038711
3599.5I84038711J3411n8532j21415k6047J75714J54078M8042k8968j73271j36316
$$ 984038711 984052122 983993590 983872175 983846128 984021842 984175920 984223962 984194994 984021723 983885407
3619.9I83885407L9220K9564j8298P9035J93417R4772L4749P2837k1934q4102l2247
$$ 983885407 983924627 983954191 983935893 984014928 984208345 984303117 984337866 984410703 984388769 984304667 984272420
3642.3I84272420j23322j62243P6949K90334K16961O2466K2471j6630j57237j46389
$$ 984272420 984149098 983986855 984063804 984354138 984571099 984633565 984656036 984639406 984482169 984335780
3662.7I84335780j6332m0531k29001k81930o5684J50204K68399K79129K20060O8784
$$ 984335780 984319448 984278917 984049916 983767986 983702302 983852506 984120905 984400034 984620094 984688878
3683.1I84688878K8312J57178J46866k0743j31309j29819Q3983K05517L2663p0154
$$ 984688878 984717190 984874368 985021234 985000491 984869182 984739363 984823346 985028863 985061526 984991372
3703.5I84991372n7400l5107q7261j93119n0724J32144J94728J32561k2411o1930N4777
$$ 984991372 984933972 984898865 984811604 984618485 984567761 984699905 984894633 985027194 985004783 984942853 984997630
3725.9I84997630J38700N782k18928k30193j4723J34707O3479j67310k23339N7936
$$ 984997630 985136330 985142112 984923184 984692991 984678268 984812975 984876454 984709144 984485805 984543741
3746.3I84543741J00314j23500j30713N9008J09255K21789K84911P7247n662J38461
$$ 984543741 984644055 984520555 984389842 984448850 984558105 984779894 985064805 985142052 985136390 985274851
3766.7I85274851J32561k6703J2338J20461J25885L4929j08540o0738N4896N5731M5657
$$ 985274851 985407412 985380709 985393047 985513508 985639393 985674322 985565782 985505044 985559940 985615671 985661328
3789.1I85661328k2590j53780k05040j35482j22428k04026j16349J12892L44693L00110
$$ 985661328 985638738 985484958 985279918 985144436 985022008 984817982 984701633 984814525 985159218 985459328
3809.5I85459328o56j97291k34008n5611J05262R0539J57833N4121k47657j62244J92463
$$ 985459328 985458672 985261381 985027373 984971762 985077024 985167563 985325396 985379517 985131860 984969616 985162079
3831.9I85162079J76788m5896q225J56939J59979P1585J03950J36853L7431k4199q1241
$$ 985162079 985338867 985292971 985284746 985441685 985601664 985673249 985777199 985914052 985951483 985927284 985846043
3854.4I85846043j94848j46091k9802k8968L2544J58012p6294l44813q6069J73509
$$ 985846043 985651195 985505104 985475302 985446334 985478878 985636890 985560596 985215783 985129714 985303223
3874.8I85303223N0843j88410j96278N5551J62780J31071J43170J84775J94668N1499
$$ 985303223 985354066 985165656 984969378 985024929 985187709 985318780 985461950 985646725 985841393 985892892
3895.2I85892892j58787k78354k60830p2300K44916L66449J82569j03533k41578j31369
$$ 985892892 985734105 985455751 985194921 985122621 985367537 985733986 985916555 985813022 985571444 985440075
3915.6I85440075J10507K12789k861k47955j13905J54436J4007k23398m0293J84715
$$ 985440075 985550582 985763371 985760510 985512555 985398650 985553086 985567093 985343695 985303402 985488117
3936I85488117P2896j61946j46985J51754K96950J95682K23279K24173p1347l17811
$$ 985488117 985561013 985399067 985252082 985403836 985700786 985896468 986119747 986343920 986272573 985954762
3956.3I85954762k26379k503N7876L0756n1439j52528m4465J54018J81794L219j88053
$$ 985954762 985728383 985725880 985783756 985814512 985763073 985610545 985566080 985720098 985901892 985905111 985717058
3978.8I85717058o6399K73883K70665p2122k60830j46031M708j430P9572
$$ 985717058 985650659 985924542 986195207 986123085 985862255 985716224 985720932 985719502 985799074
3997.1I85799074
$$ 985799074
##END=$$ End of the data block
