##TITLE=DI 15-0904285-9 $$ Begin of the data block
##JCAMP-DX=5.00 $$ ACD/SpecManager v 10.08
##SPECTROMETER/DATA SYSTEM=Alpha
##DATE=15 Jun 2015 08:21:06
##DATA TYPE=INFRARED SPECTRUM
##DATA CLASS=XYDATA
##ORIGIN=
##OWNER=
##NPOINTS=1667
##FIRSTX=599.64648438
##LASTX=3997.64306641
##MAXX=3997.64306641
##MINX=599.64648438
##MAXY=1.11556005
##MINY=0.18781056
##XFACTOR=1.0000000000
##YFACTOR=0.000000010000000
##FIRSTY=0.83047050
##DELTAX=2.03961372
##XUNITS=1/CM
##YUNITS=ARBITRARY UNITS
##XYDATA=(X++(Y..Y))
599.6 83047050 82994252 82892758 82717526 82460052 82120317 81850684 81829059 82019258 82286495 82600576
620 82600576 82907140 83040005 83019257 83049858 83214670 83464283 83713400 83902204 84036195 84165752 84312809
642.5 84312809 84458065 84582895 84693027 84820157 84977323 85144347 85299647 85432369 85539991 85626811
662.9 85626811 85744977 86008126 86235452 86187744 86165053 86288679 86475247 86647278 86790079 86909992
683.3 86909992 86992943 87011904 86918944 86613530 85844147 84022754 80305475 74559420 68612891 65528899
703.7 65528899 66843647 71216017 75950825 79075897 79997134 79011220 76695299 73685199 70669019
722 70669019 68162996 66410810 65583777 65729105 66802436 68822122 71710104 75114024 78538543
740.4 78538543 81582206 84049511 85919756 87264168 88220108 88930964 89492285 89956504 90355361
758.7 90355361 90718699 91042280 91275525 91373610 91289103 90960234 90362215 89521587 88541698 87721854
779.1 87721854 87472540 87997025 89186424 90764213 92446166 94008052 95303798 96300626 97035700
797.5 97035700 97552669 97906315 98150098 98324484 98460275 98577702 98699248 98833269 98964113 99063712
817.9 99063712 99104482 99080157 99031544 99030375 99125010 99300539 99492949 99650609 99771464 99894297 100029457
840.3 100029457 100143933 100212479 100208175 100094676 99850857 99469972 98938817 98218638 97270828 96096373
860.7 96096373 94725388 93246287 91821611 90618318 89735937 89168715 88839954 88663411 88590854
879.1 88590854 88617986 88722557 88865036 89031935 89216155 89415371 89663219 90012580 90487862 91072994
899.5 91072994 91730970 92402101 93021357 93573487 94075423 94512969 94841349 95020694 95037127 94915915
919.9 94915915 94729596 94583273 94580346 94800234 95279664 95994180 96881491 97882354 98932886 99944180
940.3 99944180 100829720 101541579 102068269 102427959 102660191 102791309 102834666 102816212 102761972 102674496 102539551
962.7 102539551 102355552 102130258 101860547 101535904 101154184 100735402 100318813 99954897 99698550 99579209
983.1 99579209 99556619 99535602 99430960 99190849 98810863 98351973 97902274 97524452 97266322 97278297
1003.5 97278297 97716421 98422557 99087405 99614251 100047767 100409019 100671816 100795782 100755215 100512636
1023.9 100512636 99995738 99179590 98300362 97863156 98113382 98692328 99113524 99219298 99066001 98731160
1044.3 98731160 98285323 97771382 97187603 96537572 95843923 95141697 94500095 94015247 93768358 93779600
1064.7 93779600 94005281 94346792 94662684 94831616 94797266 94543517 94064271 93462509 93080705 93270582
1085.1 93270582 94008744 94996703 96034855 97097230 98182374 99220872 100099945 100731575 101088953
1103.4 101088953 101197088 101083708 100765657 100268745 99633503 98899060 98083037 97204947 96312422 95488149
1123.8 95488149 94847232 94514430 94578397 95050621 95866877 96912158 98051459 99158967 100133276
1142.2 100133276 100916088 101517797 101984644 102329433 102534056 102593374 102550232 102532899 102668881 102928936
1162.6 102928936 103187799 103374696 103489006 103552258 103580427 103587735 103567266 103490901 103351557 103157067 102942693
1185 102942693 102790117 102757406 102830696 102943146 103015661 103000319 102888930 102687025 102389646 101969886 101351452
1207.5 101351452 100387323 98921096 97026622 95295399 94618601 95370907 97004884 98660272 99876338
1225.8 99876338 100633574 101071644 101319206 101468313 101590240 101735270 101915359 102108026 102283311 102420568
1246.2 102420568 102513433 102571249 102609789 102634346 102634215 102600789 102557397 102549005 102589357 102635705 102638757 102593803
1270.7 102593803 102514946 102409828 102290106 102167857 102049887 101945162 101868081 101828229 101802719 101745105
1291.1 101745105 101629043 101458514 101247478 101014054 100788760 100601566 100466454 100386262 100356388 100357020
1311.5 100357020 100370443 100387251 100416219 100501037 100656068 100838745 100989807 101049364 100984967 100816035 100581622
1333.9 100581622 100319052 100067711 99877810 99768102 99650800 99416536 99064785 98719335 98524940 98530549
1354.3 98530549 98659956 98771304 98746568 98537177 98181701 97745425 97262400 96720564 95951831 94799942
1374.7 94799942 93716031 93495041 94243526 95261878 95988345 96428972 96704626 96850562 96913946 96975410
1395.1 96975410 97135043 97459215 97877270 98231846 98389262 98203623 97603756 96610457 95400494 94321662
1415.5 94321662 93817073 94275004 95384592 96526301 97312200 97456241 96911198 95803612 94332433
1433.9 94332433 92454666 90423149 88812369 87468302 86097270 84415048 81982881 78613257
1450.2 78613257 74601638 70811880 68356925 68178087 69099689 69496197 68775427 67621797 67671514
1468.5 67671514 69529146 72531915 74663490 75078249 74444753 73348653 72367764 72208428 73493165
1486.9 73493165 76673514 81101394 84919912 87645566 90090680 92962623 96005780 98478210
1503.2 98478210 100322485 101760423 102572024 103008366 103345478 103623796 103873479 104098475 104310083
1521.6 104310083 104488218 104623723 104760921 104875100 104969180 105077851 105181623 105266905 105363071 105421650
1542 105421650 105440927 105462241 105462694 105450535 105450130 105462778 105474555 105479765 105471015 105462635 105461657 105461502 105447960 105416107
1570.5 105416107 105373037 105307782 105188060 104984426 104619658 104053724 103590465 103588021 103906190 104130733
1590.9 104130733 104104781 103902149 103590262 103178179 102656174 102080119 101544225 101041770 100455832 99739307
1611.3 99739307 98949158 98026097 96939671 96022666 95277405 94538158 93914312 93451840 93111008 92897129
1631.7 92897129 92787373 92775518 92878717 93067837 93311286 93584549 93923700 94315475 94647515 95021111
1652.1 95021111 95546204 96006477 96423441 96892935 97443217 98034483 98587412 99178010 99843866 100453222
1672.5 100453222 101047933 101668239 102220261 102721083 103240407 103825808 104335833 104746222 105143321 105503094
1692.9 105503094 105840671 106168258 106459856 106723857 106948614 107147539 107346559 107543886 107729697 107893288
1713.3 107893288 108038652 108171284 108303213 108443153 108573234 108689642 108790207 108883345 108967626 109022570
1733.7 109022570 109088755 109188056 109262288 109300506 109346879 109407341 109466493 109513116 109559941 109609175 109640443
1756.1 109640443 109670615 109709501 109727597 109739077 109748626 109750581 109763598 109749460 109704721 109674799 109656787 109647596
1780.6 109647596 109655726 109679413 109723496 109781647 109817827 109822953 109844673 109896111 109934282 109950256 109977138 110013974
1805.1 110013974 110040069 110047102 110032737 110011554 109988976 109954381 109916294 109874856 109812784 109744215 109701407 109664929
1829.6 109664929 109637964 109644544 109661341 109681368 109713924 109749424 109765100 109774554 109810376 109858513 109896135 109921122
1854 109921122 109940445 109957290 109972358 109984481 109996772 110009313 110014021 110020804 110035789 110037017 110018897 109997237
1878.5 109997237 109976113 109947944 109908426 109856510 109784508 109701943 109621537 109534609 109450257 109374678 109296095
1900.9 109296095 109220767 109159863 109107149 109055471 109010911 108984673 108968568 108944345 108921480 108916259 108920431 108922160
1925.4 108922160 108928013 108947647 108968174 108977628 108985627 108995235 108993256 108973300 108948267 108929062 108905971 108868980
1949.9 108868980 108816266 108750999 108678472 108598483 108514941 108433831 108353472 108282161 108234906 108205140 108179867
1972.3 108179867 108163953 108162189 108166790 108173072 108184385 108200037 108213055 108218503 108218348 108221340 108232260 108240914 108242536
1998.8 108242536 108248651 108261168 108268464 108266902 108258772 108243394 108220804 108187222 108145988 108111644 108086658 108063078
2023.3 108063078 108036661 108010006 107985806 107959354 107921779 107872510 107823074 107782841 107746243 107699275 107640469
2045.8 107640469 107584059 107542074 107508707 107470131 107419562 107359922 107297409 107235932 107180393 107127535 107071209
2068.2 107071209 107018661 106970966 106913340 106844521 106780922 106730759 106684721 106631315 106571937 106514800 106470084
2090.6 106470084 106442499 106419218 106385195 106345665 106312203 106283462 106253755 106223905 106199229 106180978 106167960
2113.1 106167960 106160760 106157696 106157196 106157875 106157947 106159544 106166768 106181538 106198835 106216252 106239748 106263876 106281054 106296968
2141.6 106296968 106316876 106341970 106371701 106402087 106432652 106465983 106502962 106549621 106604254 106651640 106690109
2164.1 106690109 106734633 106785047 106824458 106857073 106898880 106949174 106997132 107032740 107065129 107107353 107149827
2186.5 107149827 107187438 107228971 107273638 107315600 107360280 107409883 107454991 107497168 107540739 107583666 107632542
2208.9 107632542 107685626 107728004 107760501 107798827 107848549 107900906 107947743 107992399 108042371 108096063 108148086
2231.4 108148086 108196187 108234513 108265507 108300686 108334780 108365345 108406627 108456874 108500612 108537924 108577013
2253.8 108577013 108613110 108644772 108676612 108704877 108728480 108749485 108770728 108797240 108825278 108854723 108889449
2276.2 108889449 108916819 108936107 108969855 109018970 109063911 109101999 109142542 109184766 109223652 109257174 109287202
2298.7 109287202 109323049 109368491 109419525 109478688 109547246 109617126 109673667 109716237 109777176 109879863 110002255
2321.1 110002255 110109556 110207248 110323846 110454357 110557532 110612226 110663581 110741723 110803699 110807753 110735440
2343.5 110735440 110563791 110395706 110402572 110622883 110952067 111246133 111449087 111551464 111556005 111488664
2363.9 111488664 111366963 111196589 111000764 110794008 110587525 110404921 110256982 110148418 110084152 110061026
2384.3 110061026 110067749 110085714 110104489 110125291 110152018 110184157 110213149 110238469 110267329 110293245 110306633 110313165
2408.8 110313165 110320354 110329330 110338151 110347664 110363317 110382855 110401642 110418904 110437846 110467792 110505855 110536909
2433.3 110536909 110560524 110583842 110600209 110604572 110610485 110630322 110650587 110657334 110660243 110666955 110673642 110681701 110693026
2459.8 110693026 110703588 110708570 110708761 110711110 110716915 110723484 110728014 110733700 110746193 110752714 110748208 110747421 110746932 110737777
2488.3 110737777 110730028 110725093 110717714 110717452 110721600 110711861 110689080 110664916 110640442 110614491 110586667 110553980 110519600
2514.9 110519600 110486531 110453022 110417533 110376716 110337782 110303342 110268903 110243309 110227954 110219085 110211587 110195637
2539.3 110195637 110175550 110164928 110167313 110168433 110159516 110149765 110141420 110124195 110097170 110071135 110045481 110014224
2563.8 110014224 109982681 109949863 109906673 109853709 109799993 109755838 109716463 109672487 109626675 109580851 109544325
2586.2 109544325 109522521 109501719 109475482 109447634 109412241 109362757 109310544 109270656 109240592 109213281 109195089
2608.7 109195089 109185839 109170949 109141111 109097624 109049296 109001565 108952665 108905995 108866835 108824587 108770335 108712137
2633.2 108712137 108652580 108595467 108552337 108518112 108481193 108436716 108382094 108332312 108293402 108240557 108170402
2655.6 108170402 108102715 108032894 107947671 107857585 107773793 107694292 107617724 107546294 107482672 107417023 107348549
2678 107348549 107296467 107259238 107223082 107191789 107174242 107163346 107146263 107126462 107111132 107101166 107089949 107062221
2702.5 107062221 107015789 106965744 106919336 106868100 106801891 106729054 106669664 106616223 106545675 106459403 106368196
2724.9 106368196 106278038 106202435 106155908 106138766 106135762 106133187 106128240 106117177 106089914 106035829 105961668 105892158
2749.4 105892158 105838418 105782032 105696893 105584347 105469775 105370760 105279315 105178344 105068970 104954398
2769.8 104954398 104824209 104672623 104516006 104371190 104223204 104048765 103852463 103652227 103456402 103268552
2790.2 103268552 103087437 102897906 102683389 102450597 102208579 101941741 101642203 101304579 100914836 100484371
2810.6 100484371 100020850 99509966 98942196 98309684 97612709 96848959 95996356 95023829 93883592
2828.9 93883592 92498624 90745741 88434780 85314232 81099069 75542510 68641913 60834205
2845.3 60834205 52914292 45851195 40694192 38319290 38994959 42297181 47372895 53183097 58667564
2863.6 58667564 62909794 65442288 66578668 67304087 68491185 70179802 71781546 72760767 72958452
2882 72958452 72470689 71451598 70034993 68343157 66505754 64624709 62728733 60784996 58744711
2900.3 58744711 56549460 54105657 51289386 47968841 44047341 39531973 34577233 29532146
2916.7 29532146 24947244 21406440 19314066 18781056 19687398 21797411 24844445 28670385 33151972
2935 33151972 38030630 42942244 47508609 51368451 54217297 55836022 56185168 55606943 54810226
2953.4 54810226 54539859 55251300 57033634 59774446 63312721 67408693 71697044 75780046 79341483
2971.7 79341483 82218325 84420627 86061412 87315375 88360441 89286274 90137106 90965468 91784298
2990.1 91784298 92552274 93217254 93722320 94027948 94128847 94039261 93831486 93606186 93426687 93322885
3010.5 93322885 93279874 93233991 93136626 92989761 92814416 92622828 92416584 92197466 91973782 91787231
3030.9 91787231 91722542 91853237 92180216 92625785 93094611 93540424 93975359 94402909 94758862 94965351
3051.3 94965351 94994712 94869256 94656092 94431758 94267571 94253951 94488740 95011240 95734179 96494669
3071.7 96494669 97147954 97623223 97937405 98120010 98180264 98146600 98052990 97927839 97821623 97778726
3092.1 97778726 97781825 97777492 97732824 97628587 97464353 97270238 97064948 96847463 96630448 96437573 96263862
3114.5 96263862 96091372 95923615 95753789 95557183 95323730 95061243 94785041 94503868 94205767 93879426
3134.9 93879426 93532151 93187666 92855048 92512304 92144644 91754252 91344333 90916920 90488309 90066296
3155.3 90066296 89630133 89173287 88693643 88182867 87666994 87179053 86712420 86249214 85779345 85285199
3175.7 85285199 84755576 84205973 83651656 83090502 82532650 81987214 81436026 80874348 80320525 79782563
3196.1 79782563 79264218 78758126 78248608 77733797 77215713 76702166 76199901 75711477 75240880 74772274
3216.5 74772274 74292010 73811871 73339337 72867358 72391295 71923280 71483868 71070558 70648807 70207793
3236.9 70207793 69781232 69383937 69006157 68647867 68296903 67936832 67581534 67244858 66915154 66575271
3257.3 66575271 66232842 65905666 65593088 65291828 64996558 64695126 64365333 64008290 63656306 63309491
3277.7 63309491 62953401 62593222 62230873 61865032 61501592 61145765 60790163 60421878 60031676 59623373
3298 59623373 59217703 58834660 58484387 58127975 57706177 57231373 56760126 56322211 55898392 55462569
3318.4 55462569 55030996 54632896 54248798 53827333 53375453 52943540 52542436 52171820 51847214 51523221
3338.8 51523221 51147521 50754726 50375021 50030655 49760959 49500263 49167642 48824051 48546973 48321152
3359.2 48321152 48101151 47896612 47764614 47686672 47556126 47321787 47068423 46897361 46799177 46714398
3379.6 46714398 46615008 46529996 46492136 46512160 46601346 46679100 46656594 46630052 46729216 46892139 46956632
3402.1 46956632 46919325 46941140 47068030 47213477 47341633 47450674 47550324 47690833 47869244 48039314
3422.5 48039314 48222977 48456433 48726681 48990327 49244654 49515873 49761331 49941045 50118375 50365001
3442.9 50365001 50677836 51008832 51320326 51636088 51979834 52342916 52730888 53145677 53552061 53955513
3463.2 53955513 54422408 54933113 55383760 55761331 56153446 56601954 57110643 57650757 58160949 58664244
3483.6 58664244 59207791 59763563 60318047 60899734 61506367 62115502 62719399 63350445 64025182 64684206
3504 64684206 65311933 65976596 66694427 67422163 68127090 68808275 69500446 70229435 70980239 71705526
3524.4 71705526 72407198 73132080 73880529 74627811 75375873 76126599 76852596 77549189 78244579 78961921
3544.8 78961921 79683483 80382282 81082946 81785440 82451499 83111089 83797985 84470779 85091746 85709232
3565.2 85709232 86397105 87097615 87734890 88331062 88918132 89514178 90113741 90686297 91216367 91749585
3585.6 91749585 92345458 92940724 93463683 93984288 94517106 94993317 95448202 95922428 96366841 96795386
3606 96795386 97260743 97706610 98093778 98469448 98845565 99226087 99607998 99949342 100246918 100541914
3626.4 100541914 100898659 101261544 101543343 101821268 102120578 102400053 102654994 102892196 103115404 103353548
3646.8 103353548 103634369 103925502 104184222 104424071 104653299 104855835 105056584 105261028 105436242 105584526
3667.2 105584526 105736852 105885172 106042337 106303704 106652427 107007277 107380462 107752264 108088195 108388221
3687.6 108388221 108678603 108927965 109093916 109221530 109346557 109458172 109557021 109644246 109715509 109775865
3708 109775865 109824479 109857750 109893632 109944320 109999084 110049009 110095811 110136509 110176456 110233223 110282385 110300791
3732.5 110300791 110302389 110296929 110295355 110327578 110418689 110526967 110579538 110603786 110611415 110579324 110549593 110549724
3756.9 110549724 110564923 110580766 110587597 110600531 110630322 110656261 110673726 110692024 110718369 110744214 110751593 110760307
3781.4 110760307 110788119 110819221 110841632 110854065 110861111 110874009 110896695 110921049 110955846 111003566 111032045 111039793
3805.9 111039793 111047089 111063325 111091340 111111915 111102498 111088395 111095941 111114180 111130953 111141777 111149991 111167860
3830.4 111167860 111186182 111179698 111160517 111157584 111172855 111195278 111208904 111211824 111232436 111290026 111341155 111312473
3854.8 111312473 111260498 111241174 111238337 111231267 111235011 111261225 111265719 111234617 111208940 111211324 111229587 111221302 111194646
3881.4 111194646 111183894 111165738 111155391 111171532 111179316 111189973 111209750 111203420 111185122 111169660 111143100 111125398
3905.8 111125398 111122310 111129177 111143863 111150897 111159039 111174846 111174619 111157227 111142576 111141586 111140466 111131561 111129904 111139214
3934.4 111139214 111152864 111158931 111156666 111154711 111146176 111133504 111126423 111129653 111143970 111143291 111111581 111075401 111051869
3960.9 111051869 111038637 111033320 111030555 111033416 111039460 111031818 111014247 111002696 110994804 110985041 110977733 110974538 110963285
3987.4 110963285 110941947 110913861 110883331 110868967 110873425
3997.6 110873425
##END=$$ End of the data block
