##TITLE=DI 15-0770426-9 Euroquat HC 47LA $$ Begin of the data block
##JCAMP-DX=5.00 $$ ACD/SpecManager v 10.08
##SPECTROMETER/DATA SYSTEM=Alpha
##DATE=15 May 2015 09:44:38
##DATA TYPE=INFRARED SPECTRUM
##DATA CLASS=XYDATA
##ORIGIN=
##OWNER=
##NPOINTS=1667
##FIRSTX=599.64648438
##LASTX=3997.64306641
##MAXX=3997.64306641
##MINX=599.64648438
##MAXY=1.00753081
##MINY=0.45492882
##XFACTOR=1.0000000000
##YFACTOR=0.000000010000000
##FIRSTY=1.00000000
##DELTAX=2.03961372
##XUNITS=1/CM
##YUNITS=ARBITRARY UNITS
##XYDATA=(X++(Y..Y))
599.6A00000000k20549k18332j78003j26648q1045r3722j61010j67584q5301k4068
620I8643738p611M7910R1779K9516n0056n4282k9331j431K8450N3382N7190J2154m9413
646.6I8771995o8134m7576l6258m2051m9180m4804n1755j10054j95116k29019r9718
669I7798330j5206p9995j30188j35011r0998n8109n9456o6626p6419o6024o5768r0491
693.5I6864039j09011j33163j59174j70285j75374j94890k48408l21376l75820m38612
713.9I4537926n61852o69127n62245j78003K63142N36335O02496N57565N01096M45420
734.3I5472753M03929L84807L36856K68823K32166K01285J63311J35165J00964O6990
754.7I7767049N7060N9402O0904O2072O2990P1973R3132J04785R0432R7996J32012
$$ y = [100000000, 99779451, 99561119, 99383116, 99256468, 99175423, 99081701, 98920691, 98753107, 98667806, 98643738, 98636127, 98684037, 98775816, 98805332, 98755276, 98700994, 98671663, 98670232, 98698682, 98752064, 98809254, 98821408, 98771995, 98703861, 98656285, 98620027, 98577976, 98528796, 98483992, 98432237, 98322183, 98127067, 97898048, 97798330, 97783124, 97703129, 97572941, 97437930, 97346932, 97288823, 97229367, 97162741, 97086322, 97020298, 96954530, 96864039, 96755028, 96621865, 96462691, 96292406, 96117032, 95922142, 95673734, 95352358, 94976538, 94537926, 93976074, 93306947, 92744702, 92566699, 92829841, 93366176, 93968672, 94526237, 95027333, 95472753, 95876682, 96261489, 96598345, 96867168, 97099334, 97300619, 97463930, 97599095, 97700059, 97767049, 97824109, 97883511, 97944415, 98006487, 98069477, 98141450, 98234582, 98339367, 98429799, 98527795, 98659807]
777.1I8659807J35512J17385J03468J07532J22786J04761O6918N3168N2344O0285O7889
799.5I9651855O2734N2184L1149J9813K0373L0035O0373P1484J25897J02973R6321
822A00325191R6059Q7786P0118O3897O7913M2117n996m9246p4875o9320q4710j27411
846.4A00341523j21451p3182l2831j0836q678j4508j5068k3484m1485l3522l4117k1315
870.9I9911046j729L0071N1898Q714p1317j62655k99293m80085o49870p56282p41422
893.4I6839076n64438k55245P5376L09837L94797L61115K92778K50572K35862K26849
913.7I8166579K13611J80042J17373N3043J7184J4549M1783Q5568J18167J21611J00881
936.2I9230391P5578O2490O6817Q3166R8640R6649R0790R6398P7874K1207j6379p7004
$$ y = [98659807, 98795319, 98912704, 99016172, 99123704, 99246490, 99351251, 99418169, 99471337, 99523681, 99583966, 99651855, 99714589, 99766773, 99797922, 99817735, 99838108, 99868143, 99928516, 100000000, 100125897, 100228870, 100325191, 100421250, 100509036, 100579154, 100643051, 100710964, 100753081, 100747085, 100697839, 100622964, 100553644, 100468934, 100341523, 100220072, 100146890, 100114059, 100103223, 100094545, 100080037, 100064969, 100041485, 100000000, 99966478, 99932361, 99911046, 99909317, 99939388, 99991286, 100000000, 99928683, 99766028, 99466735, 98986650, 98336780, 97580498, 96839076, 96274638, 96019393, 96094769, 96404606, 96799403, 97160518, 97453296, 97703868, 97939730, 98166579, 98380190, 98560232, 98677605, 98730648, 98747832, 98762381, 98804164, 98889732, 99007899, 99129510, 99230391, 99305969, 99368459, 99435276, 99518442, 99617082, 99713731, 99804521, 99900919, 99978793, 100000000, 99983621, 99906617]
960.7I9906617j32191j68633j87111j95873j92082j91420k19721k46691k31469j98341
981.1I7943085j58250r6810l2252L3039J04231J55186J79285J98144K22152K31225
1001.5I8779035K04277J39063M6975k2823m4829l0011J1772K9010j7929j00786j90931
1023.9I8802823k86323l71081m15194m16535m05294l87847l51441l05444k57271j99515
1044.3I5406878j24556m0155L6054R3097J13851R3120N2404J0580k1726m7838p1812
1066.7I5499897q4591p7718o0970n0807m6045m2569l0691j3792j5474l7384o6882j04588
1091.2I4868386j48177j79923j94192j97583j91051j81592j88112k10714k26993k21788
1111.6I2928261j98997j78122j58244j11765k7555R5361K45726L77655M47435M43226
$$ y = [99906617, 99774426, 99605793, 99418682, 99222809, 99030727, 98839307, 98619586, 98372895, 98141426, 97943085, 97784835, 97688025, 97655773, 97688812, 97793043, 97948229, 98127514, 98325658, 98547810, 98779035, 98983312, 99122375, 99169350, 99146527, 99101698, 99071687, 99083459, 99112469, 99094540, 98993754, 98802823, 98516500, 98145419, 97730225, 97313690, 96908396, 96520549, 96169108, 95863664, 95606393, 95406878, 95282322, 95242167, 95278221, 95371318, 95485169, 95578289, 95630693, 95641273, 95619547, 95571709, 95499897, 95415306, 95337588, 95276618, 95225811, 95179766, 95137197, 95106506, 95092714, 95077240, 95039856, 94972974, 94868386, 94720209, 94540286, 94346094, 94148511, 93957460, 93775868, 93587756, 93377042, 93150049, 92928261, 92729264, 92551142, 92392898, 92281133, 92253578, 92348939, 92594665, 92972320, 93419755, 93862981]
1132I3862981L90172L35228K92319K46304K08706J90747J76024J56254J26648Q7917
1152.4I6073300N8561L5662J1670N418K4444O6173J25724J79804J94567J66947J26970
1174.8I7069240Q1813K5576k3985n9247r5009j27340j55705j92559k15781j87385j31833
1197.3I5987785j17564j53774j93704k07972j88917j33461o8152k2417n245k6506q2940
1219.7I4787133j45501j85049j92684j74760j47528j21599j08683j04607r8526r8604
1240.1I3409592j06359j20496j38992j40286r8252k4146M3660O9529N0205J8615L689
1262.5I2966759J1695L0392L8767K6518J0157K366o127k6036n1266o4939n9003l6424
1287I2842859q613r95k9582q0818j39683j99986k51913k89369l27170l53980l59505
$$ y = [93862981, 94253153, 94588381, 94880700, 95127004, 95335710, 95526457, 95702481, 95858735, 95985383, 96073300, 96131861, 96167523, 96179193, 96184611, 96209055, 96275228, 96400952, 96580756, 96775323, 96942270, 97069240, 97151053, 97176629, 97152644, 97093397, 96998388, 96871048, 96715343, 96522784, 96307003, 96119618, 95987785, 95870221, 95716447, 95522743, 95314771, 95125854, 94992393, 94924241, 94901824, 94896579, 94870073, 94787133, 94641632, 94456583, 94263899, 94089139, 93941611, 93820012, 93711329, 93606722, 93508196, 93409592, 93303233, 93182737, 93043745, 92903459, 92805207, 92781061, 92824721, 92894250, 92944455, 92963070, 92966759, 92978454, 93008846, 93047613, 93074131, 93084288, 93086654, 93080527, 93054491, 93003225, 92938286, 92879283, 92842859, 92834246, 92833251, 92803669, 92722851, 92583168, 92383182, 92131269, 91841900, 91514730, 91160750, 90801245]
1309.4I0801245l93367m72581n74798p04670q35967r16206r20433q17937o10650l28731
1329.8H4225905l8695J46037J75768J25885R8735P8315L1846L0917J29933K90268M38833
1352.3H5733747N37628N69874M95190L52961K59262J88094M0603j17248k56586m68576
1372.7H7334949p04456q05860p74557p43919q84045j210147j564258j678383j563669
1391G7405655j504594j347595q63636k75922K64657P54219J280368J580047J530320
1409.4G8823519J332938J015610O41131L83318L22431K35230J62852K46167L35210
1427.7H3498406L65854K94918N6177j33628o8587M7225P5132Q5061L9703p5179k89846
1450.2H3895236o04731q68791r43237m95559o7288j84244l75509j36268N26076J253873
$$ y = [90801245, 90407878, 89935297, 89360499, 88655829, 87819862, 86903656, 85983223, 85165286, 84554636, 84225905, 84187210, 84333247, 84509015, 84634900, 84733635, 84811950, 84843796, 84874713, 85004646, 85294914, 85733747, 86271375, 86841249, 87336439, 87689400, 87948662, 88136756, 88177359, 88060111, 87803525, 87334949, 86630493, 85824633, 85050076, 84306157, 83422112, 82211965, 80647707, 78969324, 77405655, 75901061, 74553466, 73689830, 73413908, 73678565, 74432784, 75713152, 77293199, 78823519, 80156457, 81172067, 81813198, 82196516, 82518947, 82754177, 82917029, 83163196, 83498406, 83864260, 84159178, 84215355, 84081727, 84013140, 84060365, 84135497, 84220558, 84260261, 84185082, 83895236, 83290505, 82421714, 81478477, 80982918, 80915630, 80731386, 80355877, 80219609, 80745685, 81999558]
1470.6H1999558J805467J400458N54020O8813j76155k48635j76764M4066N94813J271230
1491H7136871J338976J134891J094102R45193N86152J67513k29490k61545O9869O389
1511.4I1988921k51043m86743n83458o11150o86652o28477o09958o98656p42597q96114
1531.8H5794073j043826r16600r77493j318585j068545o14291n00632m81593m50516
1550.1G8421992l34299k40623k18595M6045P32356P08598N19324M83644N05238O29318
1570.5H1252998N03826K83593L16662L04627Q5277j24556k88075m56548o34235q13926
1590.9H0429643r92530j178146j356244j546406j775587j992804k167332k345794k502662
1609.3F4572138k498794k368057k449357k554655k008593j657254j631695j339549
$$ y = [81999558, 83805025, 85205483, 85759503, 85828316, 85652161, 85403526, 85226762, 85270828, 85865641, 87136871, 88475847, 89610738, 90704840, 91650033, 92236185, 92403698, 92174208, 91912663, 91982532, 91988921, 91737878, 91251135, 90667677, 90056527, 89369875, 88741398, 88131440, 87432784, 86690187, 85794073, 84750247, 83833647, 82856154, 81537569, 80469024, 79854733, 79354101, 78872508, 78421992, 78087693, 77847070, 77628475, 77674520, 78406876, 79115474, 79634798, 80118442, 80623680, 81252998, 81756824, 82040417, 82357079, 82661706, 82746983, 82622427, 82334352, 81877804, 81243569, 80429643, 79437113, 78258967, 76902723, 75356317, 73580730, 71587926, 69420594, 67074800, 64572138, 62073344, 59705287, 57255930, 54701275, 52692682, 51035428, 49403733, 48064184]
1625.6D8064184r94316p34347n10859l31780L3989M12500M90135N30592N86167R15300
1646D8461565J272321J006022J356399K607614K225584J817888K092534K619785K814895
1664.3F6274607K382344K423740K763980K334690K094376K107972J635260J204818
1680.7H3221787J147527J558089J428217R75799Q31497O01017M26573L98499M16386
1699I1005391N59950M99087L48348L82602L58176K28912R4455L7265K36923M89425
1719.4I4240534M29666L01767K60704J91892J16992O8110J73885L96931L28999K23607
1739.8I6733087K29210K24614J59615J02079J65069L01981K59412J36155R9134Q6522
1760.2I8496878J19257J60605Q0502k5934n9962K9224J85507J74737Q0902M5693O0749
$$ y = [48064184, 47069868, 46335521, 45824662, 45492882, 45526871, 45939371, 46429506, 46960098, 47546265, 48461565, 49733886, 50739908, 52096307, 54703921, 56929505, 58747393, 60839927, 63459712, 66274607, 68656951, 71080691, 73844671, 76179361, 78273737, 80381709, 82016969, 83221787, 84369314, 85927403, 87355620, 88331419, 89162916, 89763933, 90190506, 90589005, 91005391, 91565341, 92064428, 92412776, 92795378, 93153554, 93382466, 93476921, 93514186, 93751109, 94240534, 94670200, 94971967, 95232671, 95424563, 95541555, 95609665, 95783550, 96180481, 96509480, 96733087, 96962297, 97186911, 97346526, 97448605, 97613674, 97915655, 98175067, 98311222, 98410356, 98496878, 98616135, 98776740, 98857242, 98831308, 98771346, 98800570, 98986077, 99160814, 99241716, 99287409, 99348158]
1782.6I9348158O7800N7727j3584j04725j7584J19234P9190j263J7559Q8412Q6653
1805.1I9727577J8340l1691J066O0279N5313K2310J2183j2410n1760m6915l1203j7762
1829.6I9705327P0172R8872K9719J723p838p5770j02305K3049J11711Q9443M1979O640
1854I9992722m130p224p952q016k8629q7350q2630M9442J15049O0051Q667k116n60
1880.5I9997324J275n877k9671m6778l832K7770J0734J8090K3950M529l826n794k1881
1907.1I9966013k2935J1360K4778k3097o0576j9479J2487J4252L8182L5155O306n132
1931.5I9977314l862l302j1081l7658n3566j0556L6996L1573M118j1509o169M148j514
1958.1I9914932j0770j3799k8157l0881L582K1488M893n323m679m76n538j8656k6256
$$ y = [99348158, 99415958, 99473685, 99460101, 99355376, 99337792, 99457026, 99536216, 99534953, 99552512, 99640924, 99727577, 99745917, 99714226, 99715292, 99775571, 99830884, 99853194, 99865377, 99852967, 99801207, 99754292, 99723089, 99705327, 99775499, 99874371, 99904090, 99905813, 99897975, 99822205, 99719900, 99742949, 99854660, 99944103, 99986082, 99992722, 99988592, 99981368, 99973416, 99965400, 99936771, 99849421, 99766791, 99816233, 99931282, 99991333, 100000000, 99997884, 99997324, 99998599, 99992722, 99963051, 99916273, 99912441, 99940211, 99950945, 99969035, 99992985, 99997514, 99993688, 99987894, 99966013, 99943078, 99954438, 99979216, 99956119, 99895543, 99876064, 99888551, 99902803, 99940985, 99976140, 99982446, 99977314, 99973452, 99970150, 99959069, 99921411, 99867845, 99857289, 99894285, 99925858, 99929976, 99918467, 99912298, 99916446, 99914932, 99904162, 99890363, 99862206, 99831325, 99834907, 99856395, 99861288, 99855965, 99851286, 99850810, 99845272, 99826616, 99800360]
1984.6I9800360k7716k6697k4116k760J6940N364j0341j3751j8435k1196j5294j0366
2009I9651992j4102k4307l8707l1924m572n889k0164j6392j2004j2135j2428j6302
2033.5I9443066j7077j8203k2644j7392j7536k5541k3615j4055o008q732k0927k5290
2058I9226046k0260k3067k7692j9247q446o508j0509j8358j9026j3745j6749k0241
2082.5I9022198j4735o818r597k0247k2459j7119j6242j4281n621j466o813j6195j8894
2109I8851711j2696q387q320q727p832l516L99k86m703n841n370j1152j2476m041J61
2139.6I8758924j067L797J0401J2571J2838J2011Q720O932R650P909J395J800J0532
2166.1I8856413J4383R173P951J5617J8823J4108J3906J4442R513Q244J2195J5884
$$ y = [99800360, 99772644, 99745947, 99721831, 99719071, 99736011, 99741375, 99731034, 99717283, 99698848, 99677652, 99662358, 99651992, 99637890, 99613583, 99574876, 99542952, 99538380, 99532491, 99512327, 99495935, 99483931, 99471796, 99459368, 99443066, 99425989, 99407786, 99385142, 99367750, 99350214, 99324673, 99301058, 99287003, 99280995, 99272263, 99251336, 99226046, 99205786, 99182719, 99155027, 99135780, 99127334, 99120826, 99110317, 99091959, 99072933, 99059188, 99042439, 99022198, 99007463, 99000645, 98991048, 98970801, 98948342, 98931223, 98914981, 98900700, 98895079, 98893613, 98886800, 98870605, 98851711, 98839015, 98830628, 98822308, 98813581, 98805749, 98802233, 98802632, 98802346, 98797643, 98791802, 98786432, 98775280, 98762804, 98758763, 98758924, 98757857, 98761654, 98772055, 98784626, 98797464, 98809475, 98818195, 98825127, 98834777, 98842686, 98844081, 98845881, 98856413, 98870796, 98879969, 98887920, 98903537, 98922360, 98936468, 98950374, 98964816, 98974329, 98982573, 98994768, 99010652]
2190.6I9010652J7202J4597J0652J0222J5443K1744K3353K2424K0516J3458Q893J5879
2215I9205035K2167J8287J3667J2600J3256J8025K5916K8485K2584J8102J5599J4055
2239.5I9427778J8912J8960J3340J1504O926R29M590J3453J3649P934J1378J4359P719
2266I9571431L391N186J3572J8763J3060O962J0174J3459L993n781j1480j9300k0468
2292.5I9602962j6177j8871k7561k7991j9311k3103m0996n0581m1133k7352l3314n4508
2317I9222064o4409n7405m6939l6055k3579j0729m71R120L916j7625j4520k027N818
2343.5I8967159N3280Q5402K9701p4864j42002j14441o0033k2799J3411L5560O8557
2366I8838931R9063R0051Q8471J18780J37657J28114J19943J12760Q9306N7953K6006
$$ y = [99010652, 99027854, 99042451, 99053103, 99063325, 99078768, 99100512, 99123865, 99146289, 99166805, 99180263, 99189156, 99205035, 99227202, 99245489, 99259156, 99271756, 99285012, 99303037, 99328953, 99357438, 99380022, 99398124, 99413723, 99427778, 99446690, 99465650, 99478990, 99490494, 99497420, 99498349, 99502939, 99516392, 99530041, 99537975, 99549353, 99563712, 99571431, 99574822, 99580008, 99593580, 99612343, 99625403, 99632365, 99642539, 99655998, 99659991, 99654210, 99642730, 99623430, 99602962, 99586785, 99567914, 99540353, 99512362, 99493051, 99469948, 99428952, 99378371, 99337238, 99309886, 99276572, 99222064, 99157655, 99100250, 99053311, 99017256, 98993677, 98982948, 98982477, 98991597, 98995513, 98977888, 98963368, 98961341, 98967159, 99020439, 99105841, 99135542, 99060678, 98918676, 98804235, 98744202, 98721403, 98734814, 98770374, 98838931, 98937994, 99028045, 99116516, 99235296, 99372953, 99501067, 99621010, 99733770, 99823076, 99881029, 99907035]
2388.4I9907035L063k896q11K724J716j949J91O473M661n430r900q506l141L135M447
2419I9900812K038m553j2464q601J705J49m107j865J13n055q988j168J263n519k217
2449.6I9851543N543L135k044k057J31J139l6k545q285j3274j3179j4066j7566j1682
2478.1I9776757J502N66j1337j6349j3829j0782j4079j3470m584l308o515j0514k0444
2504.7I9653614k5005j6987q243j1319k0707k8878k7913j6630q648n550o449r006r966
2531.2I9458313j3047j1653m107j341r191j9640j4508K653R888M840n877j2672j2123
2557.7I9371535j1468j0550j0151j0854j2440j6152j9825j6105o294n299j5032j6881
2582.2I9220484m959j275j1039j6600j3757j2159j1563n394j264p981j8710k3526k2018
$$ y = [99907035, 99910098, 99907202, 99906391, 99909115, 99910831, 99908882, 99909073, 99915546, 99920207, 99914777, 99904877, 99896371, 99893230, 99896365, 99900812, 99902850, 99898297, 99885833, 99877232, 99878937, 99879086, 99874979, 99873114, 99873227, 99868172, 99859184, 99858016, 99859279, 99853760, 99851543, 99857086, 99860221, 99858177, 99856120, 99856251, 99857390, 99857354, 99854809, 99846524, 99833250, 99820071, 99806005, 99788439, 99776757, 99778259, 99778825, 99767488, 99751139, 99737310, 99726528, 99712449, 99698979, 99694395, 99691087, 99684572, 99674058, 99653614, 99628609, 99611622, 99603379, 99592060, 99571353, 99542475, 99514562, 99497932, 99489284, 99483734, 99477285, 99468279, 99458313, 99445266, 99433613, 99429506, 99428165, 99418974, 99399334, 99384826, 99387479, 99397367, 99402207, 99396330, 99383658, 99371535, 99360067, 99349517, 99339366, 99328512, 99316072, 99299920, 99280095, 99263990, 99257696, 99252397, 99237365, 99220484, 99215525, 99214250, 99203211, 99186611, 99172854, 99160695, 99149132, 99143738, 99142474, 99134493, 99115783, 99092257, 99070239]
2608.7I9070239j7184j4740j7935k2191k5249k7555k6321j8144q702j1146k1678k3693
2633.2I8835701j7572j2844j1141j1080j1259p540r132k1690l0494l0619k2667j5253
2657.6I8634410k3019l5108l0565j6624j6206k5487k6858k0796j8239j5932k855P122
2682.1I8409843K987J2N269P724n436j6617r203o664j1098j0938k2876m3726m2635
2708.6I8256642k3246k6095m8834m7499l1394l8654o1243o5846m1210j6219j4329j9878
2733.1I7822195k1136k2715k0337j5587j8531l2818m5574l2627q339j0580l0917m1222
2757.6I7521812m4257m5889m3679m2861m9836o2728p7235q4126o6322m7505n8616p8320
2782I6820438r2346j14500j27649j00601o7175p6639j17606j30820r8885r1093j24252
$$ y = [99070239, 99053055, 99038315, 99020380, 98998189, 98972940, 98945385, 98919064, 98900920, 98892218, 98881072, 98859394, 98835701, 98818129, 98805285, 98794144, 98783064, 98771805, 98764265, 98755133, 98733443, 98702949, 98672330, 98649663, 98634410, 98611391, 98576283, 98545718, 98529094, 98512888, 98487401, 98460543, 98439747, 98421508, 98405576, 98402721, 98409843, 98412830, 98412842, 98418111, 98425835, 98420399, 98403782, 98394579, 98387915, 98376817, 98365879, 98343003, 98299277, 98256642, 98233396, 98207301, 98158467, 98110968, 98079574, 98040920, 97979677, 97913831, 97872621, 97856402, 97842073, 97822195, 97801059, 97778344, 97758007, 97742420, 97723889, 97691071, 97645497, 97612870, 97604531, 97593951, 97563034, 97521812, 97477555, 97431666, 97387987, 97345126, 97295290, 97232562, 97155327, 97071201, 97004879, 96957374, 96898758, 96820438, 96728092, 96613592, 96485943, 96385342, 96318167, 96241528, 96123922, 95993102, 95894217, 95803124, 95678872]
2804.5I5678872j53852j71280j69938j62673j79142j99473k11114k35676k69610k93076
2824.9I3633038l13324l61007m43942n55312p25049r99004j380688j912397k665496
2843.2H4276819l513312m117799m088318l109330j230705Q70484K352047K946889K901537
2861.6G7288312K458608J760399R99415M07052J79011L32546N76597N81831L34639
2879.9H4918410J5163k61551m62771o08611p26920q20655q82834r10842r43333j027245
2900.3G8288811j156556j316488j545691j902390k390158k955008l492117l809338
2916.7E9721065l657264k890795j603258j19639J187617K113044K655709K937615L037816
2935F3381910K961094K722537K348709J876503J351351P81393J86157l04776m83865
$$ y = [95678872, 95525020, 95353740, 95183802, 95021129, 94841987, 94642514, 94431400, 94195724, 93926114, 93633038, 93319714, 92958707, 92514765, 91959453, 91234404, 90235400, 88854712, 86942315, 84276819, 80763507, 76645708, 72557390, 69448060, 68217355, 69087839, 71439886, 74386775, 77288312, 79746920, 81507319, 82506734, 82913786, 83092797, 83425343, 84001940, 84583771, 84918410, 84933573, 84672022, 84209251, 83600640, 82873720, 82053065, 81170231, 80259389, 79316056, 78288811, 77132255, 75815767, 74270076, 72367686, 69977528, 67022520, 63530403, 59721065, 56063801, 53173006, 51569748, 51450109, 52637726, 54750770, 57406479, 60344094, 63381910, 66343004, 69065541, 71414250, 73290753, 74642104, 75423497, 75609654, 75304878, 74821013]
2953.4G4821013k57325K42013P89439J243884J556551J719398J722401J568240J328009
2971.7H4733623J083809Q66896O87296N52672M59867L81828K97838K16830J45555J02162
2992.1H9528376R0366P4184N4831M1318J5592j0854l9738q7935j32048j36161j08910
3014.5H9289021j06853j34629j44124j42729j47921j44911j41000j39744j30826j17111
3034.9H7939173j15889j48112j84113j84184j65612j70922k06601k26051k18630k10273
3055.3H6108786j90860j76430j93894k10512k11304j84214j32805j19060j50401j87033
3075.7H4352273j86861j30760p4137n9682n1099l7682l1519j4371q761l5620o3271
3098.2H3658510m9400j0460k1840p6949r9075p5317p9059j40894j79368j58363j19442
$$ y = [74821013, 74563688, 74805701, 75595140, 76839024, 78395575, 80114973, 81837374, 83405614, 84733623, 85817432, 86684328, 87371624, 87924296, 88384163, 88765991, 89063829, 89280659, 89426214, 89528376, 89618742, 89692926, 89747757, 89789075, 89804667, 89793813, 89754075, 89666140, 89534092, 89397931, 89289021, 89182168, 89047539, 88903415, 88760686, 88612765, 88467854, 88326854, 88187110, 88056284, 87939173, 87823284, 87675172, 87491059, 87306875, 87141263, 86970341, 86763740, 86537689, 86319059, 86108786, 85917926, 85741496, 85547602, 85337090, 85125786, 84941572, 84808767, 84689707, 84539306, 84352273, 84165412, 84034652, 83960515, 83900833, 83849734, 83812052, 83780533, 83766162, 83757401, 83721781, 83658510, 83609110, 83598650, 83576810, 83499861, 83400786, 83325469, 83246410, 83105516, 82926148, 82767785, 82648343]
3120.6H2648343r0265j01775j60253k12378k15494k07675k37852k73752k71523k47682
3141H0629694k41184k58255k83682l19791l46899l30502l08537l17300l31765l48455
3161.4G7543324l62742l60846l67213l85081l84170l78722l93558m04048l93670l87830
3181.8G3725444l95554l99882m03666l97289l73334l66831l78251l71331l49885l50475
3202.2F9938946l71611l75516l60041l54702l71241l84319l83437l85433l84695l85803
3222.6F6182148l95757l98492l99840m32992m57144m03255l39967l40766l65323l86101
3243F2262511m06360l83050l13955k83849l06130l13330k86442k62975k55949k49189
3263.4E9201282k51525k80726k99609k43199j68610j52885j54245j51241j51467j52612
$$ y = [82648343, 82558078, 82456303, 82296050, 82083672, 81868178, 81660503, 81422651, 81148899, 80877376, 80629694, 80388510, 80130255, 79846573, 79526782, 79179883, 78849381, 78540844, 78223544, 77891779, 77543324, 77180582, 76819736, 76452523, 76067442, 75683272, 75304550, 74910992, 74506944, 74113274, 73725444, 73329890, 72930008, 72526342, 72129053, 71755719, 71388888, 71010637, 70639306, 70289421, 69938946, 69567335, 69191819, 68831778, 68477076, 68105835, 67721516, 67338079, 66952646, 66567951, 66182148, 65786391, 65387899, 64988059, 64555067, 64097923, 63694668, 63354701, 63013935, 62648612, 62262511, 61856151, 61473101, 61159146, 60875297, 60569167, 60255837, 59969395, 59706420, 59450471, 59201282, 58949757, 58669031, 58369422, 58126223, 57957613, 57804728, 57650483, 57499242, 57347775, 57195163]
3283.8E7195163j54054j57327j80262j92195j54096r8408p2705r6178j48905j80536
3304.2E5760497j61439j04589o3866p3004j03271j20628j25366j35475j44166j36626
3324.6E4592067j25182j30182j41549j38855j34856j35755j42169j53363j54084j56683
3345E3179389j53267j31899j40018j71881j65272j31637j20169j31452j27620q8918
3365.4E1817256o4009r9468j58251j62554j13052q6772r7209j06204r4604o3056j1033
3387.8E0761044L4761J0545o2728o6853K4658P5502l058q5020l8689M9847P1335M7850
3412.3E0819194K5595J8775M1074P3838Q6146J07074J42992J61481J51473J46210J57249
3434.7E1931101J33556Q5014Q5074J22851J57207J96141K08593J89864J92494K17610
$$ y = [57195163, 57041109, 56883782, 56703520, 56511325, 56357229, 56258821, 56186116, 56089938, 55941033, 55760497, 55599058, 55494469, 55430603, 55357599, 55254328, 55133700, 55008334, 54872859, 54728693, 54592067, 54466885, 54336703, 54195154, 54056299, 53921443, 53785688, 53643519, 53490156, 53336072, 53179389, 53026122, 52894223, 52754205, 52582324, 52417052, 52285415, 52165246, 52033794, 51906174, 51817256, 51753247, 51653779, 51495528, 51332974, 51219922, 51133150, 51035941, 50929737, 50835133, 50772077, 50761044, 50795805, 50806350, 50743622, 50676769, 50701427, 50776929, 50773871, 50688851, 50650162, 50700009, 50771344, 50819194, 50844789, 50863564, 50904638, 50978476, 51064622, 51171696, 51314688, 51476169, 51627642, 51773852, 51931101, 52064657, 52149671, 52234745, 52357596, 52514803, 52710944, 52919537, 53109401, 53301895, 53519505]
3455.1E3519505K37292K44880K37769K54440L11339L41606K85477J96325J95426K63214
3475.5E6087273L22819L33953K99394L00378L39854L47739L38531L57860L89463M05347
3495.9E9522611L89731L74704L96520M06403L74484L83693M60970N09256M81159M43011
3516.3F3742542M38625M49973M86189N00888M81641N08571N41282N28663N33480N54424
3536.7F8766278N33980M99886M88663N11396N42361N33598N32121N66232N59026N20396
3557.1G4053937N13023M99559M28825M11952N84805P00688O06865N17434M95791N03356
3577.5G9316235N11443M76241L97349L88145N27209O03497M95190M38136M72956M85784
3597.9H4112185N02074N11771M36670L62092M06564M60434M42278M34518M13102M35131
$$ y = [53519505, 53756797, 54001677, 54239446, 54493886, 54805225, 55146831, 55432308, 55628633, 55824059, 56087273, 56410092, 56744045, 57043439, 57343817, 57683671, 58031410, 58369941, 58727801, 59117264, 59522611, 59912342, 60287046, 60683566, 61089969, 61464453, 61848146, 62309116, 62818372, 63299531, 63742542, 64181167, 64631140, 65117329, 65618217, 66099858, 66608429, 67149711, 67678374, 68211854, 68766278, 69300258, 69800144, 70288807, 70800203, 71342564, 71876162, 72408283, 72974515, 73533541, 74053937, 74566960, 75066519, 75495344, 75907296, 76492101, 77192789, 77799654, 78317088, 78812879, 79316235, 79827678, 80303919, 80701268, 81089413, 81616622, 82220119, 82715309, 83153445, 83626401, 84112185, 84614259, 85126030, 85562700, 85924792, 86331356, 86791790, 87234068, 87668586, 88081688, 88516819]
3618.3H8516819N47201N29319L57908K25461L43275N80114N41800M57543M30483L90464
3638.7I2920387L55953L07435J98596R1923J99127M95499N26714L83050L25435L12930
3659I6117049K89762K59936J77288O3050L0023J09237J12164J44041L16411L52466
3679.4I7971427K77794J75148L3218p0662M5646K69752K69735J52910P5251K8700L5148
3701.9I9264067Q7488M9019p0715j13469K4557J67304J26588J2428n1874m3076p302
3724.3I9445015K6715L4088m7737j83112j68526O7806J93739Q9860o2698r3162J6051
3746.7I9318039J0217n508J31840J55097N2351K9498R8056P6669k2882n2601j0103
3769.2I9780673O3306R5564K5779o2400n8162K5218N5278L4374K7406J2964j7786o1542
$$ y = [88516819, 89064020, 89593339, 89951247, 90176708, 90519983, 91100097, 91641897, 92099440, 92529923, 92920387, 93276340, 93583775, 93782371, 93874294, 94073421, 94568920, 95095634, 95478684, 95804119, 96117049, 96406811, 96666747, 96844035, 96907085, 96937108, 97046345, 97158509, 97302550, 97618961, 97971427, 98249221, 98424369, 98457587, 98386925, 98432571, 98702323, 98972058, 99124968, 99200219, 99228919, 99264067, 99351555, 99400574, 99329859, 99216390, 99240947, 99408251, 99534839, 99547267, 99495393, 99452317, 99445015, 99471730, 99505818, 99458081, 99274969, 99106443, 99174249, 99367988, 99457848, 99395150, 99301988, 99318039, 99328256, 99322748, 99454588, 99609685, 99662036, 99691534, 99789590, 99866259, 99843377, 99790776, 99780673, 99843979, 99939543, 99965322, 99902922, 99844760, 99869978, 99925256, 99959630, 99987036, 100000000, 99982214, 99920672]
3793.7I9920672r6315q4686p4566l6257P0858P5865N8770R4986M5407q1110j42014
3816.1I9751610j05513p7831N2243J61123R0707J7637k2942p3940j04385j00613k7692
3838.5I9560404Q0764J13887J00892O2758m2754j78021j77706P2712J88273J00988
3858.9I9882197j6570r2911n0784j353m3654j7911O8581R9736N1856o5291p7021k193
3883.4I9734682K8395O0523J8805j5574N9479M4727q7302j41377o4760L1334J17886
3905.8I9786818J33848O8683J0651k9826o2514m1180J4603K6214J2147K4593P189m5813
3930.3I9905413l4767L4654M7064J1235q356j2434o818j9896k8694J3578N1462M2332
3954.8I9994773N227k8008k9236K855K6703R817j7292k0504m273N990K605Q010O181
$$ y = [99920672, 99824357, 99739671, 99665105, 99628848, 99699706, 99775571, 99834341, 99929327, 99974734, 99893624, 99751610, 99646097, 99568266, 99620509, 99781632, 99872339, 99889976, 99867034, 99793094, 99688709, 99588096, 99560404, 99641168, 99755055, 99855947, 99918705, 99875951, 99697930, 99520224, 99592936, 99781209, 99882197, 99865627, 99772716, 99721932, 99720579, 99676925, 99659014, 99727595, 99827331, 99879187, 99813896, 99736875, 99734682, 99763077, 99823600, 99842405, 99826831, 99886310, 99931037, 99843735, 99702358, 99637598, 99668932, 99786818, 99920666, 99989349, 100000000, 99970174, 99907660, 99866480, 99881083, 99907297, 99919444, 99944037, 99951226, 99905413, 99870646, 99905300, 99952364, 99963599, 99955243, 99942809, 99935991, 99916095, 99887401, 99900979, 99952441, 99994773, 100000000, 99971992, 99942756, 99945611, 99972314, 99982131, 99964839, 99944335, 99940062, 99946052, 99948657, 99956667, 99962848]
3981.3I9962848j3458m125K4337K4622J645j6403r244K419
3997.6I9972641
$$ y = [99962848, 99949390, 99945265, 99969602, 99994224, 99995869, 99979466, 99970222, 99972641]
##END=$$ End of the data block
