##TITLE=DI 15-0770426-9 Euroglyc AMS $$ Begin of the data block
##JCAMP-DX=5.00 $$ ACD/SpecManager v 10.08
##SPECTROMETER/DATA SYSTEM=Alpha
##DATE=15 May 2015 09:44:38
##DATA TYPE=INFRARED SPECTRUM
##DATA CLASS=XYDATA
##ORIGIN=
##OWNER=
##NPOINTS=1667
##FIRSTX=599.64648438
##LASTX=3997.64306641
##MAXX=3997.64306641
##MINX=599.64648438
##MAXY=1.00183010
##MINY=0.51928812
##XFACTOR=1.0000000000
##YFACTOR=0.000000010000000
##FIRSTY=1.00000000
##DELTAX=2.03961372
##XUNITS=1/CM
##YUNITS=ARBITRARY UNITS
##XYDATA=(X++(Y..Y))
599.6 100000000 99925238 99838889 99764723 99738365 99729019 99687326 99631685 99572009 99510616 99469548 99455017 99445897
624.1 99445897 99399489 99342245 99319106 99298555 99269193 99256104 99252653 99244177 99231607 99221355 99194598 99134988
648.6 99134988 99074250 99022090 98979330 98968405 98963588 98915666 98832995 98753983 98609710 98381740 98288500 98238349
673.1 98238349 98119098 97962970 97791612 97598428 97387022 97173810 96958309 96741247 96544278 96372008
693.5 96372008 96195662 96001333 95816588 95665121 95554662 95468217 95377469 95273978 95144898 94947284
713.9 94947284 94636631 94223106 93843418 93739611 93996829 94447470 94901985 95292348 95619255 95903134
734.3 95903134 96176177 96438134 96667629 96875173 97074050 97256112 97413629 97545069 97663796 97775358
754.7 97775358 97862995 97917438 97953230 97996700 98049712 98078114 98080909 98109907 98173368 98233384 98271477 98298240
779.1 98298240 98328131 98371410 98442644 98529971 98610061 98687261 98765099 98838907 98926479 99025702 99100155 99143296
803.6 99143296 99187130 99261147 99350262 99406636 99417681 99418461 99430090 99433589 99416864 99402982 99407887 99439049 99503469
830.1 99503469 99593711 99713689 99843943 99936670 99979794 100002801 100032437 100063026 100079834 100084198 100078595 100054240
854.6 100054240 100000000 99925274 99765742 99544197 99288809 99011743 98732811 98496646 98343563 98292595
875 98292595 98353845 98506242 98713809 98949379 99178302 99363291 99499607 99602461 99662119 99685568 99702626
897.4 99702626 99710310 99696946 99659270 99587107 99472922 99313909 99112135 98884606 98673612 98535740 98487431
919.9 98487431 98495597 98539925 98626310 98764980 98938924 99112415 99285656 99468148 99653006 99825650 99972075
942.3 99972075 100086629 100157726 100183010 100175798 100142026 100092256 100047278 100000000 99986774 99930608 99823880 99664950
966.8 99664950 99448806 99178296 98884642 98621851 98431557 98313099 98251635 98240727 98253107 98240864 98188007
989.2 98188007 98129928 98100477 98111969 98180401 98308605 98475182 98646933 98797840 98923910 99027067 99105299
1011.6 99105299 99143523 99115539 99024409 98897159 98738348 98531747 98272711 97986752 97715735 97495139
1032 97495139 97331822 97190577 97014177 96767366 96454704 96077871 95630014 95133889 94636303 94176996
1052.4 94176996 93765754 93405807 93107414 92839777 92557842 92259973 91956621 91651326 91367310 91142601
1072.8 91142601 91005135 90980864 91094232 91349602 91733253 92223012 92793870 93414402 94046736 94661927
1093.2 94661927 95245510 95795983 96322048 96825904 97299558 97724158 98072821 98324752 98464286 98491174
1113.6 98491174 98418444 98274696 98122436 98018718 97974497 97963047 97943425 97883523 97769678 97604859 97419465
1136.1 97419465 97271609 97210592 97241610 97327340 97421408 97473872 97441822 97309405 97066492 96717781 96305686
1158.5 96305686 95891374 95550388 95367378 95388955 95623273 96043825 96559632 97064650 97502118 97854298
1178.9 97854298 98111957 98279655 98386914 98455709 98481482 98466271 98416489 98329484 98201418 98040450 97872400
1201.3 97872400 97700846 97506213 97283763 97044927 96795195 96532649 96257704 95974112 95693594 95436889
1221.7 95436889 95219725 95046455 94906271 94773602 94637030 94489986 94330186 94175071 94038069 93912917
1242.1 93912917 93776250 93614286 93436229 93264037 93118608 93000662 92876261 92704517 92483014 92258185
1262.5 92258185 92087531 91998065 91981590 92009991 92062902 92119253 92155725 92165619 92147249 92101800 92044181 91983509
1287 91983509 91902387 91771108 91568494 91280484 90901482 90450251 89959782 89484894 89093643 88823265
1307.4 88823265 88663405 88555032 88421929 88210982 87896508 87491256 87061870 86663294 86323214 86077553
1327.8 86077553 85952801 85947621 86043417 86214578 86425179 86651957 86889809 87113327 87284327 87390351
1348.2 87390351 87439442 87450230 87438267 87405521 87357897 87272775 87106335 86902815 86720806 86524040 86285412
1370.6 86285412 85906106 85256910 84511620 83951670 83593327 83248609 82741314 81964016 81006038 80076146
1391 80076146 79087937 77946377 76859379 75905836 75149322 74653929 74374104 74402863 74797833 75508583
1411.4 75508583 76452029 77523750 78668469 79829800 80796993 81516856 81988347 82193440 82161838
1429.8 82161838 82030684 81950331 81865144 81802875 81932926 82202560 82512826 82803029 82977116 82976329 82821351
1452.2 82821351 82570100 82184607 81798935 81691778 81608844 81298566 81180125 81997085 83869529 86360508
1472.6 86360508 88276899 89316744 89995247 90543538 91024202 91447097 91802347 92044973 92179972
1491 92179972 92287898 92333001 92198980 91952360 91751158 91630185 91367048 90668494 90060544 89690340
1511.4 89690340 89307570 88808990 88186008 87506348 86631453 85708278 84864926 83938414 83097935 82252437
1531.8 82252437 81177765 80293763 79622149 78492284 77176744 76274711 75564331 74961603 74371493
1550.1 74371493 73831058 73391116 73052812 72453886 71540713 71098667 70769411 70281148 69599682 68694186
1570.5 68694186 67921752 67150247 65974319 64908457 64157259 63444436 62787724 62266630 61894345
1588.9 61894345 61670601 61583477 61609805 61733973 61936718 62178063 62420511 62648410 62826091 62909538
1609.3 62909538 62907523 62856716 62627715 62075579 61559558 61103445 60429949 59715092 59093702 58522135
1629.7 58522135 58125961 57810175 57290018 56811947 56614500 56542385 56573248 56701910 56983346 57536405
1650.1 57536405 58464825 59800154 61113101 62503529 64122230 65995449 67950815 69779205 71719062
1668.4 71719062 73792487 75622350 77390474 79186863 80788934 82275063 83782274 85383594
1684.7 85383594 86715871 87803608 88838190 89757842 90609717 91392404 92065531 92670333 93221885
1703.1 93221885 93729585 94199216 94630134 95054978 95461637 95813096 96085238 96326697 96598983 96864051
1723.5 96864051 97111404 97337925 97557247 97755897 97884601 97999591 98162669 98304760 98420101 98549014
1743.9 98549014 98669511 98774159 98847961 98918891 99014091 99107635 99188137 99258697 99311817 99377191 99457753
1766.3 99457753 99527347 99580747 99583441 99585247 99628007 99673629 99701244 99725485 99750334 99779850 99828136 99855852
1790.8 99855852 99844640 99855322 99899131 99920279 99912697 99910957 99921095 99935168 99944884 99942249 99939239 99948239 99955100
1817.3 99955100 99962753 99982011 100000000 100006759 100010681 100001204 99983072 99986100 99995208 99999112 100012004 100032997 100023341
1843.8 100023341 99995333 99988908 99994779 100000834 99998617 99990267 99983877 99980164 99975240 99982804 100000000 99999756 99981010 99979073
1872.4 99979073 99980623 99979740 99989051 99997997 99997830 99995029 99996454 99990219 99977380 99975967 99977392 99975216 99975425 99978030 99979669
1903 99979669 99978232 99973065 99964333 99956322 99954081 99952650 99936861 99915159 99907243 99903738 99899924 99893236 99878275 99862695
1931.5 99862695 99849814 99842161 99846071 99851817 99838102 99815220 99807441 99803925 99794930 99785930 99775130 99762589 99751616
1958.1 99751616 99739969 99728757 99720365 99705052 99686170 99675161 99663484 99651498 99646056 99636823 99615926 99594146
1982.5 99594146 99580562 99568588 99548465 99520469 99495620 99481100 99467242 99447024 99423498 99397123 99379796 99370563
2007 99370563 99348748 99316430 99291480 99272752 99243361 99207062 99180269 99163151 99144745 99117357 99086213 99062783
2031.5 99062783 99044669 99019426 98988855 98965961 98949248 98927593 98902512 98881787 98866266 98847318 98822647 98801285
2056 98801285 98784798 98764753 98735958 98701358 98674577 98664600 98655272 98634672 98610187 98588389 98567027 98541927
2080.4 98541927 98518145 98501182 98481977 98456162 98432946 98416024 98402822 98388177 98371404 98355377 98338103 98317003
2104.9 98317003 98300618 98293734 98283714 98264539 98244101 98231751 98227489 98222333 98207438 98190153 98180258 98171473 98161036
2131.4 98161036 98150843 98143286 98139775 98137760 98134977 98131943 98128957 98122323 98110360 98099720 98099804 98109215 98116452 98118722
2160 98118722 98124737 98132390 98134476 98133898 98133624 98134857 98142052 98153794 98159844 98160142 98161852 98168081 98180950 98193032 98195446
2190.6 98195446 98196763 98208940 98225343 98235166 98240644 98245490 98251617 98263544 98281252 98299736 98313433 98319370 98325568
2217.1 98325568 98339832 98358476 98374170 98380870 98380619 98384458 98398483 98415184 98428530 98444372 98464870 98481262
2241.6 98481262 98488706 98495519 98510396 98529994 98545355 98553097 98553032 98552203 98562473 98581761 98601049 98616123 98623925 98630816
2270.1 98630816 98648423 98667759 98674160 98676950 98690397 98709565 98721248 98723263 98726392 98734307 98739618 98738122 98735237
2296.6 98735237 98740298 98746657 98745525 98748994 98760313 98760659 98750412 98752952 98774844 98796648 98799378 98788399 98784131
2323.1 98784131 98802567 98830897 98840708 98845631 98869890 98897523 98916143 98916012 98894489 98868972 98841470 98847717 98907208
2349.7 98907208 98979795 99023545 99029690 99018246 99021137 99028176 99012083 98984742 98968720 98964685 98958337 98949212 98941064
2376.2 98941064 98942173 98960280 98985541 99004775 99020648 99038666 99053365 99061430 99059159 99044007 99026829 99019080
2400.6 99019080 99020016 99024963 99027228 99023163 99019802 99017006 99010032 99004126 99006200 99011058 99011505 99009925 99003166 98987621 98970860
2431.2 98970860 98961645 98969692 98989576 98992079 98973513 98960423 98961049 98957700 98944598 98939818 98948550 98953450 98941928
2457.8 98941928 98926795 98923218 98921299 98912948 98903471 98895651 98889339 98878670 98865187 98854125 98837441 98819095 98806345
2484.3 98806345 98793483 98780835 98767346 98747253 98724717 98705804 98692429 98682541 98667336 98645788 98621899 98595327
2508.7 98595327 98572630 98558789 98542559 98522043 98510534 98498499 98473358 98452228 98443425 98436064 98427582 98414731
2533.2 98414731 98395783 98380172 98367250 98347712 98325676 98313403 98310721 98306310 98291552 98262137 98227525 98205531
2557.7 98205531 98192906 98173231 98144829 98116630 98091274 98066324 98040134 98016769 97999495 97976202 97940743 97904402
2582.2 97904402 97871929 97841978 97812790 97784477 97759378 97731042 97701126 97677362 97656196 97636068 97608608 97566080
2606.6 97566080 97526151 97500801 97476888 97443980 97406697 97376293 97351730 97319460 97278094 97235048 97195381 97160673
2631.1 97160673 97124690 97084129 97043926 97013032 96995932 96980715 96954197 96917289 96877104 96832418 96781075 96736091
2655.6 96736091 96699947 96655500 96600389 96547848 96497774 96445930 96397996 96354675 96308154 96254069 96205258 96177977
2680.1 96177977 96172166 96174568 96166271 96144229 96120811 96099246 96077263 96055257 96037376 96026325 96013004 95985687
2704.5 95985687 95939386 95880556 95824844 95778656 95731539 95675051 95614004 95547563 95469904 95386183 95315439 95268553
2729 95268553 95231313 95192653 95154560 95126843 95109069 95082515 95037824 94970322 94891632 94830745 94791365 94748986
2753.5 94748986 94682932 94600219 94511390 94415480 94320577 94229645 94130135 94019097 93900204 93776542 93666220
2775.9 93666220 93567801 93454242 93322247 93175709 92990357 92761797 92541957 92353904 92144954 91878539
2796.3 91878539 91595298 91330665 91049272 90719217 90351045 89963216 89583075 89221251 88856560 88480723
2816.7 88480723 88105351 87737209 87376469 87028134 86684406 86316180 85899431 85398042 84741968 83842343
2837.1 83842343 82598037 80846047 78388661 75196570 71559501 68062699 65482205 64509135 65288335
2855.5 65288335 67324644 69932038 72591513 74928528 76673603 77738518 78256184 78561878 79003036
2873.8 79003036 79630274 80200624 80507183 80517292 80261588 79791462 79166412 78427100 77608210 76751465
2894.2 76751465 75885648 74995160 74044865 73008573 71842730 70475906 68813848 66759628 64261937
2912.6 64261937 61369008 58283257 55387634 53158510 51969010 51928812 52882099 54544067 56648910
2930.9 56648910 59016639 61505276 63962293 66243279 68233293 69841689 70992279 71627825 71739870
2949.3 71739870 71447223 71053231 70915407 71246219 72067213 73287457 74786663 76423252 78022546
2967.6 78022546 79452133 80665225 81660026 82455039 83078963 83576220 83990622 84333897 84604222
2986 84604222 84803897 84932882 85010785 85067469 85093099 85077214 85042655 84997755 84937197 84863818 84776086 84676093
3010.5 84676093 84586620 84531486 84501517 84466755 84411937 84329724 84229541 84129196 84015900 83877629 83720750
3032.9 83720750 83566266 83421874 83249801 83046794 82858622 82697970 82531905 82332265 82123595 81932622
3053.3 81932622 81739312 81535089 81331283 81126934 80916399 80697745 80501932 80354553 80221987 80070907
3073.7 80070907 79906011 79749757 79623836 79527915 79458791 79421020 79392612 79359126 79347104 79352933 79332978
3096.1 79332978 79279405 79229152 79207796 79189193 79134017 79060107 79007167 78941232 78816205 78675663 78569216
3118.6 78569216 78499168 78445148 78366637 78238094 78074497 77915746 77767140 77587038 77355242 77120876
3139 77120876 76939487 76788020 76611406 76388890 76123029 75839382 75596458 75408781 75214255 74973106
3159.4 74973106 74708807 74446392 74179959 73898888 73609561 73328465 73053855 72769195 72473043 72179532
3179.8 72179532 71896720 71612686 71316683 71021539 70739084 70469999 70210505 69947451 69676948 69406533
3200.1 69406533 69143546 68888694 68637943 68388140 68140525 67890191 67624050 67350936 67085820 66822815
3220.5 66822815 66552711 66281921 66015720 65736592 65421546 65103418 64839095 64607656 64365631 64113510
3240.9 64113510 63851076 63567948 63295132 63072622 62874842 62650001 62401879 62180597 61996943 61821997
3261.3 61821997 61640185 61453593 61261034 61070222 60914981 60797840 60693341 60594738 60497028 60400957
3281.7 60400957 60313207 60229969 60145634 60052484 59954977 59879464 59836990 59808898 59771591 59710664 59637022 59589589
3306.2 59589589 59583241 59595925 59604245 59592426 59564996 59537303 59515625 59497601 59475929 59451056 59425265 59400511
3330.7 59400511 59380466 59357452 59333974 59321910 59305054 59270924 59234005 59208131 59196937 59180832 59135848 59073180
3355.2 59073180 59024662 59001142 58983809 58966506 58969367 58985269 58970046 58901840 58825296 58790559 58780569 58764923
3379.6 58764923 58741927 58721018 58710241 58727998 58781105 58813810 58793300 58779806 58823436 58889985 58908987 58876300
3404.1 58876300 58861053 58892918 58949685 59005684 59037364 59056854 59094018 59139377 59189779 59263164 59358782 59471792
3428.6 59471792 59579265 59679520 59797698 59900635 59965128 60034961 60129070 60237807 60342950 60437483
3449 60437483 60552043 60682625 60816598 60973394 61151391 61314517 61468947 61661983 61873704 62051171
3469.4 62051171 62189847 62322676 62484598 62701577 62927967 63095838 63264346 63489282 63711804 63916844
3489.8 63916844 64149183 64402676 64648050 64891249 65152657 65398306 65609932 65860355 66152245 66429579
3510.2 66429579 66727835 67054838 67359984 67662430 67996234 68330830 68633133 68928075 69231600 69554555
3530.6 69554555 69925421 70313150 70658189 70995170 71393275 71820623 72190887 72491515 72835565 73232818
3551 73232818 73592466 73951519 74352103 74751627 75151426 75597936 76006931 76247400 76502073 76937622
3571.3 76937622 77407455 77819175 78206944 78596109 79017031 79487121 79904133 80158526 80446225 80887675
3591.7 80887675 81322211 81700075 82084590 82457113 82831055 83277404 83730590 84087056 84428859 84827006
3612.1 84827006 85244620 85703570 86091644 86362267 86741680 87286967 87832749 88143063 88360429 88762569
3632.5 88762569 89214128 89647055 90079421 90485495 90901059 91375649 91822499 92059231 92236036 92637831
3652.9 92637831 93076742 93383729 93692982 94056636 94411153 94776767 95145208 95415056 95647848 95937997
3673.3 95937997 96116370 96221238 96424305 96675527 96938783 97194892 97380435 97481281 97606033 97769433
3693.7 97769433 97922999 98066628 98194772 98278916 98356175 98479122 98612052 98685914 98682815 98713434 98815149
3716.2 98815149 98927939 99006450 99048114 99081099 99107271 99158400 99246389 99306965 99286336 99227655 99237597 99341136
3740.6 99341136 99442941 99455923 99476612 99521655 99469161 99379474 99373960 99405229 99415779 99436766 99489361 99535745
3765.1 99535745 99566603 99560273 99520779 99520010 99555326 99574745 99579060 99609047 99631989 99618775 99614823 99633563 99666387
3791.6 99666387 99701512 99713475 99738455 99778944 99774015 99781865 99787569 99738801 99730164 99786782 99830896 99822539 99832326
3818.1 99832326 99835140 99781132 99764985 99794614 99832731 99851859 99847072 99854267 99861389 99841332 99809831 99783218
3842.6 99783218 99773633 99795896 99880069 100000000 100000584 99861419 99820942 99867308 99917430 99937671 99946433 99979877
3867.1 99979877 99977899 99910468 99866182 99877095 99919498 99940598 99936372 99929398 99901253 99907738 99942505 99927700
3891.6 99927700 99905837 99929154 99967009 100000000 100003636 99956524 99915516 99917191 99930716 99941516 99956775 99963766
3916 99963766 99954998 99953824 99960917 99956667 99963295 99994558 100000763 99961966 99933118 99943388 99975467 100005352 100008869
3942.5 100008869 100001311 100000000 99992615 99990422 99999923 100003242 99985909 99955899 99936950 99936318 99948210 99963003 99973500
3969.1 99973500 99980819 99981034 99977106 99991482 100014162 100006998 99985796 99991977 100017393 100028396 100021231 100018573 100020885
3995.6 100020885 100017202
3997.6 100017202
##END=$$ End of the data block
