##TITLE=DI 15-0740623-3 $$ Begin of the data block
##JCAMP-DX=5.00 $$ ACD/SpecManager v 10.08
##SPECTROMETER/DATA SYSTEM=Alpha
##DATE=21 May 2015 14:09:38
##DATA TYPE=INFRARED SPECTRUM
##DATA CLASS=XYDATA
##ORIGIN=
##OWNER=
##NPOINTS=1667
##FIRSTX=599.64648438
##LASTX=3997.64306641
##MAXX=3997.64306641
##MINX=599.64648438
##MAXY=1.08088207
##MINY=0.16013537
##XFACTOR=1.0000000000
##YFACTOR=0.000000010000000
##FIRSTY=0.81958503
##DELTAX=2.03961372
##XUNITS=1/CM
##YUNITS=ARBITRARY UNITS
##XYDATA=(X++(Y..Y))
$$ plain form
599.6 81958503 80391818 78577667 76630801 74696743 72973114 71699911 71104860 71356827 72494990
618 72494990 74346310 76663178 79220676 81718671 83931839 85789764 87305391 88518679 89485329
636.4 89485329 90251684 90849525 91322643 91737521 92120749 92452544 92734951 92996216 93243134 93472248
656.8 93472248 93683767 93864977 94025898 94167757 94351107 94611901 94755834 94819683 94914740 95041072
677.2 95041072 95138025 95184433 95194042 95156431 95057803 94898242 94654566 94288588 93792057 93165809 92416257
699.6 92416257 91591370 90751177 89944029 89228964 88661134 88275808 88084322 88118434 88435364 89043498
720 89043498 89824510 90594411 91223687 91634464 91781563 91665500 91335970 90848953 90244359 89577353
740.4 89577353 88923013 88341784 87862706 87494975 87218148 86980164 86740273 86464131 86083770 85520321
$$ packed form
599.6H1958503j566685j814151j946866j934058j723629j273203n95051K51967J138163
618G2494990J851320K316868K557498K497995K213168J857925J515627J213288R66650
636.4H9485329P66355N97841M73118M14878L83228L31795K82407K61265K46918K29114
656.8I3472248K11519J81210J60921J41859J83350K60794J43933O3849R5057J26332
677.2I5041072R6953M6408R609l7611r8628j59561k43676l65978m96531o26248p49552
699.6I2416257q24887q40193q07148p15065n67830l85326j91486L4112L16930O08134
720H9043498P81012P69901O29276M10777J47099j16063l29530m87017o04594o67006
740.4H9577353o54340n81229m79078l67731k76827k37984k39891k76142l80361n63449
$$ plain form
760.8 85520321 84727466 83669728 82316595 80688256 78821778 76778102 74695879 72748286 71084118
779.1 71084118 69809133 68966985 68516749 68357986 68400407 68627965 69067711 69760424 70719260 71843207
799.5 71843207 72891545 73571306 73700958 73372805 72936225 72740322 72920388 73344105 73733652 73889631
819.9 73889631 73755956 73344082 72747856 72143656 71698779 71469420 71292371 70868504 70013237 68878931
840.3 68878931 67978710 67927104 69112939 71506184 74689108 78084421 81210905 83825791 85902375
858.7 85902375 87507576 88728642 89657748 90347493 90758127 90813041 90458709 89618689 88194382 86135280
879.1 86135280 83514762 80666417 78271884 77159530 77857876 80249316 83613336 87033629 89853090
897.4 89853090 91844690 93084317 93756109 94029999 94021749 93798655 93384159 92756885 91880238 90711272
$$ packed form
760.8H5520321p92855j057738j353133j628339j866478k043676k082223j947593j664168
779.1G1084118j274985q42148m50236j58763M2421K27558M39746O92713R58836J123947
799.5G1843207J048338O79761J29652l28153m36580j95903J80066M23717L89547J55979
819.9G3889631j33675m11874n96226o04200m44877k29359j77049m23867q55267j134306
840.3F8878931r00221n1606J185835K393245L182924L395313L126484K614886K076584
858.7H5902375J605201J221066R29106O89745M10634N4914l54332q40020j424307k059102
879.1H6135280k620518k848345k394533j112354O98346K391440L364020L420293K819461
897.4H9853090J991600J239627O71792K73890q250k23094m14496o27274q76647j168966
$$ plain form
917.8 90711272 89166415 87132627 84530586 81361890 77740240 73878258 69935215 65900981 61706233
936.2 61706233 57407445 53210700 49348873 45999959 43255684 41109586 39463159 38133293 36901650
954.5 36901650 35599786 34183356 32716987 31302261 30027029 28937715 28065819 27474734 27288267
972.9 27288267 27693003 28905371 31128272 34499782 39007908 44370878 50009501 55206460 59330297
991.3 59330297 61995578 63087589 62660831 60811424 57618159 53183073 47706708 41558430 35292691
1009.6 35292691 29542744 24824098 21354114 19032279 17594376 16767445 16319884 16090889 16013537
1028 16013537 16080335 16302356 16704293 17303599 18047257 18783455 19304144 19475755 19331320 19027744
1048.4 19027744 18749823 18637507 18797313 19332536 20344649 21952441 24286243 27410275 31246012
$$ packed form
917.8I0711272j544857k033788k602041l168696l621650l861982l943043m034234m194748
936.2F1706233m298788m196745l861827l348914k744275k146098j646427j329866j231643
954.5C6901650j301864j416430j466369j414726j275232j089314q71896n91085j86467
972.9B7288267M04736J212368K222901L371510M508126N362970N638623N196959M123837
991.3E9330297K665281J092011m26758j849407l193265m435086n476365o148278o265739
1009.6C5292691n749947m718646l469984k321835j437903q26931m47561k28995p7352
1028A6013537O6798K22021M01937N99306P43658P36198N20689J71611j44435l03576
1048.4A9027744k77921j12316J59806N35223J012113J607792K333802L124032L835737
$$ plain form
1066.7 31246012 35567153 40076205 44478315 48527667 52046061 54909945 57046312 58393806
1083 58393806 58864975 58358580 56780434 54154080 50883847 47830954 45885840 45350727 45727253
1101.4 45727253 46073294 45554981 43826613 41117358 38050157 35293496 33289659 32240236 32206270
1119.8 32206270 33156970 34979972 37521255 40612173 44064781 47671324 51232290 54583800 57601631
1138.1 57601631 60196108 62302327 63881099 64897835 65305203 65060019 64133364 62534600 60360861
1156.5 60360861 57830566 55333155 53489089 53037244 54430246 57438970 61255443 65016961 68179214
1174.8 68179214 70512861 71994418 72736537 72906423 72635561 71985096 70968807 69573516 67774808
1193.2 67774808 65572512 63033855 60311276 57618064 55187619 53230703 51883048 51183957 51085204
$$ packed form
1066.7C1246012M321141M509052M402110M049352L518394K863884K136367J347494
1083E8393806M71169n06395j578146k626354l270233l052893j945114n35113L76526
1101.4D5727253L46041n18313j728368k709255l067201k756661k003837j049423l3966
1119.8C2206270R50700J823002K541283L090918L452608L606543L560966L351510L017831
1138.1E7601631K594477K106219J578772J016736M07368k45184r26655j598764k173739
1156.5F0360861k530295k497411j844066m51845J393002L008724L816473L761518L162253
1174.8F8179214K333647J481557P42119J69886k70862o50465j016289j395291j798708
1193.2F7774808k202296k538657k722579k693212k430445j956916j347655o99091r8753
$$ plain form
1211.5 51085204 51446939 52053583 52663428 53051817 53046554 52550733 51534271 50017154 48056436 45713910
1231.9 45713910 43055093 40179199 37207338 34267822 31488562 28979471 26810133 25003621
1248.2 25003621 23542435 22380108 21462560 20744456 20190273 19757867 19397889 19064124 18743858
1266.6 18743858 18465732 18283056 18242975 18368886 18675174 19178142 19892547 20828849 22004062 23415074
1287 23415074 25017554 26721945 28439867 30121681 31754750 33392513 35186398 37334558 39968717
1305.4 39968717 43123028 46740553 50755435 55106479 59645087 64219582 68652171 72691411
1321.7 72691411 76214832 79241741 81814116 83989823 85833687 87399632 88733220 89892524
1338 89892524 90919113 91764766 92401534 92846882 93087518 93075913 92727214 91875446 90220791 87295234
$$ packed form
1211.5E1085204L61735O06644O09845L88389n263m95821j016462j517117j960718k342526
1231.9D5713910k658817k875894k971861k939516k779260k509091k169338j806512
1248.2B5003621j461186j162327r17548p18104n54183m32406l59978l33765l20266
1266.6A8743858k78126j82676m0081J25911L06288N02968P14405R36302J175213J411012
1287B3415074J602480J704391J717922J681814J633069J637763J793885K148160K634159
1305.4C9968717L154311L617525M014882M351044M538608M574495M432589M039240
1321.7G2691411L523421L026909K572375K175707J843864J565945J333588J159304
1338H9892524J026589Q45653O36768M45348K40636j1605l48699q51768j654655k925557
$$ plain form
1358.4 87295234 82345283 74711692 65779698 58978999 57093775 60596526 67218536 73743534
1374.7 73743534 77673560 78757143 77743524 75154769 71350050 66616416 61941153 58604997
1391 58604997 57071191 57361883 58839679 60601544 62075680 63288796 64847702 67101341 70075667
1409.4 70075667 73650968 77363610 80741048 83790964 86584473 88562489 89735222 90403229 90580332
1427.7 90580332 90280133 89519495 88220263 85965198 82587451 78731996 74693102 71263176 69687468
1446.1 69687468 70418483 72635096 74939340 76621300 77853453 78866035 79292172 79119134 78593236
1464.5 78593236 78236121 78359300 78665495 78579503 77652323 76386094 75895220 77197880 80349058
1482.8 80349058 84304225 88146043 91506952 94119143 95823157 96986717 97989595 98803401 99374926
$$ packed form
1358.4H7295234m949951p633591q931994o800699j885224L502751O622010O524998
1374.7G3743534L930026J083583j013619k588755l804719m733634m675263l336156
1391E8604997j533806K90692J477796J761865J474136J213116J558906K253639K974326
1409.4G0075667L575301L712642L377438L049916K793509J978016J172733O68007J77103
1427.7I0580332l00199p60638j299232k255065l377747l855455m038894l429926j575708
1446.1F9687468P31015K216613K304244J681960J232153J012582M26137j73038n25898
1464.5G8593236l57115J23179L06195q5992r27180j266229m90874J302660L151178
1482.8H0349058L955167L841818L360909K612191J704014J163560J002878Q13806N71525
$$ plain form
1501.2 99374926 99748594 100014472 100339735 100703883 100995398 101209390 101353943 101479137 101591003 101709187
1521.6 101709187 101845956 101955807 102056658 102137649 102166164 102183747 102219725 102199638 102124786 102109504 102159202
1544 102159202 102217579 102242005 102233934 102221608 102202940 102154100 102093327 102145314 102259088 102323234 102346098 102341843
1568.5 102341843 102357650 102392280 102376056 102322268 102288568 102254534 102175903 102060091 101922154 101769650 101598442
1590.9 101598442 101402283 101180446 100938380 100673234 100367308 100024354 99631166 99174422 98657531 98106080
1611.3 98106080 97517097 96806037 95963651 95193326 94428957 93538225 92656291 91824639 91023827 90286434
1631.7 90286434 89569902 88869202 88349724 87981611 87654704 87374419 87196940 87165254 87159932 87278229
1652.1 87278229 87728542 88155925 88487691 88872576 89378148 89930385 90377975 90796030 91258800 91599005
$$ packed form
1501.2I9374926L73668K65878L25263L64148K91515K13992J44553J25194J11866J18184
1521.6A01709187J36769J09851J00851Q0991K8515J7583L5978k0087p4852j5282M9698
1544A02159202N8377K4426q071j2326j8668m8840o0773N1987J13774O4146K2864m255
1568.5A02341843J5807L4630j6224n3788l3700l4034p8631j15812j37937j52504j71208
1590.9A01598442j96159k21837k42066k65146l05926l42954l93188m56744n16891n51451
1611.3I8106080n88983p11060q42386p70325p64369q90732q81934q31652q00812p37393
1631.7I0286434p16532p00700n19478l68113l26907k80285j77479l1686n322J18297
1652.1H7278229M50313M27383L31766L84885N05572N52237M47590M18055M62770L40205
$$ plain form
1672.5 91599005 91819531 91963798 91953731 91769058 91410971 90872878 90259856 89571923 88753611 87893844
1692.9 87893844 86926913 85888171 84792954 83432323 81865937 79822379 77003914 73582828 69548708
1711.3 69548708 64835560 59311908 52690876 46021903 40258631 34796104 29638311 25269040
1727.6 25269040 21734290 19117476 17483060 16614567 16138466 16342796 17442858 19601248 23479168
1745.9 23479168 29789311 39024097 49673775 58908463 66644132 73159027 78063750 81975967
1762.2 81975967 84935164 87091202 88908404 90477431 91918802 93149638 94071615 94833016 95537817
1780.6 95537817 96162063 96728843 97226626 97627771 97964424 98333561 98689049 98976386 99234527 99486047
1801 99486047 99742424 99972063 100168920 100335097 100508845 100682497 100831091 100959861 101090848 101209247
$$ packed form
1672.5I1599005K20526J44267j0067j84673l58087n38093o13022o87933q18312q59767
1692.9H7893844r66931j038742j095217j360631j566386k043558k818465l421086m034120
1711.3F9548708m713148n523652o621032o668973n763272n462527n157793m369271
1727.6B5269040l534750k616814j634416q68493m76101K04330J100062K158390L877920
1745.9B3479168O310143R234786J0649678R234688P735669O514895M904723L912217
1762.2H1975967K959197K156038J817202J569027J441371J230836R21977P61401P04801
1780.6I5537817O24246N66780M97783M01145L36653L69137L55488K87337K58141K51520
1801I9486047K56377K29639J96857J66177J73748J73652J48594J28770J30987J18399
$$ plain form
1821.4 101209247 101303029 101410818 101517498 101622713 101751184 101886737 101994395 102095616 102189350 102251041
1841.8 102251041 102307820 102392757 102479970 102546751 102603137 102647448 102696228 102749538 102816451 102901113 102987671
1864.2 102987671 103059816 103139436 103265393 103401661 103510523 103586793 103648186 103702164 103748024 103781414 103799593
1886.7 103799593 103804862 103820479 103852141 103877473 103904641 103942430 103995991 104061282 104136848 104214501 104292381 104383051
1911.1 104383051 104479074 104560578 104633355 104715741 104788625 104853940 104924965 104983509 105014181 105029178 105041969
1933.6 105041969 105049574 105039227 105001831 104951274 104914320 104898310 104888332 104876590 104858887 104843414 104839993 104848695
1958.1 104848695 104864395 104882097 104900360 104914081 104932392 104961967 104996228 105033410 105072391 105106699 105140424
1980.5 105140424 105179358 105219555 105258310 105287254 105299556 105309796 105329692 105341828 105339718 105334890 105332339 105336320
$$ packed form
1821.4A01209247R3782J07789J06680J05215J28471J35553J07658J01221R3734O1691
1841.8A02251041N6779Q4937Q7213O6781N6386M4311M8780N3310O6913Q4662Q6558
1864.2A02987671P2145P9620J25957J36268J08862P6270O1393N3978M5860L3390J8179
1886.7A03799593N269J5617L1662K5332K7168L7789N3561O5291P5566P7653P7880R0670
1911.1A04383051R6023Q1504P2777Q2386P2884O5315P1025N8544L0672J4997J2791
1933.6A05041969P605j0347l7396n0557l6954j6010r978j1742j7703j5473l421Q702
1958.1A04848695J5700J7702J8263J3721J8311K9575L4261L7182L8981L4308L3725
1980.5A05140424L8934M0197L8755K8944J2302J0240J9896J2136k110m828k551L981
$$ plain form
2005 105336320 105347955 105356407 105357289 105364966 105381906 105396426 105408025 105418217 105420613 105417323 105408907 105386138 105353713
2031.5 105353713 105318439 105276239 105226636 105176032 105130816 105094004 105062449 105028963 104997432 104974794 104960084
2053.9 104960084 104949641 104940903 104937649 104936671 104929471 104921138 104921520 104928803 104934919 104929566 104916656 104913175 104913437 104906774
2082.5 104906774 104892373 104868066 104842293 104827917 104820573 104806185 104783118 104764926 104759181 104761875 104770541 104786956
2106.9 104786956 104814720 104844701 104868329 104891133 104917502 104948962 104988098 105031013 105071127 105106807 105141473
2129.4 105141473 105178022 105203068 105210400 105212176 105220854 105238187 105256534 105270660 105276763 105278969 105280793 105279839 105284286
2155.9 105284286 105300820 105321729 105342340 105362213 105384183 105409980 105432236 105447268 105458808 105472243 105487013
2178.3 105487013 105501533 105515385 105529857 105546093 105561364 105576527 105594039 105615485 105637300 105650806 105656731 105668187
$$ packed form
2005A05336320J1635Q452Q82P677J6940J4520J1599J0192K396l290q416k2769l2425
2031.5A05353713l5274m2200m9603n0604m5216l6812l1555l3486l1531k2638j4710
2053.9A04960084j0443q738l254r78p200q333L82P283O116n353j2910l481K62o663
2082.5A04906774j4401k4307k5773j4376p344j4388k3067j8192n745K694Q666J6415
2106.9A04786956K7764K9981K3628K2804K6369L1460L9136M2915M0114L5680L4666
2129.4A05141473L6549K5046P332J776Q678J7333J8347J4126O103K206J824r54M447
2155.9A05284286J6534K0909K0611J9873K1970K5797K2256J5032J1540J3435J4770
2178.3A05487013J4520J3852J4472J6236J5271J5163J7512K1446K1815J3506N925J1456
$$ plain form
2202.8 105668187 105688012 105709445 105733323 105762458 105788291 105804420 105817950 105829644 105835962 105840838 105851281 105868316
2227.3 105868316 105885601 105904126 105931795 105967200 106005013 106041324 106074500 106105506 106132972 106159008 106180274
2249.7 106180274 106195891 106212926 106229973 106245852 106266487 106295872 106330299 106366765 106405926 106448078 106493008
2272.2 106493008 106533563 106557477 106567967 106579602 106589162 106590259 106596851 106615448 106634557 106650698 106667602 106690228
2296.6 106690228 106719005 106745493 106767511 106790745 106816900 106841040 106864130 106888902 106915832 106952262 106988358
2319.1 106988358 107017088 107058251 107106626 107141030 107166612 107191408 107205272 107200968 107184947 107168365 107144773 107082117
2343.5 107082117 106984186 106915414 106919599 107002640 107132280 107249856 107336545 107386398 107392454 107358015 107306409
2366 107306409 107248628 107170510 107080722 107000935 106948674 106929696 106929862 106928897 106921875 106916118 106913280 106905627 106893575
$$ packed form
2202.8A05668187J9825K1433K3878K9135K5833J6129J3530J1694O318M876J0443J7035
2227.3A05868316J7285J8525K7669L5405L7813L6311L3176L1006K7466K6036K1266
2249.7A06180274J5617J7035J7047J5879K0635K9385L4427L6466L9161M2152M4930
2272.2A06493008M0555K3914J0490J1635R560J097O592J8597J9109J6141J6904K2626
2296.6A06690228K8777K6488K2018K3234K6155K4140K3090K4772K6930L6430L6096
2319.1A06988358K8730M1163M8375L4404K5582K4796J3864m304j6021j6582k3592o2656
2343.5A07082117r7931o8772M185Q3041J29640J17576Q6689M9853O056l4439n1606
2366A07306409n7781p8118q9788p9787n2261j8978J66r65p022n757k838p653j2052
$$ plain form
2392.5 106893575 106889081 106895876 106907332 106917858 106930161 106945217 106952429 106947494 106942260 106940949 106941831 106947184 106957209
2419 106957209 106976593 107003021 107028091 107052362 107076001 107096350 107113695 107125390 107127380 107123697 107115865 107101297
2443.5 107101297 107083380 107059586 107024825 106984985 106937540 106874716 106806397 106747901 106704354 106676137 106664014
2465.9 106664014 106670725 106699872 106741369 106779659 106808197 106830561 106860924 106900811 106936598 106964552 106994808 107035613
2490.4 107035613 107080781 107120275 107151723 107185674 107231367 107273436 107301247 107321835 107340014 107359147 107372057
2512.8 107372057 107375491 107381999 107391679 107405007 107432199 107462430 107483733 107502615 107521963 107542896 107569861 107602227
2537.3 107602227 107632494 107650113 107659626 107677460 107701504 107716525 107721269 107735431 107763100 107782936 107798851 107826793
2561.8 107826793 107853246 107864749 107875288 107893395 107908988 107918179 107920563 107920551 107926118 107932174 107931352 107921362 107903719
$$ packed form
2392.5A06893575m494O795J1456J0526J2303J5056P212m935n234j311Q82N353J0025
2419A06957209J9384K6428K5070K4271K3639K0349J7345J1695J990l683p832j4568
2443.5A07101297j7917k3794l4761l9840m7445o2824o8319n8496m3547k8217j2123
2465.9A06664014O711K9147M1497L8290K8538K2364L0363L9887L5787K7954L0256M0805
2490.4A07035613M5168L9494L1448L3951M5693M2069K7811K0588J8179J9133J2910
2512.8A07372057L434O508R680J3328K7192L0231K1303J8882J9348K0933K6965L2366
2537.3A07602227L0267J7619R513J7834K4044J5021M744J4162K7669J9836J5915K7942
2561.8A07826793K6453J1503J0539J8107J5593R191K384j2N567O056q22r990j7643
$$ plain form
2588.3 107903719 107880902 107848454 107805765 107762873 107728016 107696497 107661021 107630181 107609713 107588327 107565618
2610.7 107565618 107545221 107523859 107509792 107502759 107490456 107474232 107462144 107456326 107457864 107462609 107459521 107450581 107442319
2637.2 107442319 107437158 107433867 107424200 107410157 107388318 107358134 107333779 107312334 107284975 107252932 107223094 107201946
2661.7 107201946 107185316 107160747 107130098 107105803 107087600 107069719 107046258 107020104 107011855 107031775 107060874 107084143
2686.2 107084143 107104981 107126594 107155204 107191396 107217503 107228065 107235610 107235277 107222509 107204807 107177937 107138312
2710.7 107138312 107079077 106986308 106864643 106720102 106554103 106394243 106275177 106224751 106241035 106260371
2731.1 106260371 106226110 106138194 106023753 105902553 105784130 105687344 105617929 105580842 105602586 105672622 105736852
2753.5 105736852 105768228 105773735 105748498 105682218 105585289 105477345 105368674 105268168 105178928 105113566 105126154
$$ packed form
2588.3A07903719k2817l2448m2689m2892l4857l1519l5476l0840k0468k1386k2709
2610.7A07565618k0397k1362j4067p033j2303j6224j2088n818J538M745l088q940q262
2637.2A07442319n161l291r667j4043k1839l0184k4355k1445k7359l2043k9838k1148
2661.7A07201946j6630k4569l0649k4295j8203j7881k3461k6154q249J9920K9099K3269
2686.2A07084143K0838K1613K8610L6192K6107J0562P545l33j2768j7702k6870l9625
2710.7A07138312n9235r2769j21665j44541j65999j59860j19066n0426J6284J9336
2731.1A06260371l4261q7916j14441j21200j18423r6786o9415l7087K1744P0036O4230
2753.5A05736852L1376N507k5237o6280r6929j07944j08671j00506q9240o5362J2588
$$ plain form
2775.9 105126154 105225325 105344105 105447721 105529404 105551314 105508935 105472016 105472469 105450404 105362082 105255878
2798.4 105255878 105177128 105088449 104950154 104752374 104506099 104268360 104055846 103824830 103590465 103403175
2818.8 103403175 103274143 103197694 103168631 103164375 103139639 103066802 102955019 102808118 102615035 102410793 102237654
2841.2 102237654 102059472 101822484 101537776 101256442 100977576 100649226 100225770 99647290 98863041 97850448
2861.6 97850448 96575826 95045930 93387383 91808999 90544993 89818174 89694655 89994735 90433186
2879.9 90433186 90764344 90800852 90431547 89625502 88385302 86719543 84669513 82334012 79817927
2898.3 79817927 77184415 74502647 71916801 69668603 68051565 67291075 67413896 68219799 69367820
2916.7 69367820 70472729 71202672 71352118 70816052 69588602 67853838 65989912 64429003 63474107
$$ packed form
2775.9A05126154R9171J18780J03616Q1683K1910m2379l6919M53k2065q8322j06204
2798.4A05255878p8750q8679j38295j97780k46275k37739k12514k31016k34365j87290
2818.8A03403175j29032p6449k9063m256k4736p2837j11783j46901j93083k04242j73139
2841.2A02237654j78182k36988k84708k81334k78866l28350m23456n78480p84249j012593
2861.6I7850448j274622j529896j658547j578384j264006p26819j23519L00080M38451
2879.9I0433186L31158L6508l69305q06045j240200j665759k050030k335501k516085
2898.3G9817927k633512k681768k585846k248198j617038p60490J22821Q05903J148021
2916.7F9367820J104909P29943J49446n36066j227450j734764j863926j560909r54896
$$ plain form
2935 63474107 63174260 63422489 64165586 65431261 67180538 69184989 71049953 72399199 73059499
2953.4 73059499 73027837 72368675 71211612 69700640 67918998 65870339 63497561 60733485 57553071
2971.7 57553071 54006624 50248599 46590871 43430254 41062987 39673048 39351454 40033507 41569319
2990.1 41569319 43787169 46544796 49810246 53535676 57603872 61903089 66285974 70587111
3006.4 70587111 74688607 78493154 81910688 84912258 87527859 89787912 91708094 93318111
3022.7 93318111 94682068 95851642 96831894 97644144 98339844 98963583 99525487 100000286 100395858
3041.1 100395858 100757456 101100218 101405406 101670980 101917565 102148533 102360475 102562785 102752399 102921343
3061.5 102921343 103065062 103177655 103291631 103438759 103584862 103680801 103719032 103744793 103808236 103896415
$$ packed form
2935F3474107k99847K48229P43097J265675J749277K004451J864964J349246O60300
2953.4G3059499l1662o59162j157063j510972j781642k048659k372778k764076l180414
2971.7E7553071l546447l758025l657728l160617k367267j389939l21594O82053J535812
2990.1D1569319K217850K757627L265450L725430M068196M299217M382885M301137
3006.4G0587111M101496L804547L417534L001570K615601K260053J920182J610017
3022.7I3318111J363957J169574R80252Q12250O95700O23739N61904M74799L95572
3041.1A00395858L61598L42762L05188K65574K46585K30968K11942K02310J89614J68944
3061.5A02921343J43719J12593J13976J47128J46103R5939L8231K5761O3443Q8179
$$ plain form
3081.9 103896415 103977787 104051578 104109383 104157329 104223228 104289663 104332685 104366636 104402995 104441833 104471290
3104.3 104471290 104476857 104480004 104510581 104540789 104534864 104518557 104520738 104552817 104618073 104679954 104701328 104692149
3128.8 104692149 104688847 104693425 104667282 104602766 104540479 104515576 104522431 104528797 104505384 104442585 104368103 104325283
3153.2 104325283 104308617 104288030 104256833 104214752 104165089 104108870 104040980 103957033 103866971 103790057 103719878
3175.7 103719878 103637528 103541577 103436923 103328943 103228152 103128362 103017402 102906191 102797449 102678251
3196.1 102678251 102551699 102416885 102270365 102126944 101993716 101861286 101715529 101549256 101377785 101216984
3216.5 101216984 101061952 100915945 100776470 100623262 100459278 100296688 100121677 99944633 99825031 99756789
3236.9 99756789 99673039 99557751 99420494 99271047 99144685 99063873 98992217 98888737 98772371 98679578
$$ packed form
3081.9A03896415Q1372P3791N7805M7946O5899O6435M3022L3951L6359L8838K9457
3104.3A04471290N567L147L0577L0208n925j6307K181L2079O5256O1881K1374r179
3128.8A04692149l302M578k6143o4516o2287k4903O855O366k3413o2799p4482m2820
3153.2A04325283j6666k0587l1197m2081m9663n6219o7890q3947r0062p6914p0179
3175.7A03719878q2350r5951j04654j07980j00791r9790j10960j11211j08742j19198
3196.1A02678251j26552j34814j46520j43421j33228j32430j45757j66273j71471j60801
3216.5A01216984j55032j46007j39475j53208j63984j62590j75011j77044j19602o8242
3236.9I9756789q3750j15288j37257j49447j26362q0812p1656j03480j16366r2793
$$ plain form
3257.3 98679578 98604590 98528075 98446697 98344582 98194885 98024279 97921795 97900218 97884226 97853076 97809649
3279.7 97809649 97737348 97648859 97564852 97477812 97363049 97239101 97146416 97084874 97044903 96996450 96882993
3302.1 96882993 96706021 96545887 96462876 96431595 96390069 96309167 96202803 96083498 95945764 95773089
3322.5 95773089 95566803 95379591 95237935 95095187 94910198 94676161 94409382 94152468 93916649 93673766
3342.9 93673766 93418103 93138528 92817569 92492509 92190844 91878629 91528732 91156608 90789354 90407574
3363.3 90407574 89979208 89535213 89120859 88739550 88355809 87940097 87498242 87044674 86600196 86164117
3383.7 86164117 85709995 85224319 84709364 84203166 83736992 83271712 82757837 82225555 81750095 81317556
3404.1 81317556 80843675 80328685 79824901 79339492 78877115 78430676 77967429 77501750 77057725 76613766
$$ packed form
3257.3I8679578p4988p6515q1378j02115j49697j70606j02484k1577j5992l1150m3427
3279.7I7809649p2301q8489q4007q7040j14763j23948r2685o1542l9971m8453j13457
3302.1I6882993j76972j60134q3011l1281m1526q0902j06364j19305j37734j72675
3322.5I5773089k06286j87212j41656j42748j84989k34037k66779k56914k35819k42883
3342.9I3673766k55663k79575l20959l25060l01665l12215l49897l72124l67254l81780
3363.3I0407574m28366m43995m14354l81309l83741m15712m41855m53568m44478m36079
3383.7H6164117m54122m85676n14955n06198m66174m65280n13875n32282m75460m32539
3404.1H1317556m73881n14990n03784m85409m62377m46439m63247m65679m44025m43959
$$ plain form
3424.5 76613766 76140445 75650114 75192428 74745691 74274635 73870945 73585206 73316258 72985107 72625709
3444.9 72625709 72300649 72019118 71750599 71478021 71210778 70937228 70652121 70426726 70245540 69976950
3465.3 69976950 69676888 69560933 69641840 69714528 69672567 69557732 69478780 69551098 69678903 69739276 69829816
3487.7 69829816 70002401 70177811 70328569 70483005 70671147 70888770 71117830 71394873 71696442 71966279
3508.1 71966279 72219115 72449380 72660875 72883433 73093450 73260468 73419517 73600864 73790234 73972613
3528.5 73972613 74128622 74251002 74366838 74493867 74618244 74736685 74867940 75050849 75290060 75527853
3548.9 75527853 75772727 76064396 76353288 76626575 76938272 77275652 77581894 77905566 78365821 78875476
3569.3 78875476 79298764 79689062 80092132 80484176 80854714 81197405 81486827 81779790 82185763 82594973
$$ packed form
3424.5G6613766m73321m90331m57686m46737m71056m03690k85739k68948l31151l59398
3444.9G2625709l25060k81531k68519k72578k67243k73550k85107k25395j81186k68590
3465.3F9976950l00062j15955Q0907P2688m1961j14835p8952P2318J27805O0373R0540
3487.7F9829816J72585J75410J50758J54436J88142K17623K29060K77043L01569K69837
3508.1G1966279K52836K30265K11495K22558K10017J67018J59049J81347J89370J82379
3528.5G3972613J56009J22380J15836J27029J24377J18441J31255J82909K39211K37793
3548.9G5527853K44874K91669K88892K73287L11697L37380L06242L23672M60255N09655
3569.3G8875476M23288L90298M03070L92044L70538L42691K89422K92963M05973M09210
$$ plain form
3589.7 82594973 82878309 83130437 83405101 83665097 83914852 84159648 84357941 84519219 84720737 84952819
3610.1 84952819 85172230 85381514 85571241 85827559 86189950 86505401 86700213 86873269 87260175 87799048
3630.5 87799048 88211477 88599151 89027274 89447010 89868098 90288782 90683609 91121829 91768950 92553389
3650.9 92553389 93207759 93817353 94553030 95304263 96024835 96765399 97467208 98106366 98806208 99553740
3671.3 99553740 100164485 100759506 101402330 101964140 102453113 102878249 103231061 103580892 104051399 104598403
3691.7 104598403 105077016 105476165 105818164 106078362 106284225 106485546 106655049 106758511 106806242 106860113
3712.1 106860113 106973255 107087398 107140112 107148790 107158113 107178557 107214606 107274306 107300198 107241380 107137787
3734.5 107137787 107101357 107179630 107280600 107299697 107258749 107277286 107288826 107241142 107255089 107334459 107382107
$$ packed form
3589.7H2594973K83336K52128K74664K59996K49755K44796J98293J61278K01518K32082
3610.1H4952819K19411K09284J89727K56318L62391L15451J94812J73056L86906N38873
3630.5H7799048M12429L87674M28123M19736M21088M20684L94827M38220O47121P84439
3650.9I2553389O54370O09594P35677P51233P20572P40564P01809O39158O99842P47532
3671.3I9553740O10745N95021O42824N61810M88973M25136L52812L49831M70507N47004
3691.7A04598403M78613L99149L41999K60198K05863K01321J69503J03462M7731N3871
3712.1A06860113J13142J14143N2714Q678R323K0444L6049N9700K5892n8818j03593
3734.5A07137787l6430P8273J00970J9097m0948J8537J1540m7684J3947P9370M7648
$$ plain form
3756.9 107382107 107388163 107397223 107403445 107395172 107391417 107383871 107383847 107412863 107434821 107424176 107418084 107460654 107514763
3783.5 107514763 107558608 107612717 107660139 107692873 107711339 107719600 107736206 107728457 107711375 107744956 107755542 107744396
3807.9 107744396 107770777 107781768 107741392 107687593 107654822 107587528 107550478 107619226 107689822 107739055 107782805
3830.4 107782805 107797396 107785177 107758391 107753837 107800460 107868671 107942724 108022654 108088207 108080626 107962525 107887840
3854.8 107887840 107941580 108001804 108013260 107982171 107955527 107944989 107901132 107856762 107862151 107896471 107921064 107896078
3879.3 107896078 107865834 107855463 107848251 107900441 107964766 107971632 107979345 107998693 107981420 107949829 107933354 107923985
3903.8 107923985 107952833 108011818 108044934 108043277 108012819 107966530 107947898 107958508 107957077 107939994 107934225 107918501
3928.3 107918501 107859147 107799304 107789886 107821548 107855332 107844555 107800806 107775450 107750714 107710898 107696116 107708359
$$ packed form
3756.9A07382107O056R060O222q273l755p546k4K9016K1958j0645o092M2570N4109
3783.5A07514763M3845N4109M7422L2734J8466Q261J6606p749j7082L3581J0586j1146
3807.9A07744396K6381J0991m0376n3799l2771o7294l7050O8748P0596M9233M3750
3830.4A07782805J4591j2219k6786m554M6623O8211P4053P9930O5553p581j18101p4685
3854.8A07887840N3740O0224J1456l1089k6644j0538m3857m4370N389L4320K4593k4986
3879.3A07896078l0244j0371p212N2190O4325O866P713J9348j7273l1591j6475r369
3903.8A07923985K8848N8985L3116j657l0458m6289j8632J0610j431j7083n769j5724
3928.3A07918501n9354n9843r418L1662L3784j0777m3749k5356k4736l9816j4782J2243
$$ plain form
3952.7 107708359 107717109 107711053 107696307 107677019 107651269 107633364 107634938 107644475 107656586 107672906 107687342 107695210
3977.2 107695210 107703757 107712114 107696867 107663524 107643545 107639432 107621729 107584727 107551587 107512891
3997.6 107512891
$$ packed form
3952.7A07708359Q750o056j4746j9288k5750j7905J574R537J2111J6320J4436P868
3977.2A07695210Q547Q357j5247l3343j9979m113j7703l7002l3140l8696
3997.6A07512891
##END=$$ End of the data block
