##TITLE=DI 15-0647846-0 $$ Begin of the data block
##JCAMP-DX=5.00 $$ ACD/SpecManager v 10.08
##SPECTROMETER/DATA SYSTEM=Alpha
##DATE=16 Apr 2015 10:34:42
##DATA TYPE=INFRARED SPECTRUM
##DATA CLASS=XYDATA
##ORIGIN=
##OWNER=
##NPOINTS=1765
##FIRSTX=399.76428223
##LASTX=3997.64306641
##MAXX=3997.64306641
##MINX=399.76428223
##MAXY=0.82776880
##MINY=0.01834443
##XFACTOR=1.0000000000
##YFACTOR=1.000000000000000e-9
##FIRSTY=0.77502918
##DELTAX=2.03961372
##XUNITS=1/CM
##YUNITS=ARBITRARY UNITS
##XYDATA=(X++(Y..Y))
399.8 775029182 774470687 772203565 769529283 766552329 763279676 759573698 755014837 750477016 746423483
418.1 746423483 742387772 739462495 737921834 737021685 736460149 736693919 737678349 738635838 739762902
436.5 739762902 741918385 745088339 748939276 753294826 757638097 761062622 763159275 764442384
452.8 764442384 765351534 765656650 764949024 763352513 761133790 758471429 755450010 752065599 748016179
471.2 748016179 743311107 738820136 734732449 730762780 726844311 722961783 719177961 715200067
487.5 715200067 710292041 703898609 695901811 686922312 678966343 674830139 676237106 682326674
503.8 682326674 690966487 700660825 709043562 714451492 717374980 719089031 720485032 721826375
520.1 721826375 723284066 725136161 727508962 730423212 733827770 737525046 741386056 745310366
536.4 745310366 749098003 752601385 755880773 759041250 761990905 764745116 767457724 770208299
552.7 770208299 772932470 775371909 777394414 778970778 779959083 780518830 781011224 781528711 782068551
571.1 782068551 782598317 783015668 783274591 783362091 783149898 782760739 782578826 782451451 782020152 781454384
591.5 781454384 780983329 780500174 780020475 779661000 779211342 778477609 777608514 776781201 776069582 775450170
611.9 775450170 774515867 773007512 771795154 771295726 770430386 768607616 765429080 758199930 747173667
630.2 747173667 742251217 748867869 757665694 761062741 760811150 759650171 758124292 756046414 753961086
648.6 753961086 752559841 751509964 750367939 749377251 748552620 747697234 746587634 742838442 732871354
667 732871354 725195050 728062928 729309261 725165427 718686402 713699937 712857127 715466857 718763709
685.3 718763709 720835626 721231163 719978750 716897488 711089075 701139987 686933994 671227098
701.6 671227098 657104492 645012021 634110689 624416590 614854872 599040627 564927936 497712523
717.9 497712523 387336105 250491798 134222612 73194176 62690780 80327690 115944333
732.2 115944333 174372375 265413702 388336837 519038439 624972761 692306459 728724957
746.5 728724957 747213125 756557286 761339247 763697922 764610529 764682710 764207959 763113379 761286020
764.9 761286020 758738995 755625546 752251625 748758197 745069027 741065979 736358106 729909539
781.2 729909539 720223784 705839038 685923278 661243021 637378216 626266420 635803461 656820774
797.5 656820774 672066748 676276386 675632179 675061226 675321817 676124156 677371502 678973019 680685341
815.8 680685341 682291627 683457255 683693647 682670474 680234194 676305532 670759737 663561285 655027270
834.2 655027270 646179080 638409376 632529438 628520429 625940859 624624491 624866009 626668930 629375279
852.6 629375279 632201552 634255886 634029686 629145980 616454482 592484295 554713428 504852831
868.9 504852831 455093056 425427973 425359994 447211325 478748113 510960877 538354754 558950245
885.2 558950245 572975755 581219375 584632218 584744155 583902717 584894478 590336263 601980209 619920254
903.5 619920254 642327070 666081548 688022852 706063926 719612002 729188681 735649109 739839911
919.9 739839911 742487371 744073927 744938374 745299459 745300710 745056391 744628549 744010746 743147135 742072999
940.3 742072999 740848243 739456534 737871349 736072540 733946741 731258690 727792561 723361254
956.6 723361254 717661321 710294247 700948358 689614356 676887870 664437592 655120313 651678979
972.9 651678979 654628575 661767602 670141041 677852750 684085608 688483596 691155195 692975819
989.2 692975819 694652259 695627809 694894671 692188323 687586367 680671990 669916987 652077019
1005.5 652077019 622308612 572972715 492075801 379765779 272777438 222333953 242329538
1019.8 242329538 302948922 368307322 419887155 451191336 463364929 463693649 458053648 448747665
1036.1 448747665 437628031 427748442 422851622 425989777 438397348 459341407 486602068 516939759
1052.4 516939759 546574116 571751356 589706659 599417925 601503074 597178161 587249756 571680188
1068.8 571680188 549482167 518680930 477121621 424551845 364406407 303192914 246949375
1083 246949375 198198959 156389251 120582744 91037601 68561688 53307448 44452906 40777333
1099.4 40777333 41268058 45414772 52849654 62504448 71597092 76617807 76116621 71754374 66896632
1117.7 66896632 64544827 66200480 71887732 80597706 90893075 102109402 115037270 131305531
1134 131305531 152241632 178530395 210925162 250503153 297602713 350551754 405784786 459138334
1150.3 459138334 507048547 546987355 577804506 599991977 614967406 623440087 624173582 614866793
1166.7 614866793 595947266 573671699 557348013 553301454 562335908 581288993 605079710 628165543
1183 628165543 646393836 658190429 663993418 665002108 662383616 657129109 650173426 642326951
1199.3 642326951 634071589 625594854 616922379 607991695 598638117 588356197 576371372 561808467
1215.6 561808467 543720007 521429539 494741410 463082850 424439311 375840127 315810323
1229.9 315810323 247426808 179075435 120855547 78913540 53031284 38845114 31589333
1244.2 31589333 27960036 26144588 25206402 24593038 23947105 23077352 22067411 21232547 20963825
1262.5 20963825 21411393 22570182 24350554 26663892 29240765 31646736 33646051 35311058 36906295
1280.9 36906295 38677562 40924869 43925382 48095085 54060232 62905617 76218501 95770381
1297.2 95770381 122229129 153501794 185841158 217710570 250936925 286616623 323386550
1311.5 323386550 359195769 392791420 425089568 457673609 490368932 521822631 549336970
1325.8 549336970 568528473 574401498 562261045 530695975 484991252 436961740 404244989
1340 404244989 403390467 436501831 491366774 548524678 593530118 622925520 639285028 645079970
1356.4 645079970 640780330 623752952 589040399 541619122 495730400 461093545 445304900
1370.6 445304900 449356765 468657792 494633377 520483792 542868793 558721542 567183018 568795383
1386.9 568795383 564323306 555104256 540519476 518993974 491729736 456662893 412878215 357750356
1403.3 357750356 288650006 227923065 205750987 239975795 325274289 429584712 528568387
1417.5 528568387 608592331 653013527 672437131 679059803 674582481 658967316 635471344 609685361
1433.9 609685361 580671966 553324938 537038565 527936161 521820247 516542435 509857178 502650440
1450.2 502650440 497530580 497324467 508379400 534694254 562357306 589289725 620214045 647660732
1466.5 647660732 663616359 674016416 687206864 702936351 716717243 728750229 740116894
1480.8 740116894 750691593 759226739 765727878 770151138 771344602 768405795 758850634 735711336
1497.1 735711336 694036067 639743209 589970171 570938468 616486669 678804040 714753687
1511.4 714753687 735390246 746262491 751140773 752355695 751557648 750679851 750876963 752389550
1527.7 752389550 755027413 758551121 763251245 767133653 769248247 770690203 771780849 772072613
1544 772072613 771598220 770518303 768900037 767097950 765142500 762949884 759685338 755866170 752647996
1562.4 752647996 748051405 741071165 729628146 711150706 689401686 662151039 630875766 621954441
1578.7 621954441 641397297 676455319 710658610 733485460 745695293 751942694 755290449 756650925
1595 756650925 755901575 752962351 748146653 741871297 734189510 724498451 712851703 701674998
1611.3 701674998 694969893 696628034 707599163 718240261 723928154 726473153 726960182 726598442
1627.6 726598442 726061583 725492597 724677265 723785758 723328888 723016560 722387135 721274436 719532728
1646 719532728 717763126 716492832 714100957 709823072 705934405 701362550 694473863 684406281
1662.3 684406281 672804534 661986589 649506271 634861231 622061491 608158469 591828525
1676.6 591828525 576718688 562682867 548102260 532909393 522144794 512312531 498636127
1690.9 498636127 481563091 455697298 419972152 375759840 315651506 260014027 204302013
1705.1 204302013 143221229 94418183 60288265 38407851 25976473 19932572 18344432 18500987
1721.5 18500987 19339375 20512976 22225918 24440287 27784325 34270145 44925530 60846273
1737.8 60846273 91651790 143211246 211696193 291119784 373551071 454124033 520956695
1752 520956695 566826761 601732194 631096184 653652966 672600329 687411129 698373437 707790852
1768.4 707790852 715932131 723577678 730264246 735468209 740004420 744470537 748595357 752406955
1784.7 752406955 755766571 758462667 760812938 763349712 765676916 767495036 769148171 770762086
1801 770762086 772306383 773495615 774356902 774965644 775432885 775717914 775838733 775942326 776189208 776672959
1821.4 776672959 777492404 778880119 780635774 782943964 785783529 788556993 791273296 794167161
1837.7 794167161 797006428 799637377 802576244 805759847 808601141 811156154 813565373 815729916
1854 815729916 817627549 819256961 820625484 821724534 822542012 823131204 823683739 824362159 824896157
1872.4 824896157 825228453 825423717 825504303 825434387 825225294 824939728 824564457 824050486 823427677 822765350
1892.8 822765350 821994305 821187079 820370376 819546759 818742752 817925453 817012370 816021025 815058887 814102888
1913.2 814102888 813072324 811905503 810708761 809486985 808178186 806792915 805260479 803513944
1929.5 803513944 801549554 799346328 796892941 794227660 791361868 788303494 785387456 783083260
1945.8 783083260 781449914 780495286 780252635 780630112 781490743 782809377 784643650 786988497 789722860
1964.2 789722860 792624772 795442045 797884524 799876690 801528573 802922606 804108620 805118799
1980.5 805118799 806002200 806831121 807714880 808717370 809878647 811215103 812596798 813898683 815175891
1998.8 815175891 816446304 817611575 818641305 819604576 820552111 821422756 822175443 822834373 823448062
2017.2 823448062 824056506 824641466 825181007 825683296 826137662 826530516 826859593 827108860 827296555 827429771
2037.6 827429771 827476561 827428877 827339172 827238321 827089548 826845527 826478183 826024950 825536728 825005472
2058 825005472 824418724 823789358 823109865 822379887 821637213 820894063 820123911 819354594 818667829 818077862
2078.4 818077862 817547858 817060292 816572130 816060483 815571964 815158069 814796329 814409733 814029276 813742399
2098.8 813742399 813551247 813424170 813308299 813174903 813072562 813033700 813052118 813118279 813242614 813477635
2119.2 813477635 813791513 814095736 814400971 814713418 814973474 815173388 815380573 815615714 815832019 816057742
2139.6 816057742 816338956 816641569 816972494 817387581 817911506 818513572 819139063 819768310 820431411 821141303
2160 821141303 821873903 822618246 823339343 823991954 824568033 825068355 825511754 825939119 826339245 826675236
2180.4 826675236 826934099 827143610 827350557 827547014 827680767 827737749 827768803 827763259 827632308 827342153
2200.8 827342153 826932907 826463044 826020837 825694501 825510979 825446904 825458586 825493097 825483322 825387597 825200737
2223.2 825200737 824973345 824780762 824620426 824435174 824218214 823964357 823660076 823350668 823076129 822841465
2243.6 822841465 822575033 822209895 821805835 821441233 821111619 820823908 820631266 820531189 820452809 820329249
2264 820329249 820174694 820022702 819815874 819458544 818958163 818382680 817782342 817225397 816714525 816137850
2284.4 816137850 815471113 814898431 814550340 814360321 814173639 813863337 813376963 812662423 811550975
2302.7 811550975 809764802 807256520 804373562 801581681 799158871 796701014 793126225 788098335
2319.1 788098335 782838464 778803766 775949478 773164272 770307720 768358827 767339528 766134858
2335.4 766134858 764545500 763059556 762281239 764039457 770233214 776630402 776538670 768739700 757232726
2353.7 757232726 747038186 740124822 736881673 736956418 739734352 744717240 751441836 759355664
2370.1 759355664 767672598 775650561 783107698 790165722 796702325 802250504 806361258 808897436
2386.4 808897436 810209870 810878217 811268985 811588466 811948419 812362850 812825263 813324094 813871324
2404.7 813871324 814457834 815042734 815638661 816238165 816803992 817365646 817965865 818615913 819296122 819955766
2425.1 819955766 820574164 821200073 821833372 822406352 822900355 823334336 823720276 824058294 824344695 824605465
2445.5 824605465 824852645 825029135 825145900 825258374 825317025 825275540 825185120 825100541 825001061 824846148
2465.9 824846148 824639320 824371815 824061632 823761940 823430836 823052406 822659016 822226465 821781218 821334243
2486.3 821334243 820830643 820281386 819738507 819209874 818693519 818211436 817783475 817402542 817077935 816806376
2506.7 816806376 816555142 816324174 816094220 815815151 815477490 815155208 814926445 814754546 814555705 814360917
2527.1 814360917 814252019 814207077 814177036 814159989 814138055 814085305 814027965 813998044 813966215 813894749 813816488
2549.5 813816488 813785911 813799024 813832939 813892722 813982308 814094365 814201772 814292789 814390540 814468563 814513445
2572 814513445 814539194 814535260 814520717 814576983 814776063 815104246 815540016 816047966 816568136 817082286 817563057
2594.4 817563057 817957401 818237066 818443060 818623841 818732977 818728328 818683922 818676114 818670392 818592668 818459332
2616.8 818459332 818279445 817999423 817642391 817282319 817038298 817067266 817412615 817994475 818754017 819585264
2637.2 819585264 820287764 820788324 821141839 821408868 821650028 821883917 822052658 822136641 822229326 822347462
2657.6 822347462 822411001 822432816 822484612 822554529 822566152 822516382 822468519 822433054 822383940 822349966 822378457
2680.1 822378457 822447300 822496653 822502494 822494745 822484851 822431028 822337031 822232544 822105348 821950495 821788132
2702.5 821788132 821626365 821427941 821156919 820863426 820645571 820488095 820305645 820079625 819788814 819404364
2722.9 819404364 818960905 818542957 818152487 817732930 817304909 816898882 816534221 816202939 815863788 815487623
2743.3 815487623 815032542 814530134 814089596 813724101 813398063 813141108 812930524 812751353 812677383 812691569
2763.7 812691569 812699914 812669694 812597930 812458754 812281728 812108874 811890781 811598957 811252356 810837030
2784.1 810837030 810329318 809786141 809316993 808898628 808405042 807800710 807155013 806523860 805936933 805486739
2804.5 805486739 805251300 805204868 805338025 805614352 805854380 805924952 805782020 805392742 804827929 804208040
2824.9 804208040 803541124 802756190 801835775 800793171 799614489 798300624 796906173 795392275 793550491
2843.2 793550491 791264951 788688242 786059976 783478558 781041443 778967261 777317941 775963306
2859.5 775963306 774785340 773657382 772466063 771152973 769613981 767796040 765814185 763670921
2875.9 763670921 761099517 757947564 754408658 750871837 747822464 745736659 744931459 745437443 746969521
2894.2 746969521 749031782 751007378 752328277 752818882 752958775 753598809 755276680 757909119 761058271
2912.6 761058271 764205873 766849816 768745720 769935489 770430624 770174801 769131482 767215490 764346778
2930.9 764346778 760319889 754669309 746898472 736608565 723702490 708599627 692043662 674935520
2947.2 674935520 658347309 643228590 630244315 619989753 612904429 609179556 608881176 611821532
2963.6 611821532 617353618 624677002 633269072 642776132 652707458 662400424 671405315 679693282
2979.9 679693282 687343419 694333076 700675547 706484914 711793661 716606796 720987082 724925816
2996.2 724925816 728529155 732054710 735590100 739154637 742835164 746538818 750229061 754152596
3012.5 754152596 758416057 762898266 767380238 771541357 775180876 778317213 781012177 783232510
3028.8 783232510 784965336 786324143 787353814 787855208 787504911 786032200 783166707 778541803 772100151
3047.2 772100151 764839947 758692741 755256891 754879892 756572783 758510768 759259641 758707523 757761717
3065.5 757761717 757296205 757602513 758430541 759148955 759316862 759109437 759179771 760215461 762483418
3083.9 762483418 765725553 769250095 772258699 774165094 774563611 773410261 771321774 769356191
3100.2 769356191 768463492 769045949 771004796 773958206 777284205 780416548 783077180 785136402 786434293
3118.6 786434293 786909401 786776543 786409497 786276460 786814511 788071990 789724231 791407645 792926073
3136.9 792926073 794273794 795432925 796337724 797047496 797644198 798151255 798575342 798963726 799418449
3155.3 799418449 799909651 800305784 800555646 800717652 800888300 801079869 801255286 801373482 801391721 801417172
3175.7 801417172 801554799 801687777 801714838 801686823 801683009 801689863 801661432 801651120 801733613 801908672 802135706
3198.1 802135706 802377701 802586794 802708328 802720249 802659035 802542746 802344978 802115560 801881373 801594555
3218.5 801594555 801313996 801114559 800955832 800796509 800640702 800481498 800369680 800423265 800595582 800759852
3238.9 800759852 800913692 801064670 801191866 801297784 801393569 801494777 801576078 801609159 801661849 801736414
3259.3 801736414 801750779 801732361 801698625 801597714 801477432 801424086 801411688 801373780 801301420 801214576 801116288
3281.7 801116288 800985098 800776243 800488353 800164998 799816608 799490511 799313545 799331903 799448013 799582481
3302.1 799582481 799726009 799881876 800059378 800275326 800500095 800603449 800534785 800435066 800335824 800049663
3322.5 800049663 799534082 798977435 798491478 798053443 797662795 797386408 797299147 797446728 797851205 798446357
3342.9 798446357 799071193 799599648 800065398 800624251 801290035 801854968 802213192 802456260 802626610 802692711
3363.3 802692711 802657545 802557647 802484810 802528977 802595377 802548409 802433312 802270651 802024662 801720500 801359236
3385.7 801359236 800877631 800212502 799495578 798859119 798074603 796905577 795515239 794199884 792867362
3404.1 792867362 791145802 788954258 786419153 783605039 780595183 777400732 773954451 770370603
3420.4 770370603 766917467 763669729 760631859 758156419 756817162 756814957 757849634 759664416 762079477
3438.8 762079477 764744580 767403960 770000100 772616923 775285661 777773738 779949725 781898081
3455.1 781898081 783588052 784969270 786197066 787316978 788144946 788715541 789339662 790103495 790729225
3473.4 790729225 791032612 791074872 791030824 791067779 791040361 790799975 790504813 790196776 789765954 789210260
3493.8 789210260 788608968 788041055 787433565 786686420 785961211 785341442 784648657 783775389 782758415
3512.2 782758415 781755447 780827820 779830039 778697550 777485013 776237249 774945378 773628354 772418797
3530.6 772418797 771260202 769968987 768672645 767572880 766562462 765536189 764646888 764072478 763711691
3548.9 763711691 763420880 763343692 763519228 763807654 764252663 764910161 765672028 766479135 767592847 769082725
3569.3 769082725 770497620 771679163 772752821 773717642 774506330 775114417 775429487 775346220 775106549
3587.7 775106549 774877667 774405777 773688614 772947490 772159040 771256149 770436645 769754827 768932700 767978251
3608.1 767978251 767178595 766360998 765287042 763990164 762522161 761249363 760402679 759776592 759169519
3626.4 759169519 758811653 759371936 760370493 761421800 762634039 763938546 765297771 766711712 768092811
3644.8 768092811 769471645 771312237 773822129 776121199 778021336 780122221 782304287 784254253
3661.1 784254253 786151111 787980497 789566457 791179657 793023109 794521213 795995951 797640860
3677.4 797640860 798800409 799691260 800586224 801484525 802586019 804111958 805659890 806798875 807618737
3695.8 807618737 808279157 808803618 809292197 809879720 810425639 810832918 811378479 812381148 813199580
3714.1 813199580 813155711 812464833 811528683 810630143 809972405 809616089 809492230 809480369 809625447 810039282
3734.5 810039282 810838163 811757147 812287509 812459111 812798083 813203514 813141882 813012302 813153267 813173473
3754.9 813173473 813030005 813069999 813392222 813617706 813716531 813847721 814016998 814318299 814572692 814583838
3775.3 814583838 814512312 814603984 814819217 814942896 815026581 815113783 815083265 814907074 814611375 814279497
3795.7 814279497 813974798 813594937 813441634 813595057 813663483 813937545 814250112 814185917 813975513 813974857
3816.1 813974857 814051092 814036906 814307809 814546585 814524651 814516962 814415812 814205945 814041674 813909054
3836.5 813909054 813963532 814225972 814403176 814439178 814349711 814090669 813693404 813467324 813741326 813973069
3856.9 813973069 813972414 813917398 813852727 813858271 813894153 813886940 813942134 813956678 813979626 814001977 813919425 813959002
3881.4 813959002 813986063 813929617 813962400 813864708 813745499 813775837 813682258 813386142 813073993 812901556 812925458
3903.8 812925458 813136995 813343108 813391745 813264310 812977552 812703848 812613726 812652469 812683344 812674701 812720299
3926.2 812720299 812799275 812837481 812853396 812857151 812848270 812803924 812681139 812545419 812472463 812437475 812422395
3948.7 812422395 812387645 812328875 812251031 812121749 812005401 811963320 811916471 811739862 811477125 811276495
3969.1 811276495 811141670 811003983 810841441 810639739 810446441 810314655 810178161 809992135 809866548 809845328
3989.5 809845328 809782386 809675097 809683323 809772432
3997.6 809772432
##END=$$ End of the data block
