##TITLE=DI 15-0472551-6 Base $$ Begin of the data block
##JCAMP-DX=5.00 $$ ACD/SpecManager v 10.08
##SPECTROMETER/DATA SYSTEM=Alpha
##DATE=16 Apr 2015 10:34:42
##DATA TYPE=INFRARED SPECTRUM
##DATA CLASS=XYDATA
##ORIGIN=
##OWNER=
##NPOINTS=1765
##FIRSTX=399.76428223
##LASTX=3997.64306641
##MAXX=3997.64306641
##MINX=399.76428223
##MAXY=0.84901631
##MINY=0.00407781
##XFACTOR=1.0000000000
##YFACTOR=1.000000000000000e-9
##FIRSTY=0.78411531
##DELTAX=2.03961372
##XUNITS=1/CM
##YUNITS=ARBITRARY UNITS
##XYDATA=(X++(Y..Y))
399.8 784115314 785584927 784344912 781995952 779265583 776651740 773814857 770101666 765811801
416.1 765811801 760617256 755460680 752431512 750614107 749534369 748688281 747575283 746941686 747360706
434.4 747360706 748398602 750144362 753560960 758868456 764907539 770536423 775213361 778589368
450.8 778589368 780835152 782349288 783281267 783325255 782457948 781077445 779297352 776949883 774096191
469.1 774096191 770670533 766733110 763016999 759694159 756501555 753328621 750317216 747466624
485.4 747466624 744276226 740151584 734308124 726348400 717282295 709321618 704995275 705519795 709917128
503.8 709917128 717232704 727165699 737095475 744158030 747983456 749916553 751360774 752888501
520.1 752888501 754605055 756667018 759353995 762643516 766330659 770297706 774388134 778536558
536.4 778536558 782752514 786922395 790788293 794371247 797945738 801348925 804317594 807171285
552.7 807171285 810110629 812769532 814955354 816731930 818120182 819244087 820272624 821269214 822103977
571.1 822103977 822869360 823836446 824818850 825430691 825571477 825580418 825732410 825843573 825819373 825769305
591.5 825769305 825729549 825690448 825691462 825677931 825462580 825113475 824723840 824145555 823528707 823061347 822423697
613.9 822423697 821467698 820734084 820301354 819422543 817676008 814580560 807508349 796550512 791593730
632.3 791593730 798567772 808247209 812554121 812953949 812242806 811151981 809682369 808175921 806993067
650.6 806993067 806101441 805452287 804940403 804296970 803488672 802500367 800469220 795564890 790642560
669 790642560 790006697 788537562 783764720 777111828 771799624 770603418 772869468 775719941 777239323
687.3 777239323 776990831 774992347 771035790 764242947 753130972 737357795 719763875 703901768
703.7 703901768 690360546 678039432 666669607 654769182 635436356 595642269 518386483
717.9 518386483 392831922 241940320 120485023 61683867 54864198 75659052 114792489
732.2 114792489 177622154 273624033 401279896 536094010 645788848 716822922 756879508
746.5 756879508 778820992 791310787 798792541 803436637 806287348 807800651 808163226 807517409
762.8 807517409 806060255 803908348 801236570 798348486 795374274 792168498 788427711 783674181
779.1 783674181 776963532 766928554 752150893 731857717 706681371 682020366 670511484 680816472
795.4 680816472 703271031 719939232 725413680 725687087 725580573 725934565 726589441 727552533 728734910
813.8 728734910 730016887 731245816 731903255 731410205 729493916 726079226 721129775 714492023 706173599
832.2 706173599 696539342 686389148 676888049 668890476 662420690 657349825 654351234 654375851 657102942
850.5 657102942 660902321 664444089 666856647 666733027 661832690 649303138 625550449 586299419
866.8 586299419 530474603 473119617 443241805 451345354 481507361 517614305 552254438 581304133
883.2 581304133 603179574 618144095 626915872 630479276 630460918 629239619 629679859 634552777 645708978
901.5 645708978 663210094 685239732 708824337 730884790 749214709 763019502 772747517 779332280
917.8 779332280 783623636 786258042 787766337 788523495 788702786 788501561 788123131 787594795 786835492
936.2 786835492 785821736 784644783 783383548 781989396 780405045 778618932 776449442 773632407
952.5 773632407 770003259 765256286 758837700 750279367 739300430 725693464 709823012 693655610
968.8 693655610 681280315 677054226 682049036 693068981 705571353 716540873 724759459 729899526
985.1 729899526 732402802 733974397 736185133 738403380 738839328 736782670 732435167 725638270 714971721
1003.5 714971721 697172403 667276323 617260098 534091949 416428953 301135600 241838247
1017.8 241838247 253533989 306818783 371304989 432939708 478440017 499839336 503682435
1032 503682435 498924226 489552706 477978349 467557281 462210447 465118468 477574199 498680443
1048.4 498680443 526013494 556197107 585350215 609664738 626349211 634386301 634456515 627835631
1064.7 627835631 615468144 597592771 573486626 541316271 498850226 445472568 384130478
1079 384130478 321086556 262528211 211223230 166606158 127659217 94735019 68877637 50567400
1095.3 50567400 39300192 34042060 33652745 37359282 44645514 54220609 63062720 67862123
1111.6 67862123 67510784 63295506 57893924 54267779 54212902 57679947 63454486 70310824 78344002
1129.9 78344002 89538783 106837466 132133737 165109396 204557374 250080764 301487625
1144.2 301487625 357142240 413936794 468457341 517787039 559656501 592837870 617602408
1158.5 617602408 635118365 645946741 648825765 641472101 624213159 603081584 587362170 583532810
1174.8 583532810 592480898 611052394 634248495 656725168 674520373 686282575 692563951 694275320
1191.1 694275320 692137837 686964393 679739356 671388328 662533998 653430581 644069195 634231031
1207.5 634231031 623527229 611350536 596959829 579530001 558178663 532504141 502998114
1221.7 502998114 469844788 431095004 382991821 322984159 253397435 182459250 120622069
1236 120622069 74786149 45563150 29016180 20316398 15863603 13537192 12186403 11218182
1252.3 11218182 10332684 9373760 8392251 7590085 7194492 7255695 7806293 8841559 10297500 11965498
1272.7 11965498 13662595 15379706 17150279 19113850 21483799 24510715 28379899 33503633
1289 33503633 40602542 50895065 66096149 88042825 117281899 151460975 186581016 220943585
1305.4 220943585 256348163 293877572 332196146 369354457 404152572 437411606 470505148
1319.6 470505148 503191829 534240842 561020434 579042077 582932293 567339540 529940546
1333.9 529940546 474903256 413246185 364475220 351953030 384402722 450332850 524349272
1348.2 524349272 584447384 624004304 646492839 656077564 654462159 639994502 608259618 563540339
1364.5 563540339 519145191 484889776 468805283 472236186 490532964 514861047 538460314
1378.8 538460314 558200657 571391761 578045249 579870343 577656984 571162343 558916748 539054215
1395.1 539054215 512355328 476729274 431270659 373285264 299969167 234039888 206494659
1409.4 206494659 236451179 320865393 428776056 534871995 622943223 672550321 694685280
1423.7 694685280 703107774 699833155 685193479 662560403 637374699 608870447 581852376 565337718
1440 565337718 555499017 548365653 542172790 534994185 527570009 522141337 521405399 531771719 557024598
1458.3 557024598 583050132 607689619 635037363 657223940 667071760 672491372 685826659 707151532
1474.7 707151532 726526439 742331862 756130278 768373907 778023005 785192013 790085554 791911840
1491 791911840 789653301 780504823 757252276 714797258 658780694 605938435 582988977 627376318
1507.3 627376318 692360044 730426848 751910746 762701631 766999364 767381608 765413642 763579547
1523.6 763579547 763226986 764374375 766888261 770205379 774551570 778482258 780905008 782588005
1539.9 782588005 784274161 785614073 786329329 786339998 785673678 784760237 783609688 782105625 779355884
1558.3 779355884 776126444 773692548 769779325 763326168 752346992 734428704 713244736 686326563
1574.6 686326563 654769659 644699931 662539244 696160495 729633808 752300203 764478087
1588.9 764478087 770558834 773480654 774090290 772527575 769177079 764525533 758886993 752122521
1605.2 752122521 743314683 732247710 721367359 714719355 716102362 726555407 736848652 742277086
1621.5 742277086 744538903 744841099 744248152 743368030 742449760 741108477 739327848 738189459 737463117
1639.9 737463117 736326516 734591842 732010067 729400814 727684498 724701941 719536126 715315759
1656.2 715315759 710498631 703122437 692311943 679803848 668063104 654602826 639030874 625615060
1672.5 625615060 611312091 594443440 578291059 562795937 547584534 534376264 526227951
1686.8 526227951 518094659 505530000 488915831 463526487 428351790 384031773 322705209
1701.1 322705209 264431745 204725206 138573393 84884025 46984751 23036676 10338651
1715.3 10338651 5133438 4077812 4084732 4481441 5053513 6045157 7447772 10071870 16503381
1733.7 16503381 27806470 45096681 79098463 135402843 208890408 293266743 380726755
1748 380726755 466751665 538445234 587462842 624725223 656213105 680371106 700659394 716492236
1764.3 716492236 728128552 738053620 746572256 754623711 761656821 766949117 771370411 775615752
1780.6 775615752 779468894 782970369 786004186 788426399 790506065 792755842 794841588 796367466
1796.9 796367466 797561646 798611999 799645483 800436497 800960898 801255047 801519096 801759779 801867485
1815.3 801867485 801887572 802052677 802480578 803158462 804351866 805980146 808176219 810963690 813801706
1833.6 813801706 816551149 819380105 822114110 824600756 827313423 830373585 833283961 835895538
1850 835895538 838246703 840298593 842083871 843570888 844812453 845853150 846616030 847077191 847420454
1868.3 847420454 847978115 848561704 848919570 849016309 848970830 848835468 848592341 848220825 847704947 847029030
1888.7 847029030 846318305 845662415 844879389 844042718 843207538 842349052 841482222 840610147 839647770 838568330
1909.1 838568330 837530792 836566269 835523248 834288538 833060384 831833780 830452561 829009891
1925.4 829009891 827485263 825752020 823748291 821433067 818854868 816075683 813074410 809833467
1941.7 809833467 806698859 804142654 802161992 800740719 799906611 799537182 799522042 799955368 801144063
1960.1 801144063 803370118 806557894 810249805 813884616 816993177 819470406 821427464 822974265
1976.4 822974265 824235439 825320423 826289833 827181160 828082621 829080880 830230594 831547678 832952738
1994.8 832952738 834286809 835510373 836689115 837821841 838863015 839812398 840704441 841512620 842212796
2013.1 842212796 842828393 843422711 844044447 844635665 845133245 845570028 845980167 846343398 846624374 846816897
2033.5 846816897 846954346 847014248 846949458 846800923 846659064 846503079 846246839 845884442 845429480 844871998
2053.9 844871998 844238043 843578339 842900932 842178524 841361940 840487242 839641213 838791132 837919533 837073743
2074.3 837073743 836271524 835510314 834788620 834119081 833489299 832873642 832302392 831807971 831330717 830849171
2094.7 830849171 830442131 830132127 829882622 829659939 829446256 829235077 829042971 828890562 828813672 828867674
2115.1 828867674 829029441 829233408 829452217 829713821 830047369 830383301 830653012 830890059 831126750 831348658
2135.5 831348658 831540346 831724465 831933677 832180858 832489967 832884967 833387971 833963156 834566057 835209727
2155.9 835209727 835895479 836613536 837356091 838076711 838739812 839352548 839905322 840398192 840831399 841216028
2176.3 841216028 841569364 841861546 842067182 842240512 842409074 842525601 842601061 842652261 842628598 842501760
2196.7 842501760 842310965 842041552 841641247 841149092 840650797 840232134 839962900 839826345 839746654 839692831
2217.1 839692831 839618921 839465618 839256883 839042187 838820338 838580430 838315427 838038385 837746799 837418079
2237.5 837418079 837072313 836710334 836323440 835903347 835430026 834916949 834436953 834064960 833798230 833602548
2257.9 833602548 833458781 833365917 833291709 833186507 833072841 832919002 832613707 832174540 831653535 831039071
2278.3 831039071 830395401 829852760 829498887 829386711 829549670 829944015 830496669 831139922 831795990 832354307
2298.7 832354307 832720339 832830787 832568586 831934750 831100285 830189884 829274237 828290224 826890171
2317 826890171 824879527 822685719 820988953 819868624 818853319 817800939 817032814 816614270 816122293
2335.4 816122293 815374911 814604878 814160466 814637482 816649556 818792760 818638921 815540493 810837865
2353.7 810837865 806516111 803350925 801394582 800734878 801283479 802624643 804482639 806798041 809411049
2372.1 809411049 811973214 814346313 816640079 818843663 820726156 822096407 822958469 823441684 823725224
2390.4 823725224 823965549 824237108 824527740 824866176 825324237 825854301 826396942 826973021 827557921 828104615
2410.8 828104615 828656673 829251766 829852402 830456316 831076622 831708431 832342029 832947373 833534062 834115386
2431.2 834115386 834672570 835183084 835631609 836029172 836394131 836734295 837009847 837185740 837291062 837357342
2451.6 837357342 837385476 837380409 837369978 837331712 837220430 837083519 836961389 836801767 836573899 836300910
2472 836300910 835996449 835648954 835247457 834793806 834325075 833865583 833365798 832824707 832279086 831714928
2492.4 831714928 831169724 830691099 830245614 829833090 829477072 829162121 828879893 828637123 828409493 828138292
2512.8 828138292 827842891 827566206 827273071 826946497 826615810 826334774 826142251 826000273 825879514 825786114
2533.2 825786114 825714111 825669527 825637102 825595737 825571418 825554252 825493991 825418293 825398266 825427592 825461149
2555.6 825461149 825495481 825545967 825606167 825643122 825669527 825752795 825866640 825952947 826037049 826099455 826088727
2578.1 826088727 826090634 826235116 826518178 826896012 827381492 827958941 828551650 829086304 829533994 829899132
2598.5 829899132 830206037 830456257 830621004 830708623 830740869 830738544 830747426 830767930 830752373 830650151 830440402
2620.9 830440402 830157220 829878092 829693913 829698086 829962075 830500185 831234932 831993759 832657218 833196402
2641.3 833196402 833592176 833878577 834105849 834269881 834360600 834423304 834534168 834680498 834760904 834767342
2661.7 834767342 834777176 834800601 834802926 834750891 834656715 834574819 834510803 834461331 834446549 834454358 834461629 834472358
2686.2 834472358 834470332 834437549 834398806 834333539 834198236 834017932 833812714 833568871 833314955 833065391
2706.6 833065391 832794249 832530320 832307756 832112253 831925869 831703961 831384182 830956757 830463290 829979181
2727 829979181 829549730 829133868 828693688 828229904 827767313 827328742 826891482 826443672 826001167 825585961
2747.4 825585961 825249135 824999452 824755847 824494720 824286819 824163795 824104249 824088931 824080408 824043453
2767.8 824043453 823974848 823827386 823612928 823431432 823245227 822955430 822553575 822062671 821499825 820913136
2788.2 820913136 820380867 819896281 819360673 818718195 818018615 817323506 816666842 816147625 815818071 815635920
2808.6 815635920 815637767 815807819 815965474 815965474 815739512 815268397 814608157 813828290 812945545 811933935 810781002
2831 810781002 809466064 807956398 806249261 804281473 801862478 798777938 794982135 790801823 786903501
2849.3 786903501 783793092 781500101 779910505 778914452 778277934 777736247 777040720 776035547 774764001
2867.7 774764001 773307800 771667898 769889057 767966568 765660644 762760341 759400547 755958319
2884 755958319 752920449 750801980 749882221 750078261 751069665 752407014 753518343 753771901 752883494
2902.4 752883494 751426458 750607848 751278460 753285468 755785108 758031547 759816766 761201203 762184799
2920.7 762184799 762808383 763108492 762925982 762099028 760572553 758041501 753914297 747662961 738947034
2939.1 738947034 727651596 714042783 698846698 683007479 667476714 653158486 640764713
2953.4 640764713 630892277 624046087 620394409 619775057 621805191 625949442 631806791 639376998
2969.7 639376998 648717225 659258723 669981420 680110216 689268231 697417021 704776347 711535156
2986 711535156 717677534 723126888 727913797 732161045 735947549 739348054 742571831 745795906 749058008
3004.4 749058008 752332807 755549014 758776844 762336373 766566396 771484375 776620388 781367302
3020.7 781367302 785410345 788758218 791544855 793801367 795559227 796941042 797949612 798429847
3037 798429847 798156917 796859145 794173717 789750755 783619583 776617825 770503283 767002702 766593158
3055.3 766593158 768267214 770199537 770985484 770475090 769510746 769006371 769264996 770004034 770711064
3073.7 770711064 770963609 770789385 770823300 771835923 774084389 777226031 780632913 783612549 785496116
3092.1 785496116 785835803 784682572 782657623 780752957 779896080 780498505 782409608 785191536 788333774
3110.4 788333774 791323304 793816984 795722544 796950758 797427416 797325790 797024250 796940923 797389030
3128.8 797389030 798434436 799919307 801562607 803111672 804465890 805588543 806465447 807167411 807778060
3147.1 807778060 808278143 808672786 809073508 809516013 809931099 810291350 810557485 810714304 810870945 811020732
3167.5 811020732 811092675 811138690 811157346 811177671 811264157 811348855 811405659 811458111 811428010 811270833 811154306
3189.9 811154306 811230421 811389208 811560571 811785638 812011361 812218428 812411189 812527478 812550187 812473297
3210.3 812473297 812255442 812039971 811956763 811778486 811437607 811180949 811045587 810928822 810810089 810687900
3230.7 810687900 810615718 810680449 810822070 810936511 811058402 811193168 811272264 811377645 811601281 811786234
3251.1 811786234 811783016 811686277 811601162 811516166 811457813 811437905 811380565 811280787 811179459 811055183 810943544
3273.6 810943544 810906708 810873508 810724318 810466111 810225606 810004652 809660912 809236586 808896244 808668435
3294 808668435 808501422 808336973 808173060 808062375 808039546 808143139 808374465 808603168 808680713 808659673
3314.4 808659673 808595240 808436036 808183372 807787418 807209969 806577981 805982888 805360913 804737031 804306269
3334.8 804306269 804161191 804266512 804597795 805088460 805616915 806021214 806281149 806653798 807212889 807688355
3355.2 807688355 807959199 808166027 808421910 808630466 808629155 808493614 808454335 808569849 808661222 808626950
3375.5 808626950 808556199 808451474 808321297 808193982 807925582 807454884 806874156 806274354 805686772 804970205
3395.9 804970205 803953469 802719653 801476479 800161719 798490822 796358049 793872595 791166782
3412.3 791166782 788283110 785096467 781506598 777673960 773793340 769903898 766140163 763019264
3428.6 763019264 761392415 761718035 763570964 766309738 769498289 772716701 775715053 778523505
3444.9 778523505 781292498 784038365 786618769 788930833 790914595 792571664 794010341 795378327
3461.2 795378327 796592116 797463477 798146784 798961580 799898446 800622165 800969720 801049948 801065266 801164389
3481.6 801164389 801194966 801026881 800815463 800625741 800313413 799815655 799239874 798706591 798170924 797534227
3502 797534227 796941936 796400070 795635164 794707298 793850541 793069959 792259336 791333735 790284336 789106786
3522.4 789106786 787847936 786599576 785414219 784366488 783358514 782223582 781088769 780146003
3538.7 780146003 779275358 778321981 777395964 776766896 776481032 776294947 776244223 776519001 776987016 777508855
3559.1 777508855 778148234 778919756 779735565 780758321 782190979 783705592 785006642 786172628 787248909
3577.5 787248909 788117290 788742423 789120018 789202273 789073408 789033234 788972974 788555682 787899554 787250757
3597.9 787250757 786519349 785712004 784980655 784162223 783135831 782146573 781150222 780047536 779069483
3616.2 779069483 778103888 777171910 776614189 776278734 775849819 775322318 775397420 776161015 777096093 778042853
3636.6 778042853 779037476 780157089 781329513 782371938 783359170 784781873 786811471 788880348 790791869
3655 790791869 792740464 794706464 796577156 798391342 800086498 801456928 802603006 804015219 805483222
3673.3 805483222 806680560 807882905 809030056 809992611 810963631 812004149 813028514 814211547 815798640
3691.7 815798640 817377865 818513870 819318712 819935083 820355773 820904911 821591675 822025001 822134852
3710 822134852 822294950 822836757 823291540 823221684 822739840 822145164 821684062 821472943 821438789 821316719
3730.4 821316719 820995986 820732534 820943356 821584523 822204411 822328508 821906209 821731806 821633458 821168661
3750.8 821168661 821003079 821294069 821520925 821566939 821739554 822038293 822172523 822193682 822303653 822597325
3771.2 822597325 822966456 823191106 823200405 823054314 823022127 823101819 823170483 823318839 823403537 823309362 823055983
3793.7 823055983 822629452 822258413 821886718 821405888 821406662 821617126 821695566 821934760 822214484 822184980
3814.1 822184980 821834743 821676672 821565568 821543217 821909249 822152257 822206318 822179854 822061479 821973681
3834.4 821973681 821736991 821436048 821563721 821834981 821920574 821956575 821958363 821752846 821122646 820730984
3854.8 820730984 821133375 821578860 821639895 821386635 821233690 821348906 821277797 821099281 821198225 821392000
3875.2 821392000 821552515 821433961 821179271 821114123 820999861 821027756 821184397 821084380 820951283 820978105
3895.6 820978105 820860803 820434988 819968283 819806039 820048630 820426047 820579708 820477605 820260644 819958270
3916 819958270 819667459 819547415 819550037 819607913 819770694 819886088 819786489 819650829 819660306 819729507 819749892
3938.5 819749892 819639027 819426239 819344997 819420993 819446206 819375873 819298089 819237292 819158375 819025695 818845272
3960.9 818845272 818675816 818526089 818393171 818271577 818093359 817871094 817713439 817602754 817428946 817227364
3981.3 817227364 817130983 817134202 817049921 816855788 816721857 816674054 816697657 816749513
3997.6 816749513
##END=$$ End of the data block
