##TITLE=DI 15-0472551-6 $$ Begin of the data block
##JCAMP-DX=5.00 $$ ACD/SpecManager v 10.08
##SPECTROMETER/DATA SYSTEM=Alpha
##DATE=16 Apr 2015 10:34:42
##DATA TYPE=INFRARED SPECTRUM
##DATA CLASS=XYDATA
##ORIGIN=
##OWNER=
##NPOINTS=1765
##FIRSTX=399.76428223
##LASTX=3997.64306641
##MAXX=3997.64306641
##MINX=399.76428223
##MAXY=0.86140370
##MINY=0.03176414
##XFACTOR=1.0000000000
##YFACTOR=1.000000000000000e-9
##FIRSTY=0.78057963
##DELTAX=2.03961372
##XUNITS=1/CM
##YUNITS=ARBITRARY UNITS
##XYDATA=(X++(Y..Y))
399.8G80579627j252592q15153j491189k146900j992226j884162k141893k209723k177536
418.1G64468253k214849j362503m23491K32875J061738J918972K197206K045631J880169
436.5G69804001J800656J964748K038777J826644J800418J870513J664519J261413
452.8G84031689O71208K26438p5340o10829r83953j178145j641036k005517k013147
471.2G76421368k102256k114415j903593j665593j442074j479864j859427k220452
487.5G61633694k654195l555536m529476m849374l980697j391947K478123N592942
503.8G48743534O580532O248712N113363L569842K313018J767635J634538J655102
520.1G77626276J742423J947045K273917K296627K318978K724111L083289L065645
$$ plain form
399.8 780579627 779327035 778511882 777020693 774873793 772881567 770997405 768855512 766645789 764468253
418.1 764468253 762253404 760890901 760467410 760700285 761762023 763680995 765878201 767923832 769804001
436.5 769804001 771604657 773569405 775608182 777434826 779235244 781105757 782770276 784031689
452.8 784031689 784702897 784929335 784853995 784243166 783259213 782081068 780440032 778434515 776421368
471.2 776421368 774319112 772204697 770301104 768635511 767193437 765713573 763854146 761633694
487.5 761633694 758979499 755423963 750894487 746045113 742064416 740672469 743150592 748743534
503.8 748743534 755324066 761572778 766686141 770255983 772569001 774336636 775971174 777626276
520.1 777626276 779368699 781315744 783589661 785886288 788205266 790929377 794012666 797078311
536.4G97078311K874256K833306K955378K908110K526462K193690K279639K521992
552.7H18171144K541184K361655K008081J695335J637756J549423J174092O98030O59466
571.1H32496166J034260J223624J065790P41780L76642J66953K66611M08769L59058
589.4H38139653L81172M47750K91646J51574J51932R9659M18N5849K27153K59281K20835
611.9H40426922K52247J87635l4213k04682l97682q30949j757860m557073p069230
630.2H26015115k698004N282342O743312L022730N33641n9724j79827m00723n59091
648.6H37699771n01871l82006m88341n78165n40495o24716o36638n34951q37982j834095
669H30740511k035498k210081l328979m355728l608108r23991J506448J925468Q58486
$$ plain form
536.4 797078311 799952567 802785873 805741251 808649361 811175823 813369513 815649152 818171144
552.7 818171144 820712328 823073983 825082064 826777399 828415155 829964578 831138670 831836700 832496166
571.1 832496166 833530426 834754050 835819840 836561620 836938262 837105215 837371826 837780595 838139653
589.4 838139653 838520825 838968575 839260221 839411795 839563727 839663386 839663804 839719653 839946806 840206087 840426922
611.9 840426922 840679169 840866804 840832591 840627909 840230227 839399278 837641418 833084345 826015115
630.2 826015115 823317111 828599453 835342765 838365495 838899136 838839412 838659585 838258862 837699771
648.6 837699771 837197900 836815894 836327553 835749388 835208893 834584177 833947539 833412588 832574606 830740511
669 830740511 828705013 826494932 823165953 818810225 815202117 814278126 815784574 817710042 818568528
687.3H18568528n69225j879096l071665m780174p628023j0702491j1710227j0354101
703.7G67873526q742452p765651o685316o629467j1871457k6560784n3695083r6015095
720E49908221j39067590j43757940r3889117k3851574K6023627N4451749P8483834
734.3C08301210J04929448J23421669J16866290Q6265326N1438749K7157008J3859332
748.5H32239032P050276L677725K067089J239062P50303K09153n52416j300633j819015
766.9H43560576k157628k420247k615392k702832k902866l662645n240381p795692
783.2H14062893j1383354j5573263j9117177j8503845r174347N953610J4377117J0200143
799.5G70841777K356053r44853p17223K51472J033128J399219J533508J567364J369059
$$ plain form
687.3 818568528 817999303 816120207 813048542 808268368 800640345 789937854 778227627 767873526
703.7 767873526 759131074 751365423 744680107 738050640 726179183 699618399 645923316 549908221
720 549908221 410840631 267082691 173193574 149342000 175365627 229817376 308301210
734.3 308301210 413230658 536652327 653518617 739783943 791222692 818379700 832239032
748.5 832239032 839289308 842967033 845034122 846273184 847023487 847232640 846680224 845379591 843560576
766.9 843560576 841402948 838982701 836367309 833664477 830761611 827098966 821858585 814062893
783.2 814062893 802679539 787106276 767989099 749485254 740310907 746264517 760641634 770841777
799.5 770841777 773197830 772252977 771535754 771787226 772820354 774219573 775753081 777320445 778689504
817.9G78689504R37283L16202m33027j246512k197683l309846m431069n241096n349398
836.2G57734358m502892k911031j309336l59118o2763N841J15633K68936L74138J13309
856.6G49467075j225591m474699j0263682j8787920k9046834l7373125l7155807k4160028
873E86979389l195584J5450955K5252819K6190758K1824896J5942097J0589778O134927
889.3G05170035K592326K76506l96014R96232M393876Q948266J3365508J6305387J6980350
907.6G68632472J5434920J2388349Q915126N850196L458381J705825N76437P808k65062
926H16704452m74811o60955q70288j031160r53913p23362o08206p05778r07541j083433
946.4H08685005j246631j502693j868308k344370k922237l567397m394829n381585
$$ plain form
817.9 778689504 779626787 779942989 779509962 778263450 776065767 772755921 768324852 763083756 757734358
836.2 757734358 753231466 750320435 749011099 748651981 748589218 748595059 748710692 748979628 749353766 749467075
856.6 749467075 748241484 743766785 733503103 714715183 685668349 648295224 611139417 586979389
873 586979389 583783805 599234760 624487579 650678337 672503233 688445330 699035108 705170035
889.3 705170035 707762361 708038867 707642853 708639085 713032961 721981227 735346735 751652122 768632472
907.6 768632472 784067392 796455741 805370867 811221063 814679444 816385269 816961706 816969514 816704452
926 816704452 816229641 815568686 814698398 813667238 812713325 811989963 811381757 810675979 809768438 808685005
946.4 808685005 807438374 805935681 804067373 801723003 798800766 795233369 790838540 785456955
962.7G85456955o210923o592273o176532m683256k305090K36153J995921K689422K724289
981.1G67134666K394081J857817J232981N15402k79308j202881k279162l417015m716039
999.4G61240542o428063r218693j4371812k3227811l8596034o5715075r5988452r4326884
1015.7D13367718l9761126L3093393P1421474O3702345L6756337J4614821K559840
1030E95754802k971351n957246q193135r369850q168161l767312L219962J0993958
1046.3E71541667J7629921K1848202K3167670K1549463J7189026J1008382M374981
1060.6F88309312j626611o528377j0533035j4425516j9106925k5342822l3586562m2950689
1076.9E34208775n0827176n4568142n3853034n1013589m8617632m6759218m3450325
$$ plain form
962.7 785456955 779246032 772653759 766477227 761793971 759488881 759725034 761720955 764410377 767134666
981.1 767134666 769528747 771386564 772619545 773134947 772855639 771652758 769373596 765956581 761240542
999.4 761240542 754812479 745593786 731221974 707994163 669398129 603683054 507694602 413367718
1015.7 413367718 373606592 406699985 478121459 541823804 578580141 593194962 595754802
1030 595754802 592783451 586826205 578633070 569263220 561095059 557327747 560547709 571541667
1046.3 571541667 589171588 611019790 634187460 655736923 672925949 683934331 688309312
1060.6 688309312 686682701 680154324 669621289 655195773 636088848 610746026 577159464 534208775
1076.9 534208775 483381599 428813457 374960423 323946834 275329202 228569984 185119659
1091.2A85119659l7098274k7950063j7559670p249005K456829J1455468J9261994K3974299
1107.5A52411237K1847338J1444419j915618j0168702r917780l196016O367579J5588194
1123.8A82460651K2003010K4216637K2953465K0603627J9455523K0753264K4850965
1138.1C37297142L1469702L9323896M5949489M8725963M6808898M1621030L5282194
1152.4F26478314K8886974K2412181J5839875R737790M313528j331568p823467j3471961
1168.7F85041666j4714897r678065l88980R230733J6222596J9222915J7967582J3532579
1185G36436129P962405K851308j112700l725231m977166n229950n188584n338490n795718
1203.4G15882003o459415p194876q024395r117484j0626554j2661756j5254080j8392384
$$ plain form
1091.2 185119659 148021385 120071322 102511652 95262647 97719476 109174944 128436938 152411237
1107.5 152411237 174258575 185702994 183787376 173618674 163700894 160504878 166872457 182460651
1123.8 182460651 204463661 228680298 251633763 272237390 291692913 312446177 337297142
1138.1 337297142 368766844 408090740 454040229 502766192 549575090 591196120 626478314
1152.4 626478314 655365288 677777469 693617344 703355134 707668662 706337094 698513627 685041666
1168.7 685041666 670326769 660648704 660259724 669490457 685713053 704935968 722903550 736436129
1185 736436129 744398534 747249842 746137142 742411911 737434745 732204795 727016211 721677721 715882003
1203.4 715882003 709422588 702227712 694203317 685085833 674459279 661797523 646543443 628151059
1219.7F28151059k2230387k7309179l4493983m4468820n6837916o8909019p5787962
1234B98113793p3189124o1143592m4298947k8362155j6474992q830130m330214k065983
1250.3E9418656j481034k142209l419482m285793l886156k078090L82569K948075N499698
1268.6E0956234P723332Q633502P545359N160727K894476J777373J963869L231264
1285H9886136N365923Q491368J2782864J8656313K6471764L5729170M3831155M6854108
1301.3B88068801M3905318L9427668L7961870L8142741L6867321L3671587K9814601
1315.6E47859907K7436614K6866317K6383102K4998009K1791041J5659988O187558
1329.8F97182536o519437k0065665k9052257k7891398j3546348Q579076K6807248L5219431
$$ plain form
1219.7 628151059 605920672 578611493 544117510 499648690 442810774 373901755 298113793
1234 298113793 224924669 163781077 119482130 91119975 74644983 65814853 61484639 59418656
1250.3 59418656 57937622 55795413 52375931 48090138 44203982 42125892 42508461 45456536 50956234
1268.6 50956234 58679566 67313068 74858427 80019154 82913630 84691003 86654872 89886136
1285 89886136 95252059 103743427 116526291 135182604 161654368 197383538 241214693 288068801
1301.3 288068801 331974119 371401787 409363657 447506398 484373719 518045306 547859907
1315.6 547859907 575296521 602162838 628545940 653543949 675334990 690994978 697182536
1329.8 697182536 690663099 670597434 641545177 613653779 600107431 608686507 635493755 670713186
1346.2F70713186L3299864K5147616J5762449P648885Q24511n696535j4430642k7560055
1362.5G05709279l7291646l6090017k7228892j1910498M444659J6892076K2206723
1376.7F36731684K1905840J8829107J3318896O851673M6671n982101r452582j2904167
1393.1F69345021j7724454k1717191k8122187l6314547m8892736o6208869o0676813
1407.3C89688224j9272477M2024881Q8990539R5383167P8771413N6094348K8316200
1421.6G59996295J1169016K630949m593610j2322963j7904401j9310057k2106349k1383524
1437.9F76175356j2637317o975949m766166m211009n536198n784810l404796J220822
1454.3F34079933J0105908K1075964K1722913K1179318K3974955K1631778J3960600
$$ plain form
1346.2 670713186 704013050 729160666 744923115 752572000 753396511 747699976 733269334 705709279
1362.5 705709279 668417633 632327616 605098724 593188226 597632885 614524961 636731684
1376.7 636731684 658637524 677466631 690785527 697637200 697683871 691701770 682249188 669345021
1393.1 669345021 651620567 629903376 601781189 565466642 516573906 450365037 389688224
1407.3 389688224 370415747 412440628 501431167 596814334 675585747 731680095 759996295
1421.6 759996295 771165311 773796260 769202650 756879687 738975286 719665229 697558880 676175356
1437.9 676175356 663538039 656562090 651795924 647584915 642048717 636263907 632859111 634079933
1454.3 634079933 644185841 665261805 686984718 708164036 732138991 753770769 767731369
1468.5G67731369R711027Q916497P613063O246090O114423O333947O024182M883170
1484.9H23573768L710687K126277m37498k973497o987512j6148210k8935671l7195801
1501.2G36732543l2936275j0977090L0248284L6965192J8495738R318471M729927K455354
1517.5G95032144J131236K00033j29878J40011N66602J396417K617002M026353L908635
1535.8H08888555L373444L544688K318084P61628J77443q6248l63290n53071o05703
1554.2H17455530n38885j706183l623426l005684l319680m697443p677733j2566925
1570.5G80319571j4622986j8412888k1774828o359816J3255298K3033738K1332026
1584.8G76770115J3431430O773412K996624M69207j997947m079402m829049m186809
$$ plain form
1468.5 767731369 777442396 786358893 793971956 800218046 806332469 812666416 818690598 823573768
1484.9 823573768 827284455 829410732 828973234 825999737 819012225 802864015 773928344 736732543
1501.2 736732543 703796268 692819178 723067462 760032654 778528392 787846863 792576790 795032144
1517.5 795032144 796163380 796363413 796233535 796373546 796940148 798336565 800953567 804979920 808888555
1535.8 808888555 812261999 815806687 818124771 818886399 819063842 818977594 818614304 818061233 817455530
1554.2 817455530 816916645 815210462 811587036 808581352 805261672 800564229 792886496 780319571
1570.5 780319571 765696585 747283697 725508869 719149053 732404351 755438089 776770115
1584.8 776770115 790201545 796974957 799971581 800440788 798442841 794363439 789534390 785347581
1601.1G85347581l047228k488851l219307m754722n169153k770901K467811Q124173
1617.4G74489403P432341M186452K218306Q45373J44422j42098m9531Q583l82185p57456
1637.8G87993610n85616m87983n02169q97527j340866r33766j649082l841221l563702
1656.2G74191678l468097m809439o996870q103847p226527q186639j0071218r089231
1672.5G16239810j0080040j1899590j0538936r238481j0164559j2757957r973586q402943
1688.8F33183718j0948479j3235152k0576477k9621601l9174080n6670308n5548370
1703.1D07409251o2198580p6432526p0446253n8491691m5040198l1720400k0301878
1717.4D2777725q866299k147288J81526J427487L094301M947416Q060612J6365830
$$ plain form
1601.1 785347581 782300353 779811502 776592195 771837473 766668320 763897419 766365230 774489403
1617.4 774489403 781921744 786108196 788326502 789171875 789316297 789174199 789124668 789133251 788751066 787993610
1637.8 787993610 787407994 786920011 786417842 785520315 784179449 783245683 781596601 777755380 774191678
1656.2 774191678 770723581 765914142 758917272 750813425 743586898 735400259 725329041 716239810
1672.5 716239810 706159770 694260180 683721244 674482763 664318204 651560247 641586661 633183718
1688.8 633183718 622235239 609000087 588423610 558802009 519627929 462957621 407409251
1703.1 407409251 345210671 268778145 198331892 139840201 94800003 63079603 42777725
1717.4 42777725 33911426 31764138 31945664 33373151 36467452 41414868 49475480 65841310
1733.7F5841310K6987783L6515862N9743151Q3896905R3148828R2555463Q4105641
1748E42794943P3387027N5841088L6243617K6271761K1119475J5622020J2487292R364426
1764.3G93131649O937624N910277M991710M279316L360867K679765K433062K338648
1780.6H26062918J994252J793563J600147J496911J398503J188636Q93712P62403P40648
1799H37931693N60581L62456J54674O8188p8678j91510k67982k86282l04400k12253
1819.4H37736487Q0467L74972O80924R28640J240671J347780J338423J436948J533032
1837.7H46698344J537263J577795J707256J568734J304805J167298J129746J055062
1854H57746303R28521P50423O08444M65214L58880L25858J98186K1875p0811m4465
$$ plain form
1733.7 65841310 92829093 129344955 189088106 272985011 366133839 458689302 542794943
1748 542794943 616181970 672023058 708266675 734538436 755657911 771279931 783767223 793131649
1764.3 793131649 800069273 805979550 810971260 815250576 818611443 821291208 823724270 826062918
1780.6 826062918 828057170 829850733 831450880 832947791 834346294 835534930 836428642 837191045 837931693
1799 837931693 838492274 838854730 839009404 839077592 838998914 838807404 838539422 838253140 837948740 837736487
1819.4 837736487 837816954 838191926 838872850 839801490 841042161 842389941 843728364 845165312 846698344
1837.7 846698344 848235607 849813402 851520658 853089392 854394197 855561495 856691241 857746303
1854 857746303 858674824 859425247 860033691 860498905 860857785 861183643 861381829 861403704 861332893 861288428
1874.4H61288428p3909j34111k21610k85923l04223l60727m87447o28948o59644o82533
1894.8H57449353p02858o92487o28948n93662o04272o71566p65026p93159p44104o52432
1915.2H50600839o85752q09252r03726r93669j051783j078010j181662j315594j440704
1933.6H41140687j566350j681924j779795j860082j788258j421571r67383m69983O2942
1951.9H29668283N60165R44316J161278J293420J395882J441180J421333J308024J072347
1970.3H40266228Q73029P67946O97494N89549M76778M65631M96209N20587N68807O53386
1990.7H46375644O99580P18355P48813P16150O50644O29545O00993N29528M74870M46022
2011.1H52590144M05669L84331L94821L62694K84195K16544K02238J99080J58727J39773
$$ plain form
1874.4 861288428 861214519 861080408 860858798 860572875 860268652 859907925 859420478 858791530 858131886 857449353
1894.8 857449353 856746495 856054008 855425060 854831398 854227126 853555560 852790534 851997375 851253271 850600839
1915.2 850600839 849915087 849105835 848202109 847208440 846156657 845078647 843896985 842581391 841140687
1933.6 841140687 839574337 837892413 836112618 834252536 832464278 831042707 830075324 829605341 829668283
1951.9 829668283 830228448 831172764 832334042 833627462 835023344 836464524 837885857 839193881 840266228
1970.3 840266228 841139257 841907203 842604697 843194246 843671024 844136655 844632864 845153451 845722258 846375644
1990.7 846375644 847075224 847793579 848542392 849258542 849909186 850538731 851139724 851669252 852144122 852590144
2011.1 852590144 852995813 853380144 853774965 854137659 854421854 854638398 854840636 855039716 855198443 855338216
2031.5H55338216J33812P7069j3113q0228r8765r1731j31369k17318k62618k89441
2051.9H54364514l46601l55780l69668m48763m46797m08232m49300m93168n23568n13792
2072.3H50008845m35710l75628l62396l74854l89397l91066l51489k68996k28047k55704
2092.7H46575558k88725k71916k10881j55509j38461j32382j25409j24812j10984n2988
2113.1H44963491L6478P8142N9604M2320N5074R1076J15335Q2016N2273Q4937J00196
2135.5H45760942P5817Q8214J18554J36793J75714K10226K35259K80083L24249L44396
2155.9H47750247L53336L44634L60846M42803M87864M25458L16680K30312J90556J96278
2176.3H51099014J93000J44363R4592P8738M3630Q405N6863Q7142L397q8692j38879
$$ plain form
2031.5 855338216 855472028 855549097 855535984 855455756 855356991 855265260 855133891 854916573 854653955 854364514
2051.9 854364514 854017913 853662133 853292465 852843702 852396905 851988673 851539373 851046205 850522637 850008845
2072.3 850008845 849573135 849197507 848835111 848460257 848070860 847679794 847328305 847059309 846831262 846575558
2092.7 846575558 846286833 846014917 845804036 845648527 845510066 845377684 845252275 845127463 845016479 844963491
2113.1 844963491 844999969 845078111 845137715 845180035 845235109 845326185 845441520 845523536 845575809 845660746 845760942
2135.5 845760942 845836759 845924973 846043527 846180320 846356034 846566260 846801519 847081602 847405851 847750247
2155.9 847750247 848103583 848448217 848809063 849251866 849739730 850165188 850481868 850712180 850902736 851099014
2176.3 851099014 851292014 851436377 851530969 851609707 851653337 851661742 851718605 851805747 851809144 851720452 851581573
2198.7H51581573k18451k83718k78473k58326k38895j63019o1929j5140L219k98p4983
2221.2H49991560j60456j44422j05262j22249j77979k37465k30849j94609j95980k46286
2241.6H48176003l01660l34858l54946k91705j70350q7798j9193J3829p928l4928p0512
2264H46515954r1970j06514j72853k82348l66389m34816m85361m45723k95520n9486
2284.4H43774974J83046M06146O05166P26402P54893P11202O39678N56170M58837L74198
2304.8H49190712L08454K87652K81811J57356k3186p3195p748L8981K6286N9068J79946
2327.2H50426137K61188J52826j4126j4961L7253K0325k9623k52783o89626p38561
2347.6H49158049l08454N6564J34111N5790j27197m36067o42896p00354p85888q65995
$$ plain form
2198.7 851581573 851363122 851079404 850800931 850542605 850303710 850140691 850078762 850063622 850066841 850066543 849991560
2221.2 849991560 849831104 849686682 849581420 849459171 849281192 849043727 848812878 848618269 848422289 848176003
2241.6 848176003 847874343 847539485 847184539 846892834 846722484 846634686 846615493 846629322 846621394 846586466 846515954
2264 846515954 846423984 846317470 846144617 845862269 845495880 845061064 844575703 844129980 843834460 843774974
2284.4 843774974 843958020 844364166 844969332 845695734 846450627 847161829 847801507 848357677 848816514 849190712
2304.8 849190712 849499166 849786818 850068629 850225985 850202799 850129604 850121856 850160837 850187123 850246191 850426137
2327.2 850426137 850687325 850840151 850826025 850811064 850848317 850868642 850839019 850586236 849896610 849158049
2347.6 849158049 848849595 848906159 849040270 849096060 848968863 848532796 847889900 847189546 846403658 845537663
2368H45537663q48771p99834p54774p35521p51019o91891n25116l38912j89484o6042
2388.4H39836299K4677O7353J19865J87814K27451K48194L06010L99471M31716L58224
2408.8H42207074K75731K94745L55840L76582L75211L86119M09842M11153L80218L39627
2429.2H45812142L12745K93077K56299K30134K43604K43247J95563J27971R4950J13189
2449.6H47922921R4593M2438J0491m1843o2883o139K5272m3213j35481j53303j59622
2472H47493231k19226k44736j88411j77919k44618k80380k98560l33905l39866l25799
2492.4H44839811l31342l16322k86996k76566k46524j85311j43230j47105j51336j41561
2512.8H42613518j49011j68026j57714j14262r0778q6307o8069m4644n364K3544L218
$$ plain form
2368 845537663 844688892 843889058 843134284 842398763 841647744 840955853 840430737 840091825 839902341 839836299
2388.4 839836299 839860976 839928329 840048194 840236008 840463459 840711653 841017663 841417134 841848850 842207074
2408.8 842207074 842482805 842777550 843133390 843509972 843885183 844271302 844681144 845092297 845472515 845812142
2429.2 845812142 846124887 846417964 846674263 846904397 847148001 847391248 847586811 847714782 847809732 847922921
2449.6 847922921 848017514 848059952 848070443 848028600 847965717 847959578 847984850 847941637 847806156 847652853 847493231
2472 847493231 847274005 847029269 846840858 846662939 846418321 846137941 845839381 845505476 845165610 844839811
2492.4 844839811 844508469 844192147 843905151 843628585 843382061 843196750 843053520 842906415 842755079 842613518
2512.8 842613518 842464507 842296481 842138767 842024505 841933727 841847420 841779351 841734707 841729343 841752887 841756105
2535.3H41756105k0623k7299j7762Q35n782j5140o55K3544L2126K9564K6167J9490
2559.7H41800570K9505M7445O7949R9063J07229N9545j9550o1214k9504P3313J88887
2582.2H42363238K53618K74778K99513L29554L09348K53677K04802J65462J14561N6505
2602.6H44625056L7193N6625N2928k145o6281j14083j24872j05619j16527j81854k15411
2625H43845010j38879J6749K21848M32074N38707M47989K76088K16663K20657J96755
2645.4H46273661J37746O8903P4148J12534J02639N1320r001j2696K8253J9431l3140
2667.8H46813798k0921J6629l8325q7023k2471M3630K5869K3186K8074m2856q5175
2690.3H46654415p3492q9527j08957j31130j28150o7771p6592j69098j79529r8527
$$ plain form
2535.3 841756105 841735482 841708183 841690421 841691256 841685474 841670334 841669679 841693223 841725349 841754913 841781080 841800570
2559.7 841800570 841830075 841877520 841945469 842044532 842151761 842211306 842191756 842130542 842101038 842174351 842363238
2582.2 842363238 842616856 842891634 843191147 843520701 843830049 844083726 844288528 844453990 844568551 844625056
2602.6 844625056 844662249 844718874 844771802 844769657 844703376 844589293 844464421 844358802 844242275 844060421 843845010
2625 843845010 843706131 843722880 843944728 844376802 844915509 845363498 845639586 845856249 846076906 846273661
2645.4 846273661 846411407 846480310 846554458 846666992 846769631 846820951 846811950 846799254 846827507 846846938 846813798
2667.8 846813798 846792877 846809506 846771181 846684158 846661687 846705317 846731186 846754372 846782446 846739590 846654415
2690.3 846654415 846580923 846491396 846382439 846251309 846123159 846055388 845978796 845809698 845630169 845531642
2710.7H45531642m0054o5327j33752j69516k14756k76088k82705k33293j55329j48416
2731.1H43812406k33591k66373k05218j81675k48135k48968j86682k09749k49147k34902
2751.4H41547966k06828j50442j06454j17600p2718K8193K384q4102m1902J848p4208
2773.9H40726137j49667j57774j16586j22547k20418k95997l21925l16560k89738k97964
2794.3H38436961l64840l83496l02971k44200k19345j71542n8115J16528J69694L4511
2814.7H37013185j20640k22921l27587m32432n26965o11722o70552p28786p83503q53777
2835.1H31734300r69231j061261j228213j546264j859009k058208k050996j896560
2851.4H19064558j768172j559019j173318q17895p15315q52883j000583j026630j110495
$$ plain form
2710.7 845531642 845491588 845426261 845292509 845122993 844908237 844632149 844349444 844116151 843960822 843812406
2731.1 843812406 843578815 843312442 843107224 842925549 842677414 842428446 842241764 842032015 841782868 841547966
2751.4 841547966 841341138 841190696 841084242 840966642 840893924 840922117 840924501 840840399 840798497 840800345 840726137
2773.9 840726137 840576470 840418696 840302110 840179563 839959145 839663148 839341223 839024663 838734925 838436961
2794.3 838436961 838072121 837688625 837385654 837141454 836922109 836750567 836692452 836808980 836978674 837013185
2814.7 837013185 836892545 836669624 836342037 835909605 835382640 834770918 834100366 833371580 832588077 831734300
2835.1 831734300 830765069 829703808 828475595 826929331 825070322 823012114 820961118 819064558
2851.4 819064558 817296386 815737367 814564049 813746154 813030839 812177956 811177373 810150743 809040248
2869.7H09040248j269877j301348j369118j671017j995206k136349k107740j870930
2886.1G95318663j281261l79920M87387J033902J317859J409352J173138O80208L79444
2904.4H00138772N69939J019120J348794J453519J373350J153291Q38339M64320J26243
2922.8H08485687j85490o14762j123190j652122k415001l580630n071521o758153q502424
2941.1G78582394j0054231j1110782j1519790j1226892j0288656q869827p022440m810512
2957.4G03679264k331675L21687K862394M923224O329656P113814P326961P081270
2973.8G37306595O601631O077230N626023N244732M832149M403412M079998L824114
2990.1G77995884L490270L097176K777100K620935K567947K529740K568543K700985
$$ plain form
2869.7 809040248 807770371 806469023 805099905 803428888 801433682 799297333 797189593 795318663
2886.1 795318663 794037402 793657482 794144869 795178771 796496630 797905982 799079120 799759328 800138772
2904.4 800138772 800708711 801727831 803076625 804530144 805903494 807056785 807895124 808359444 808485687
2922.8 808485687 808300197 807685435 806562245 804910123 802495122 798914492 793842971 787084818 778582394
2941.1 778582394 768528163 757417381 745897591 734670699 724382043 715512216 708489776 703679264
2957.4 703679264 701347589 701669276 704531670 709454894 715784550 722898364 730225325 737306595
2973.8 737306595 743908226 749985456 755611479 760856211 765688360 770091772 774171770 777995884
2990.1 777995884 781486154 784583330 787360430 789981365 792549312 795079052 797647595 800348580
3006.4H00348580K769828K755940K808451K834440K713680K542376K362490K125383
3022.7H21261168J818716J541793J341343J120210Q56578O00398K79963k20358r32515
3041.1H27667296j868427l012955m127920m599273l838599k041280j04427J047492
3057.4H09121907J015007K51770m91619p74026m65214J08182M42088L97563J23084
3075.7H09728742j11163J8835O41167J461864K103984K364576K100468J390874M47571
3094.1H20146918n13971j142442j142502n12838M38988J329661J939177K166748K060533
3112.4H24770272J810431J441002Q82089K98620j08779k39432m3571L85463Q28088
3130.8H30024183J110315J169205J053154Q85547P23719N70417M50789M15087M08590
$$ plain form
3006.4 800348580 803118408 805874348 808682799 811517239 814230919 816773295 819135785 821261168
3022.7 821261168 823079884 824621677 825963020 827083230 827939808 828540206 828820169 828599811 827667296
3041.1 827667296 825798869 822785914 818657994 814058721 810220122 808178842 808074415 809121907
3057.4 809121907 810136914 810388684 809897065 809123039 808657825 808766007 809208095 809605658 809728742
3075.7 809728742 809617579 809636414 810277581 811739445 813843429 816208005 818308473 819699347 820146918
3094.1 820146918 819632947 818490505 817348003 816835165 817274153 818603814 820542991 822709739 824770272
3112.4 824770272 826580703 828021705 828903794 829202414 829093635 828854203 828810632 829196095 830024183
3130.8 830024183 831134498 832303703 833356857 834242404 834966123 835536540 835987329 836402416 836811006
3149.2H36811006L09289K65777L56316L63291K67386K10285J99020J28985M4703N6565
3169.6H39012623R7871J14858J19328R4414O3717Q2493M7565n0247m411J10805J04964
3192H39793980O3896J29819K22683J77443J01984J20878N7399m0352q106J78p0869
3214.4H40548933j12594j02520j12533j41561q4639L6478P8500p391m8519K7657R5129
3236.9H40176940J09017J08719J19865J06156Q1062O5386M4882O3360Q5712L0398o4433
3259.3H40927064j14381m3929J34767J99139L636j96338j12593P1168P8380l4571j33753
3281.7H40778589j27077p6175j33395k75194l49999k45035q1896l9161l5226N1737
3302.1H39467168J44899N0544j18315l3080J44481J31369l5763k04742k55227k88069
$$ plain form
3149.2 836811006 837120295 837386072 837742388 838105679 838373065 838583350 838782370 838911355 838956058 839012623
3169.6 839012623 839110494 839225352 839344680 839439094 839502811 839585304 839632869 839582622 839578211 839689016 839793980
3192 839793980 839857876 839987695 840210378 840387821 840489805 840610683 840668082 840627730 840619624 840619802 840548933
3214.4 840548933 840436339 840333819 840221286 840079725 839995086 840031564 840110064 840102673 840054154 840081811 840176940
3236.9 840176940 840285957 840394676 840514541 840620697 840701759 840767145 840812027 840875387 840961099 840991497 840927064
3259.3 840927064 840812683 840768754 840903521 841102660 841106296 840909958 840797365 840868533 840946913 840912342 840778589
3281.7 840778589 840651512 840575337 840441942 840166748 839816749 839571714 839489818 839450657 839415431 839467168
3302.1 839467168 839612067 839662611 839544296 839511216 839655697 839787066 839751303 839546561 839291334 839003265
3322.5H39003265l33369l94285m73022m39763l63410k43008N663J76787J58668J07467
3342.9H37204993J56760K76089L03268K52605K17080J73330J71006J37448J6332l9518
3363.3H38869393k8551n3644q4400p1049p0691j27494j51098j03831n3466p0750j95444
3385.7H37858975l13103l31342l14653l14534m30346o82950q24034p71820p80702j010478
3406.1H32085013j321435j542747j740634j903176j928032j945138k001822j917481
3422.5H17784548j682222j493514j296162q50499k47776K74896Q16286J379788J691997
3440.8H16377342J734614J663208J628876J639843J572668J447201J298666J050711
3457.1H28413129Q01802P47859O45578L53813K01047L68058O07312N06103J49965m5120
$$ plain form
3322.5 839003265 838669896 838275611 837802589 837362826 836999416 836756408 836762071 836938858 837097526 837204993
3342.9 837204993 837361753 837637842 837941110 838193715 838410795 838584125 838755131 838892579 838908911 838869393
3363.3 838869393 838840842 838787198 838702798 838631749 838561058 838433564 838282466 838178635 838125169 838054419 837858975
3385.7 837858975 837545872 837214530 836899877 836585343 836154997 835472047 834648013 833876193 833095491 832085013
3406.1 832085013 830763578 829220831 827480197 825577021 823648989 821703851 819702029 817784548
3422.5 817784548 816102326 814608812 813312650 812462151 812214375 812489271 813305557 814685345 816377342
3440.8 816377342 818111956 819775164 821404040 823043883 824616551 826063752 827362418 828413129
3457.1 828413129 829214931 829962790 830608368 830962181 831163228 831531286 832138598 832644701 832794666 832749546
3477.5H32749546k2412K1816o8009k29478k64466k35617k94090l44097l62933l84569
3497.9H30565691m04894m84169n14150m98890n94497o79255o46710o06775o52850p00474
3518.3H24783027o85453p25389p83980p91788q14080q13305q48771r29176q99732p43211
3538.7H16748142n37634m27663m51028m17114l20315k53618p7665J46687K73407M20630
3559.1H15103829O31213Q10802Q30412P21991O79612O76394O50704O51538O86586O81102
3579.5H22124183N55575M00841K48254k2412k21789k45928l39151m88817n46575o05822
3599.9H20858359o77526n33998m27603p01309r07302p56442o11127n80012o56605o33597
3620.3H14372838l72589q7202M18j91987j31428J54257L04222M92334O86944Q38697
$$ plain form
3477.5 832749546 832727134 832748950 832680941 832451463 832186997 831951380 831657290 831313193 830950260 830565691
3497.9 830565691 830160797 829676628 829162478 828663588 828069091 827389836 826743126 826136351 825483501 824783027
3518.3 824783027 824097574 823372185 822588205 821796417 820982337 820169032 819320261 818391085 817491353 816748142
3538.7 816748142 816210508 815782845 815331817 814914703 814594388 814340770 814263105 814409792 814683199 815103829
3559.1 815103829 815735042 816545844 817376256 818098247 818777859 819454253 820104957 820756495 821443081 822124183
3579.5 822124183 822679758 823080599 823328853 823306441 823084652 822838724 822499573 822010756 821464181 820858359
3599.9 820858359 820180833 819646835 819219232 818517923 817610621 816854179 816243052 815663040 815006435 814372838
3620.3 814372838 814000249 813913047 813913465 813721478 813590050 813744307 814048529 814540863 815227807 816066504
3640.7H16066504R86516J114488J254439J356781J233637J073956J119137J325548
3657H25531006J319229J171589J189471J299619J349807J414597J371265J060903R92715
3675.4H36700201R42588O31750N49793P30395R88722J228034J211882Q61466O03259
3693.7H44448090N23507N06044M81069M56989L47852K40326L82185M75586J39713j21832
3714.1H47879529n9485N4776J46151J25944l9219j99795k16067l4809K07901J42634
3734.5H48007560j13905j15037J5021Q5592J51813J07229j78576m43220m55201k19881
3754.9H46841395k6286p748J5318R3281J44303R5487R4414K06410J33753J9193o735
3777.3H47602785k3127n066O6876J51515Q8930r3758j82271j27196j7047M7684L933
$$ plain form
3640.7 816066504 817053020 818167508 819421947 820778728 822012365 823086321 824205458 825531006
3657 825531006 826850235 828021824 829211295 830510914 831860721 833275318 834646583 835707486 836700201
3675.4 836700201 837642789 838274539 838824332 839554727 840543449 841771483 842983365 843844831 844448090
3693.7 844448090 844971597 845477641 845958710 846415699 846763551 847003877 847386062 847861648 848001361 847879529
3714.1 847879529 847820044 847874820 848020971 848146915 848107696 847907901 847691834 847657025 847864926 848007560
3734.5 848007560 847893655 847778618 847793639 847879231 848031044 848138273 847959697 847516477 847061276 846841395
3754.9 846841395 846815109 846807361 846822679 846915960 847060263 847155750 847250164 847456574 847590327 847609520 847602785
3777.3 847602785 847579658 847574592 847641468 847792983 847881913 847788155 847605884 847478688 847461641 847509325 847513258
3799.8H47513258l1352l8623m6730L4213O2227R4712J37806R9957P0333K5034j609
3822.2H47919226n9545j13726o7294K8909J39236J58191N0664J0729L3736r3281k09332
3844.6H47797513j29342J9073P4387N1439N7757k9624j55866j70767q3506O4432J35303
3867.1H47630799O8068p1704j34289j6332r060q9288L1710Q9288L516n2392j19150
3889.5H47331166r7453J6153J07407J38879k3425j91331j12414p6830j83642j98782
3909.9H46709728l4272J21414J04428k3306j11341j17541p9572J0014M8220M6432J10090
3932.3H46784294N8174o1453m2855p9036j51456n0604P5579J14083M411j72556k14994
3954.8H46263587j79052j27733p9870r1493r6381m0948L278n8710k20240l04699j76131
$$ plain form
3799.8 847513258 847481906 847443283 847396553 847430766 847492993 847587705 847725511 847825468 847895801 847920835 847919226
3822.2 847919226 847859681 847745955 847678661 847707570 847846806 848004997 848055661 848066390 848100126 848006845 847797513
3844.6 847797513 847668171 847687244 847761631 847813070 847870827 847841203 847685337 847514570 847431064 847495496 847630799
3867.1 847630799 847698867 847627163 847492874 847476542 847467482 847378194 847409904 847499192 847502708 847450316 847331166
3889.5 847331166 847233713 847249866 847357273 847496152 847472727 847281396 847168982 847092152 846908510 846709728
3909.9 846709728 846675456 846796870 846901298 846877992 846766651 846649110 846569538 846579552 846627772 846674204 846784294
3932.3 846784294 846842468 846781015 846738160 846659124 846507668 846457064 846532643 846646726 846651137 846478581 846263587
3954.8 846263587 846084535 845956802 845876932 845785439 845689058 845648110 845651388 845592678 845372438 845067739 844891608
3977.2H44891608n722K682p8917j45673j92881j41680Q642R5845P4744l7909
3997.6H44470739
$$ plain form
3977.2 844891608 844885886 844888568 844809651 844663978 844471097 844329417 844338059 844433904 844508648 844470739
3997.6 844470739
##END=$$ End of the data block
