##TITLE=DI 15-0472533-8 Suporte Base $$ Begin of the data block
##JCAMP-DX=5.00 $$ ACD/SpecManager v 10.08
##SPECTROMETER/DATA SYSTEM=Alpha
##DATE=16 Apr 2015 10:34:42
##DATA TYPE=INFRARED SPECTRUM
##DATA CLASS=XYDATA
##ORIGIN=
##OWNER=
##NPOINTS=1765
##FIRSTX=399.76428223
##LASTX=3997.64306641
##MAXX=3997.64306641
##MINX=399.76428223
##MAXY=0.84173739
##MINY=0.00720415
##XFACTOR=1.0000000000
##YFACTOR=1.000000000000000e-9
##FIRSTY=0.79216290
##DELTAX=2.03961372
##XUNITS=1/CM
##YUNITS=ARBITRARY UNITS
##XYDATA=(X++(Y..Y))
399.8G92162895j01030j641392k333999k514899k332866k609253l686190m441142m432857
418.1G68069267k515793k27689K83658O08504J130402J598835K097964K714277L413319
436.5G77172744L540695L085971K715409K667129K798795K466917J770080J437604
452.8G97655344J055956M48406j29342q82268j497150j773715k198100k828121l424466
471.2G86426544l597021l244400l283441l436089l247439l351331l330648l110469
487.5G59825706l945112n666136p190764p883490o964027l665090J690566O802440
503.8G33004093R204388R097397P193685M709422K738417J746296J682222J911223
520.1G71287143J958847J995445K333343K774596L195107L655016L860414L833890
$$ y = [792162895, 792061865, 790420473, 788086474, 785571575, 783238709, 780629456, 776943266, 772502124, 768069267, 765553474, 765325785, 765609443, 766217947, 767348349, 768947184, 771045148, 773759425, 777172744, 780713439, 783799410, 786514819, 789181948, 791980743, 794447660, 796217740, 797655344, 798711300, 799159706, 799030364, 798148096, 796650946, 794877231, 792679131, 789851010, 786426544, 782829523, 779585123, 776301682, 772865593, 769618154, 766266823, 762936175, 759825706, 755880594, 750214458, 743023694, 735140204, 728176177, 724511087, 726201653, 733004093, 742208481, 751305878, 758499563, 763208985, 765947402, 767693698, 769375920, 771287143, 773245990, 775241435, 777574778, 780349374, 783544481, 787199497, 791059911, 794893801]
536.4G94893801L720165L568530L266096K810001K791286L003299K927422K848268
552.7H19828868K759039K368808J943827J758575J390100Q48889P05421R47833J080632
571.1H33631992Q03829M59432L43323K29061R8824R3579L7074j87277l89099l33369
591.5H34787369j94788l31879n49137n04613l32952m35054p40946q28802p39873o65903
611.9H29463422o91294r11177j111388j085818j172661j764715l013969o435394r702861
630.2H03574145m321695O074846Q099139L276467J22369p75695j290858j775146j860380
648.6H11123192j478851r41276n21183l80755n98430r08554j125574j775443l485322
667G99907804l732443j498580k202452m549145n906463m684031j239955J679539K101243
$$ y = [794893801, 798613966, 802182496, 805448592, 808258593, 811049879, 814053178, 816980600, 819828868, 822587907, 824956715, 826900542, 828659117, 830049217, 830898106, 831603527, 832551360, 833631992, 834435821, 834895253, 835238576, 835467637, 835566461, 835660040, 835697114, 835509837, 835120738, 834787369, 834592581, 834260702, 833711565, 833206952, 832874000, 832438946, 831698000, 830869198, 830129325, 829463422, 828772128, 827860951, 826749563, 825663745, 824491084, 822726369, 819712400, 813277006, 803574145, 799252450, 805327296, 813426435, 816702902, 816825271, 816049576, 814758718, 812983572, 811123192, 809644341, 808703065, 808181882, 807801127, 807202697, 806294143, 805168569, 803393126, 799907804, 796175361, 794676781, 792474329, 787925184, 782018721, 777334690, 776094735, 777774274, 779875517]
685.3G79875517P29322j009047k570212m097461o429136j0143936j4106154j5618205
701.6G26630688j3955057j1252880q978784o989300o611228j2521267k9510260o0447335
717.9E76364577j05395824j44385964j39066040q4690943k1251545J9394785M3608532
732.2A44577578O8621695J00419387J27613366J28611326R9439144O0868502L2687306
746.5G62838304J7787159J0805368P265389N018115L275096J737595L02136q59320
762.8H08169842j639843k086759k290964k340615k394378k595544k978146l828525
779.1G88015068n578638q468568j2601018j7549991k1748841k0876169r426892R117722
795.4G00882673J9624830J4559507M475593l04102p45058k99037O0558L64125P79033
$$ y = [779875517, 780604839, 779595792, 777025580, 772928119, 766498983, 756355047, 742248893, 726630688, 712675631, 701422751, 692443967, 685454667, 678843439, 666322172, 636811912, 576364577, 470968753, 326582789, 187516749, 102825806, 81574261, 100969046, 144577578, 213199273, 313618660, 441232026, 569843352, 669282496, 730150998, 762838304, 780625463, 791430831, 798696220, 803714335, 806989431, 808727026, 809029162, 808169842, 806529999, 804443240, 802152276, 799811661, 797417283, 794821739, 791843593, 788015068, 782436430, 773967862, 761366844, 743816853, 722068012, 701191843, 691764951, 700882673, 720507503, 735067010, 739542603, 739238501, 738493443, 738194406, 738254964, 738619089, 739398122]
813.8G39398122J185179J234233P38025j88470j259566k384185l616691m979074o352901
832.2G23774672p286966p223964n912066l858208k011419q33869j94966J94311O08146
850.5F97255671J167178J528979J081705q45433n170583j2632013k3234665l5532057
866.8F23618782m5106292m4375062k8726816m153848J7351389K8690159L0124903K5551319
883.2F02974534J9059777J2908757P618845L353297N28336k81692J485586N766333
899.5F53413773J1503994J7080486K0834446K1684944J9673765J5835762J1511326
913.7G71538496P715404M868388K898216J517177N36800q6904m15504n64933o50942
932.1G87356198o96123p24613p91431r13501j033723j101911j173318j293540j496553
$$ y = [739398122, 740583301, 741817534, 742555559, 742367089, 741107523, 738723338, 735106647, 730127573, 723774672, 716487706, 709263742, 703351676, 699493468, 697482049, 696648180, 696453214, 696647525, 697255671, 698422849, 699951828, 701033533, 700188100, 695017517, 682385504, 659150839, 623618782, 578512490, 534137428, 505410612, 501256764, 518608153, 547298312, 577423215, 602974534, 622034311, 634943068, 642561913, 645915210, 646443546, 646161854, 647647440, 653413773, 664917767, 681998253, 702832699, 724517643, 744191408, 760027170, 771538496, 779253900, 784122288, 787020504, 788537681, 789074481, 788987577, 788572073, 788007140, 787356198, 786660075, 785935462, 785144031, 784230530, 783196807, 782094896, 780921578, 779628038, 778131485]
950.5G78131485j843333k399683l187657m190743n401909o784320q051813q706390
966.8G37565637q191049o118298k847314N21660K901196L988803M145562L792406L080546
985.1G38839149K135098J275778M98474n52178j954257l437221n020976o969988j0152281
1003.5G14661598j6444683k7506292m6183169p7525019j10350669j06191575m5787126
1017.8B84673065L2659829P5693041P0553064M2793393J7837167L179729l815651p712185
1034.1E15861452j0837853j2545944j0975778n272686L511429J3090700K1253913K6666165
1050.4E40751398K8688490K7018666K1768451J3894737N106687k961158r658695j5036940
1066.7F09571636j9490063k4019897k9951632l7852973m6669305n3817331n6565494
$$ y = [778131485, 776288152, 773888469, 770700812, 766510069, 761108160, 754323840, 746272027, 737565637, 729374588, 723256290, 720408976, 720930636, 723831832, 727820635, 731966197, 735758603, 738839149, 740974247, 742250025, 742748499, 742196321, 740242064, 736804843, 731783867, 724813879, 714661598, 698216915, 670710623, 624527454, 547002435, 436651766, 330460191, 284673065, 317332894, 393025935, 463578999, 506372392, 524209559, 527389288, 523573637, 515861452, 505023599, 492477655, 481501877, 476229191, 479740620, 492831320, 514085233, 540751398, 569439888, 596458554, 618227005, 632121742, 637228429, 634267271, 624608576, 609571636, 590081573, 566061676, 536110044, 498257071, 451587766, 397770435, 341204941]
1081C41204941n4522246n0133079m5965225m2093157l6870473k9472246k0853017j2510102
1097.3D8785396n125005J354352P388871J3005659J6750201J5550271Q059442j808345
1113.6A03960842p910848p673748k713941M281089J1193603J6428821J8887498J8850669
1129.9A55303985J8028349J8298685K0623163K5095537L1499028L9320707M7088594
1144.2C55258048N2458077N3882063N1442772M6076000L8669109L0180216K1822989
1158.5F49789274J4428496P665098J49309q911907j7240405j9903541j4269054l000319
1174.8F08706951Q826316J7498731K1367848K0216823J5434980R416342L971398l13759
1191.1G05125630l570914n904913p305742p927000q094490q153617q380652r004235
$$ y = [341204941, 286682695, 236549616, 190584391, 148491234, 111620761, 82148515, 61295498, 48785396, 43660391, 45014743, 52403614, 65409273, 82159474, 97709745, 105769187, 103960842, 96049994, 88376246, 85662305, 89943394, 101136997, 117565818, 136453316, 155303985, 173332334, 191631019, 212254182, 237349719, 268848747, 308169454, 355258048, 407716125, 461598188, 513040960, 559116960, 597786069, 627966285, 649789274, 664217770, 671882868, 672032177, 663120270, 645879865, 625976324, 611707270, 608706951, 617533267, 635031998, 656399846, 676616669, 692051649, 701467991, 705439389, 705125630, 701554716, 695649803, 688344061, 680417061, 672322571, 664168954, 655788302, 646784067]
1207.5F46784067j0096729j1696040j3840318j6520858j9771635k3622156k8125703
1221.7E23110628l3586055m0430844m8968106n8707387o7019909o9479019o2954902
1236A41964406m8916526l2704503j9323602j0459486n327514k554504j204344q52845
1252.3B0621082j231134j903886k268625j967823j019133J72692J403451K660491L832357
1270.7B0299472M388193L929492K748416J572691J022965J152914J890387L161043
1287D0165573N108707P968381J2209691J8266514K6094504L4007557L8673356L8713664
1303.3B21207947L7316471L8284212M0419221M0934295L9220988L6094576L4023554
1317.6D87501264L3892214L3671021L2032431K7901291K0002544Q040250p450462k3330569
$$ y = [646784067, 636687338, 624991298, 611150980, 594630122, 574858487, 551236331, 523110628, 489524573, 449093729, 400125623, 341418236, 274398327, 204919308, 141964406, 93047880, 60343377, 41019775, 30560289, 25232775, 22678271, 21473927, 20621082, 19389948, 17486062, 15217437, 13249614, 12230481, 12403173, 13806624, 16467115, 20299472, 24687665, 28617157, 31365573, 32938264, 33961229, 35114143, 37004530, 40165573, 45274280, 53242661, 65452352, 83718866, 109813370, 143820927, 182494283, 221207947, 258524418, 296808630, 337227851, 378162146, 417383134, 453477710, 487501264, 521393478, 555064499, 587096930, 614998221, 635000765, 643041015, 635590553, 612259984]
1333.9F12259984l3341646l1329632j4564574J0022164K9865205L9195537L7359655
1348.2F49466693K8594554J8233180Q998692R55284p075489j7848730l3371449m4583737
1364.5F03368998m3290675l3104777j5381158L596544J8623412K5780678K6335597
1378.8E85928619K3431122J6973973Q826136O63459o352186j1069834j5846252k1580816
1395.1E80974221k5809347l2527924m1302741n4273575p0978463o3669562k1040172
1409.4B71372437M1772366R2953056J04315072R1002524O9177807L6933243J5070379
1423.7G22596884L782570o088316j6207099k3186028k5150538k8139829k5940240j5038967
1440E86628437q540928o187737n520761o376565o167531l948867N40316J1317253K6414037
$$ y = [612259984, 578918338, 547588706, 533024132, 543046296, 572911501, 612107038, 649466693, 678061247, 696294427, 705293119, 706248403, 699172914, 681324184, 647952735, 603368998, 560078323, 526973546, 511592388, 515188932, 533812344, 559593022, 585928619, 609359741, 626333714, 635159850, 635823309, 629471123, 618401289, 602555037, 580974221, 555164874, 522636950, 481334209, 427060634, 356082171, 292412609, 271372437, 313144803, 406097859, 510412931, 601415455, 670593262, 707526505, 722596884, 726379454, 720291138, 704084039, 680898011, 655747473, 627607644, 601667404, 586628437, 578087509, 571899772, 566379011, 560002446, 553834915, 549886048, 550426364, 561743617, 588157654]
1458.3E88157654K7473807K6160956L0021011K7945519J7952800J1691093J0961592
1472.6G40364432J0677994R288191Q430720P936716P147252N270243L358960K238512
1488.9G94713020J185417j693606p816672j9439578l4769595m5411348m1441620j4892578
1505.2F30433440L9273262N1377774K8234064J5136778O889046K112150n27620j951933
1521.6G70976961j633048q28386P6056J093387J738489L170788L266633J715958J477778
1539.9G81054616K710462K587974J760602O55949k18272n28992j029908j890838k898157
1558.3G82203436j757801j339733l484488o008506r945213j5727580j8672228k4149537
1574.6G01118350k7771950p459402J7564416L0688048K9119908J8618465R136557L779889
$$ y = [588157654, 615631461, 641792417, 671813428, 699758947, 717711747, 729402840, 740364432, 751042426, 760330617, 768761337, 776698053, 783845305, 789115548, 792474508, 794713020, 795898437, 794204831, 786388159, 766948581, 732178986, 686767638, 645326018, 630433440, 669706702, 721084476, 749318540, 764455318, 771344364, 773456514, 772928894, 770976961, 769343913, 768515527, 768591583, 769684970, 771423459, 774594247, 777860880, 779576838, 781054616, 783765078, 786353052, 788113654, 788769603, 788551331, 788022339, 786992431, 785101593, 782203436, 780445635, 779105902, 775621414, 769612908, 759667695, 743940115, 725267887, 701118350, 673346400, 665886998, 683451414, 714139462, 743259370, 761877835, 771014392, 774794281]
1590.9G74794281R19759j197100k901673l792465l848851l725886m425168o383240
1607.2G49439657q387268q316457n149305J347244R343028R169400M625618K082646
1623.5G54154563P47979j610l05712o75917j461684j472235j70410K206q08478j746893
1643.9G48261809k466201j791001j168132k727985l715336k612174l751874o245673
1660.3G23783433q911371r840607r300411j0985792j2564242j0876298j2097239j4173806
1676.6F35033667j3032436j2285173j3242424j4253914j0263384r112656j2233138
1690.9E50610542j5366971k3855388l3620596m2911321o0036957n7967633o1882437
1705.1B54969239p1597993o1354868m6507716l2246821j9972609j0998662m129647
$$ y = [774794281, 775714040, 774516940, 771615267, 767822802, 763973951, 760248065, 755822897, 749439657, 741052389, 732735932, 727586627, 728933871, 738276899, 747446299, 752071917, 754154563, 754902542, 754900932, 754595220, 753919303, 752457619, 750985384, 750814974, 750817180, 750008702, 748261809, 745795608, 744004607, 742836475, 740108490, 736393154, 733780980, 730029106, 723783433, 714872062, 705031455, 695731044, 684745252, 672181010, 661304712, 649207473, 635033667, 622001231, 609716058, 596473634, 582219720, 571956336, 562843680, 550610542, 535243571, 511388183, 477767587, 434856266, 374819309, 316851676, 254969239, 183371246, 122016378, 75508662, 43261841, 23289232, 12290570, 8160923]
1719.4H160923r56768J33302O44047J411056K198381L893142Q635480J5075811K2577628
1737.8F1773002M1689351O5325454Q1050277Q8911176Q8447958Q4033549O8404972
1752E79635739M5969248L4030616K7956129K0896256J7200708J3292193R491682P702530
1768.4G56175101O457209O320000N856454M494071L613890L439903L155827K888382
1784.7G92400837K516806J854062J414895J896441K075196J474201J042009R80436
1801H05654883J119554Q03531L30209k6524J6868J14322q0168k23220p2002Q7798K24054
1823.4H07949305P48396J134514J642943K364874K369940K069175K074778J933515
1839.8H22287440J540542J786053K435744K401650K055168J766026J488507J287043
$$ y = [8160923, 7204155, 7337457, 7981504, 9392560, 11590941, 15484083, 24119563, 39195374, 61773002, 103462353, 168787807, 249838084, 338749260, 427197218, 511230767, 579635739, 625604987, 659635603, 687591732, 708487988, 725688696, 738980889, 748472571, 756175101, 762632310, 768952310, 774808764, 779302835, 782916725, 786356628, 789512455, 792400837, 794917643, 796771705, 798186600, 800083041, 802158237, 803632438, 804674447, 805654883, 806774437, 807577968, 807908177, 807881653, 807898521, 808012843, 807932675, 807709455, 807637453, 807725251, 807949305, 808697701, 809832215, 811475158, 813840032, 816209972, 818279147, 820353925, 822287440, 823827982, 825614035, 828049779, 830451429, 832506597, 834272623, 835761130, 837048173]
1856.1H37048173J044750Q88765P69854M28080m1783l2961N96762P06195L29555l636
1876.5H41733754j58727j93894k26617l71635o37174p98225o39975n72563p41183o88553
1896.9H36705208o52552p45058q08835q42988r22442r42707q44896q76426j093090
1915.2H28976214j183569r82464j015663j132905j079321j215995j470327j667619
1931.5H19228351j862705k028405k207458k467931k594888k250910j604437j014591
1947.9H03197026m37617J22607O78777J174212J523137J735628J824200J771629J690566
1966.2H13280165J749456J685202J404405J127481R31621P85708O84381O29246N48482
1984.6H22826147N24581O18577Q14437J113475J271605J156867J020789R51707Q68976
$$ y = [837048173, 838092923, 838981688, 839751542, 840179622, 840137839, 840104878, 840701640, 841407835, 841737390, 841733754, 841575027, 841381133, 841154516, 840782881, 840145707, 839347482, 838707507, 838134944, 837393761, 836705208, 836052656, 835307598, 834498763, 833655775, 832733333, 831790626, 830945730, 830069304, 828976214, 827792645, 826810181, 825794518, 824661613, 823582292, 822366297, 820895970, 819228351, 817365646, 815337241, 813129783, 810661852, 808066964, 805816054, 804211617, 803197026, 802759409, 802882016, 803560793, 804735005, 806258142, 807993770, 809817970, 811589599, 813280165, 815029621, 816714823, 818119228, 819246709, 820178330, 820964038, 821648419, 822277665, 822826147, 823350728, 823969305, 824783742, 825897217, 827168822, 828325689, 829346478, 830298185, 831167161]
2002.9H31167161P71583P13229P10130O74784N73873M54009M58956N51760N14686M08828
2023.3H36998999L57211L24845K72155K12014J74760J31786M0710m5895o4612p0333
2043.7H38331640j60277k56539k87473l30925l91900m32134m59909n10931n89967o41644
2064.1H34269941o28412n85854n88119o18219o07908n71311n29647m74751m36246m46796
2084.5H28782678m56930m22418l72469l45051l44694l40223l07620k32696j47164j29104
2104.9H25684309j75536j74403j06454n4776r001O3002J07825J12534J04189J00612
2125.3H25652301J24634J29222Q8931N9247O5446Q9526J24514J52409J66654K12253
2145.7H26865137K89678L61800M13359M43697M44889M57704N16832N66780N40078M69804
$$ y = [831167161, 831938744, 832651973, 833362103, 834036887, 834610760, 835064769, 835523725, 836075485, 836590171, 836998999, 837356210, 837681055, 837953210, 838165224, 838339984, 838471770, 838512480, 838466585, 838401973, 838331640, 838171363, 837914824, 837627351, 837296426, 836904526, 836472392, 836012483, 835501552, 834911585, 834269941, 833641529, 833055675, 832467556, 831849337, 831241429, 830670118, 830140471, 829665720, 829229474, 828782678, 828325748, 827903330, 827530861, 827185810, 826841116, 826500893, 826193273, 825960577, 825813413, 825684309, 825508773, 825334370, 825227916, 825173140, 825164139, 825227141, 825334966, 825447500, 825551689, 825652301, 825776935, 825906157, 825995088, 826054335, 826119781, 826209307, 826333821, 826486230, 826652884, 826865137, 827154815, 827516615, 827929974, 828373671, 828818560, 829276264, 829793096, 830359876, 830899954, 831369758]
2166.1H31369758M25696L93033L56853L23653K94030K50936K02477J62363J31905R1433
2186.5H34002137N4598P4208P5042r835j04844j58906k38836l52979m15623l82721
2206.9H32542241l10302k41220j41442l9160J3113l7253j64867k24590j96516k09272
2227.3H30990732k60532k73764k61069k69830l26872l75390l61264l72409m97818o55234
2247.7H27336550p54774p85529p62225p05838o42896o04987n57244m94778m57763l95716
2268.1H21174800l36766l63529l83794l41356k63393j40011M0948K87414N72264Q23617
2288.5H21070194R64403J014889J006961R26792P86603N95808L69131J68741K921j66119
2308.9H26740324k83241l40819m46856o69658r21965r70602p26461m62652l64780k92719
$$ y = [831369758, 831795454, 832188487, 832545340, 832868993, 833163023, 833413959, 833616436, 833778799, 833910704, 834002137, 834056735, 834130943, 834205985, 834196150, 834091306, 833932400, 833693564, 833340585, 832924962, 832542241, 832231939, 831990719, 831849277, 831810117, 831823230, 831785977, 831621110, 831396520, 831200004, 830990732, 830730200, 830456436, 830195367, 829925537, 829598665, 829223275, 828862011, 828489602, 827991784, 827336550, 826581776, 825796247, 825034022, 824328184, 823685288, 823080301, 822523057, 822028279, 821570516, 821174800, 820838034, 820474505, 820090711, 819749355, 819485962, 819345951, 819386899, 819674313, 820246577, 821070194, 822034597, 823049486, 824056447, 824983239, 825769842, 826365650, 826734781, 826903522, 826906443, 826740324, 826457083, 826116264, 825669408, 824999750, 824077785, 823107183, 822380722, 821918070, 821553290, 821260571]
2329.3H21260571j22427m2081k03133k94864k13981j28686J36494P25568O37293m83871
2349.7H21270883j662850k153993j956046j527428r85146n19573j93775K43068O76393
2368H13191533Q90315R60171R66132R29832Q96215Q57652P30395N35309L58343K60771
2388.4H20576668K34782K13683K09808K67387L62039M40061M54962M31359M36783M57286
2408.8H24084818M51029M43577M67897M78685M63307M95136N47587N32866M76241M71413
2429.2H28912556M86851M66943M32133L71457L23772L10004K59995K11001K04622J57416
2449.6H32136750R2745O9737M0591P630r239k1458l7312r5606j80304k28107k10345
2472H31565082j68681k22027l20495l14474k80678l28243l80039l86417m24445m67062
$$ y = [821260571, 821138144, 821096063, 820892930, 820598066, 820384085, 820255399, 820391893, 821117461, 821754754, 821270883, 819608033, 817454040, 815497994, 813970566, 812985420, 812465847, 812272072, 812515140, 813191533, 814081848, 815042019, 816008151, 816937983, 817834198, 818691850, 819422245, 819957554, 820315897, 820576668, 820811450, 821025133, 821234941, 821502328, 821864367, 822304428, 822759390, 823190749, 823627532, 824084818, 824535847, 824979424, 825447321, 825926006, 826389313, 826884449, 827432036, 827964902, 828441143, 828912556, 829399407, 829866350, 830298483, 830669940, 830993712, 831303716, 831563711, 831774712, 831979334, 832136750, 832229495, 832299232, 832339823, 832347453, 832338214, 832316756, 832279444, 832183838, 832003534, 831775427, 831565082, 831396401, 831174374, 830853879, 830539405, 830258727, 829930484, 829550445, 829164028, 828739583, 828272521]
2492.4H28272521m20033l59714l69132l76165l39210k68638k18809k31027k12074j77085
2512.8H25300634k01225k13206j81556j60932j80603j83582j00672k1577j2398j1325
2533.2H24033558j4007l0338l9101n7638n8889q702J668l3795k0564K325j6272p570
2557.7H23750675O1094J02699P8917O2764Q0883P9215N5611L9458K3723K1577Q2671
2580.1H24439287J89662K61605L24726M09901M53294M34041L74138K98440K15829J37925
2600.5H27538848J12116Q8930J908m8399j4425J0074k7538q9228j42574k06888k58744
2623H26964080k38180j49667J9491K71558M97222O26445O15955M73141L34680K51293
2643.4H29666018J94848J57893J49905J45138P8857K2232L5823L7312K3961J4782q225
$$ y = [828272521, 827852488, 827492774, 827123642, 826747477, 826408267, 826139629, 825920820, 825689793, 825477719, 825300634, 825099409, 824886203, 824704647, 824543715, 824363112, 824179530, 824078858, 824057281, 824044883, 824033558, 824019551, 823989213, 823950112, 823892474, 823833585, 823824883, 823826551, 823792756, 823772192, 823774517, 823758245, 823750675, 823811769, 823914468, 823993385, 824056149, 824137032, 824216247, 824271858, 824311316, 824335039, 824356616, 824439287, 824628949, 824890554, 825215280, 825625181, 826078475, 826512516, 826886654, 827185094, 827400923, 827538848, 827650964, 827739894, 827741802, 827693403, 827678978, 827689052, 827661514, 827572286, 827429712, 827222824, 826964080, 826725900, 826576233, 826595724, 826867282, 827364504, 827990949, 828606904, 829080045, 829414725, 829666018, 829860866, 830018759, 830168664, 830313802, 830392659, 830414891, 830450714, 830488026, 830511987, 830526769, 830518544]
2665.8H30518544k6226l0518k1934k3485l4988l0875n543K1458J19l9756m2022n3346
2690.3H30231428j02401j05798q3744j37866j93357j82212j79887k18927k22385j75476
2710.7H28629375j40906j28388j50085k00450k66493l47435l70562l25143l04878l25978
2731.1H26069057l31461k94209k62082k76208k91705l13460m03345m79341l95834k72691
2751.4H22748721k76029k85984j89364q4400m2259R656N9366L2604j4306n8889j09434
2773.9H21789682j02758r8408k11835l69787m35233m25220m02987l40521k91765l73482
2794.3H18737686n27621n65469m57764l58402k89977j82450p1406M1366J38163P8559
2814.7H16542685j28388l72172o14643p75397p81715p37965p67767q23796q92460j001060
$$ y = [830518544, 830492318, 830461800, 830439866, 830416381, 830381393, 830350518, 830344975, 830366433, 830366552, 830326796, 830284774, 830231428, 830129027, 830023229, 829939485, 829801619, 829608262, 829426050, 829246163, 829027236, 828804851, 828629375, 828488469, 828360081, 828209996, 828009546, 827743053, 827395618, 827025056, 826699913, 826395035, 826069057, 825737596, 825443387, 825181305, 824905097, 824613392, 824299932, 823896587, 823417246, 823021412, 822748721, 822472692, 822186708, 821997344, 821912944, 821870685, 821880341, 821939707, 821972311, 821958005, 821899116, 821789682, 821686924, 821588516, 821376681, 821006894, 820571661, 820146441, 819743454, 819402933, 819111168, 818737686, 818210065, 817644596, 817186832, 816828430, 816538453, 816356003, 816284597, 816325963, 816464126, 816542685, 816414297, 816042125, 815427482, 814652085, 813870370, 813132405, 812364638, 811540842, 810648382, 809647322]
2835.1H09647322j104176j257718j572013j997411k410650k664388k625942k417326
2851.4G93597698k206325j922489j608610j439392j374364j362145j429975j538456
2867.7G80715942j666128j769364j747430j779079k102613k519310k788305k803087
2884G63540626k416194j579761m41254O57261J448750J923979K029299J620472R57489
2902.4G67740667O08265Q03769J301646J736820J929164J842379J530052J142323P66456
2920.7G79401541L42786j72019p64489j440287k222359l264129m764438o732166q963763
2939.1G51420677j1171222j3067603j4389873j4860749j4298260j2865544j0862350
2953.4F59905076q427203n510032k190590J063228L851950O040573P550061Q404195
$$ y = [809647322, 808543146, 807285428, 805713415, 803716004, 801305354, 798640966, 796015024, 793597698, 791391373, 789468884, 787860274, 786420882, 785046518, 783684373, 782254398, 780715942, 779049814, 777280450, 775533020, 773753941, 771651328, 769132018, 766343713, 763540626, 761124432, 759544671, 759103417, 759760678, 761209428, 763133407, 765162706, 766783178, 767740667, 768348932, 769152701, 770454347, 772191167, 774120331, 775962710, 777492762, 778635085, 779401541, 779744327, 779572308, 778807819, 777367532, 775145173, 771881044, 767116606, 760384440, 751420677, 740249455, 727181852, 712791979, 697931230, 683632970, 670767426, 659905076, 651477873, 645967841, 643777251, 644840479, 648692429, 654733002, 662283063, 670687258]
2969.7F70687258Q738697Q661806Q241952P629454O996691O413877N904973N526781
2986G28801489N221903M819930M332006L906369L565848L285467L131927L153443L280461
3004.4G63498843L431439L551960L614783L647805L638327L532231L349661L096462
3020.7G91361511K717018K291739J947760J632214J321673J066566P70390L49224k36810
3039H03221285j090586k296388l821373n282521n895436m979491k755761l03865J254976
3057.4G78050840J355708L91662n94437q47579m10020K20359O22749N97119K33114
3075.7G79619515m8697J87159R84251J972556K721906K988577K627551J631975K99573
3094.1G92984366q96692j561522j484335o81400N09918J635849K424955K720118K571046
$$ y = [670687258, 679425955, 688087761, 696329713, 703959167, 710955858, 717369735, 723274708, 728801489, 734023392, 738843322, 743175328, 747081697, 750647545, 753933012, 757064939, 760218382, 763498843, 766930282, 770482242, 774097025, 777744830, 781383157, 784915388, 788265049, 791361511, 794078529, 796370268, 798318028, 799950242, 801271915, 802338481, 803108871, 803458095, 803221285, 802130699, 799834311, 796012938, 790730417, 784834981, 779855490, 777099729, 776795864, 778050840, 779406548, 779798210, 779203773, 778356194, 777946174, 778166533, 778789282, 779386401, 779619515, 779570818, 779757977, 780742228, 782714784, 785436690, 788425267, 791052818, 792684793, 792984366, 792087674, 790526152, 789041817, 788360417, 788870335, 790506184, 792931139, 795651257, 798222303]
3112.4G98222303K222777J733780J064419L67702j56463l23116k1935N34534J011134
3130.8H04655135J344263J483500J345217J091302Q95202P46369N83530M67479M56751
3149.2H13068748M63664M28259M00305L96371L23534J87874J37150J47760J13011J00195
3169.6H15766871J09911O5446L8981P2003P7963K8312R417J4305Q35M8637J35064J47462
3194H16515207J21653J64509K27392J99973J11521M9054J5140l8207p7784r3519j33157
3216.5H17061782j78516k09212k03729j30057o1810m2916j0371M5836Q9467O8485L3260
3238.9H16462219Q1777J34468J25587J26481J19150M4167k2411R239M2378q642l2783
3261.3H17081630k3603m1068m3809m8876r7752j69575j98960j27852n5194p7128j55747
$$ y = [798222303, 800445080, 802178860, 803243279, 803610981, 803454518, 803131402, 803109467, 803644001, 804655135, 805999398, 807482898, 808828115, 809919417, 810814619, 811560988, 812144518, 812611997, 813068748, 813532412, 813960671, 814360976, 814757347, 815080881, 815268755, 815405905, 815553665, 815666676, 815766871, 815876782, 815942228, 815981209, 816053212, 816131175, 816159487, 816168904, 816183209, 816184044, 816232681, 816367745, 816515207, 816636860, 816801369, 817028761, 817228734, 817340255, 817389309, 817404449, 817366242, 817288458, 817194939, 817061782, 816883266, 816674054, 816470325, 816340268, 816278458, 816235542, 816225171, 816271007, 816360474, 816428959, 816462219, 816543996, 816678464, 816804051, 816930532, 817049682, 817093849, 817071438, 817080677, 817123055, 817114413, 817081630, 817058027, 817016959, 816973150, 816924274, 816826522, 816656947, 816457987, 816330135, 816274941, 816197813, 816042066]
3283.8H16042066k66612l11732k47240k10345k30074k28822j97172j08779N6505J33157
3304.2H14430952L5286p7605r9182p9990j03652j90556k84374l55482m22299n06282
3324.6H12346816n91993n90802n37216n30243m45187k42174n5134Q7321J77920K33769
3345H09853077K56181K53021L04640L30627K63273J88172J42098J50025J54793O8724
3365.4H11964631J0550Q5712J81496J63197P9096N1438N0903j133o4611j07646k14815
3387.8H12198818l76344m27186l80457m34697o53088q96036r80795j031756j328170
3406.1H05690289j737953k022147k182662k283693k432286k637923k691567k486885
3422.5G87215173k288818k113164j609623q63135k13385L77954J119077J777589K056420
$$ y = [816042066, 815775454, 815463722, 815216482, 815006137, 814776063, 814547241, 814350069, 814241290, 814297795, 814430952, 814466238, 814388633, 814289451, 814209461, 814105809, 813915253, 813630879, 813275397, 812853098, 812346816, 811754823, 811164021, 810626805, 810096562, 809651375, 809409201, 809354067, 809441388, 809619308, 809853077, 810109258, 810362279, 810666919, 810997546, 811260819, 811448991, 811591089, 811741114, 811895907, 811964631, 811975181, 812060893, 812242389, 812405586, 812484682, 812536120, 812587023, 812585890, 812521279, 812413633, 812198818, 811822474, 811395288, 811014831, 810580134, 809927046, 809031010, 808050215, 807018459, 805690289, 803952336, 801930189, 799747527, 797463834, 795031548, 792393625, 789702058, 787215173, 784926355, 782813191, 781203568, 780340433, 780127048, 780505002, 781624079, 783401668, 785458088]
3440.8G85458088K106905K080977K172410K326966K171158J855135J621962J385093
3457.1H01178694J155674J111329J059651P13527M45903N85317P51257N70476K51890
3475.5H07823718K9325o4611O9081Q3745j88828k24649q7142k02775m41313n52774
3495.9H06243777n52118o61432q08418o12915l84032n46933p19368o92129o93381q00073
3516.3G99772978r45270j032055j061201j070261j074254r99391q33094q31068r90808
3534.6G90935576j018047r21369r09567r40382q82328n85317k08378o8486R3162L04043
3555G85798907L09408K59042K76327K50101K34425Q33571J695216J644373J206517
3573.4G92507887R59039P47025N63562M28915O6340m17948k42234K74480r7871o60360
$$ y = [785458088, 787564993, 789645970, 791818380, 794145346, 796316504, 798171639, 799793601, 801178694, 802334368, 803445697, 804505348, 805218875, 805664778, 806250095, 807001352, 807571828, 807823718, 807853043, 807788432, 807857513, 807941258, 807752430, 807527781, 807440639, 807237864, 806796551, 806243777, 805691659, 805030227, 804221809, 803608894, 803224862, 802677929, 801958561, 801266432, 800573051, 799772978, 798827708, 797795653, 796734452, 795664191, 794589937, 793590546, 792757452, 791926384, 790935576, 789917529, 788996160, 788086593, 787146211, 786263883, 785678566, 785470188, 785401702, 785494864, 785798907, 786108315, 786367357, 786643684, 786893785, 787128210, 787961781, 789656997, 791301370, 792507887, 793466926, 794213951, 794777513, 795206428, 795272768, 794854820, 794612586, 794887066, 794789195, 794128835]
3593.8G94128835o16967m98593o32882o79791p67172j112103j231134r76563r46283
3612.1G86667347r88364r96828r97007m33445K6762k89857q45313p43389M42564R90510
3632.5G82832980R51409R54509Q77023Q51989P87437M07636R1374J003623K658307
3650.9G91416287K575279J842379J917720K099574J828909J506626J126647O66976
3667.2H04980397P19488J272440R69887R69350J848876J747609J304030R92358N48780
3685.6H15353215L82900J102567J848340J592338J039982O42180L58820M15742O03021
3703.9H23339105K27868l68297m57883L54529J029133N72384j73867n49436n52535
3722.3H23421001l20077K9743Q5712m51148j051307p16924N13255R36866K21253n42045
$$ y = [794128835, 793511868, 793013275, 792380393, 791700602, 790933430, 789821327, 788590193, 787613630, 786667347, 785678983, 784682155, 783685148, 783251703, 783278465, 782988608, 782143295, 781399906, 781842470, 782832980, 783784389, 784738898, 785615921, 786467910, 787255347, 787662983, 787754357, 788757980, 791416287, 793991566, 795833945, 797751665, 799851239, 801680148, 803186774, 804313421, 804980397, 805699885, 806972325, 807942212, 808911562, 810760438, 812508047, 813812077, 814804435, 815353215, 815736115, 816838682, 818687022, 820279360, 821319342, 821961522, 822320342, 822736084, 823339105, 823566973, 823198676, 822740793, 823095322, 824124455, 824696839, 824522972, 823973536, 823421001, 823100924, 823130667, 823216379, 822765231, 821713924, 820997000, 821510255, 822447121, 822668374, 822126329]
3742.7H22126329l48687P0333m77254l45171P68423Q10862K20656J11163M07040K70248
3763.1H23613942l2962r060K08080N33700M82917Q2791j70410j00910J49011J57416
3783.5H24914515J49965K62380J63913j49250n79059p67887n65589n67197k56777L65853
3803.9H22970867L10064M59969N30362l6240n92291n17726k54572l84867K87116P66575
3824.3H23539257L45111Q0347j61290l67761m36961n36681j81496M75705O51181N08308
3844.6H23915720J30057m99308j147091r54449O30676J017988L58582j83225m56035
3863H22812915k14815q7321k30908J92523N12719M02629R9838l36588k01463k4021
3883.4H22925508o5029J74463J3113q0108K71558P0930n48840p85231l94285K98679
$$ y = [822126329, 821777642, 821847975, 821370721, 821025550, 821793973, 822604835, 822825491, 822936654, 823343694, 823613942, 823580980, 823571920, 823780000, 824313700, 824796617, 824879408, 824708998, 824608088, 824757099, 824914515, 825064480, 825326860, 825490773, 825341523, 824762464, 823994577, 823428988, 822861791, 822605014, 822970867, 823280931, 823740900, 824271262, 824235022, 823642731, 823125005, 822870433, 822485566, 822772682, 823539257, 823884368, 823964715, 823803425, 823435664, 822998703, 822462022, 822280526, 822756231, 823407412, 823915720, 824045777, 823546469, 822399378, 821444929, 822075605, 823093593, 823452175, 823268950, 822812915, 822598100, 822510779, 822279871, 822472394, 822985113, 823387742, 823487580, 823150992, 822949529, 822925508, 822860479, 823034942, 823048055, 822967947, 823239505, 823310435, 822761595, 821976364, 821582079, 821880758]
3903.8H21880758Q02457O66559J88351j70410m08769m41074j67191N9783J0848j1086
3924.2H22410226J67012Q7380j86860k2233K76149J56760j09196l03626k68102k5749
3944.6H22181761j9490q3089M6134Tq5473j08004j02282q5771N3287L8087j69694k20955
3969.1H21490645k28107k66850j63257p0154j02282j37567j05799o0677j15574j89721
3989.5H20050657q0288P9573Q6128J7762
3997.6H20153832
$$ y = [821880758, 822683215, 823349774, 823538125, 823367715, 822958946, 822517872, 822350681, 822410464, 822421312, 822410226, 822577238, 822664618, 822477758, 822455525, 822731674, 822888434, 822779238, 822475612, 822207510, 822181761, 822162271, 822079182, 822125316, 822171450, 822085977, 821977973, 821875691, 821789920, 821843207, 821881294, 821711600, 821490645, 821262538, 820995688, 820832431, 820762277, 820659995, 820522428, 820416629, 820355952, 820240378, 820050657, 819970369, 820049942, 820136070, 820153832]
##END=$$ End of the data block
