##TITLE=DI 15-0472533-8 $$ Begin of the data block
##JCAMP-DX=5.00 $$ ACD/SpecManager v 10.08
##SPECTROMETER/DATA SYSTEM=Alpha
##DATE=16 Apr 2015 10:34:42
##DATA TYPE=INFRARED SPECTRUM
##DATA CLASS=XYDATA
##ORIGIN=
##OWNER=
##NPOINTS=1765
##FIRSTX=399.76428223
##LASTX=3997.64306641
##MAXX=3997.64306641
##MINX=399.76428223
##MAXY=0.85872078
##MINY=0.01478749
##XFACTOR=1.0000000000
##YFACTOR=1.000000000000000e-9
##FIRSTY=0.78421551
##DELTAX=2.03961372
##XUNITS=1/CM
##YUNITS=ARBITRARY UNITS
##XYDATA=(X++(Y..Y))
399.8G84215510J184761R4653p82252j254081j203955j084804j199544j348614j516283
$$ 784215510 785400271 785494924 784712672 783458591 782254636 781169832 779970288 778621674 777105391
418.1G77105391k051294k257228k076924j568853j062632j017392j199722j195312
$$ 777105391 775054097 772796869 770719945 769151092 768088460 767071068 765871346 764676034
434.4G64676034m62949J391113L712654N197406N299568M820108M027308K841055J809835
$$ 764676034 764213085 765604198 769316852 774514258 779813826 784633934 788661242 791502297 793312132
452.8G93312132J337111R57489o9320p27355m76539l72470p83920j153171j449406
$$ 793312132 794649243 795606732 795537412 794810057 794333518 793961048 793177128 792023957 790574551
471.2G90574551j966715k151072j714587j394928j546741j661658j560211j553237
$$ 790574551 788607836 786456764 784742177 783347249 781800508 780138850 778578639 777025402
487.5G77025402k044619l338217m963279n710125m873037k679289j07527K108455M494250
$$ 777025402 774980783 771642566 766679287 760969162 756096125 753416836 753309309 755417764 759912014
505.8G59912014P014811P805288O105840L315866J560569J217723J153230J243413
$$ 759912014 766926825 774732113 780837953 784153819 785714388 786932111 788085341 789328754
522.1G89328754J769781K269268K408922K625823L019571L133238L089070L166497
$$ 789328754 791098535 793367803 795776725 798402548 801422119 804555357 807644427 810810924
538.5H10810924K980172K597153K426148K262831K068102K099693K179265K018392
$$ 810810924 813791096 816388249 818814397 821077228 823145330 825245023 827424288 829442680
554.8H29442680J704931J485407J265347R49681P80821O69003N74648P22826Q10146
$$ 829442680 831147611 832633018 833898365 834848046 835628867 836297870 836872518 837595344 838405490
573.1H38405490O06298M99905N52654L78191J34111L8862l0041j8894M1425P4208R0301
$$ 838405490 839011788 839511693 840064347 840442538 840576649 840615511 840585470 840566576 840608001 840682209 840772510
595.6H40772510k1100k09630l06010k70427k59280l19063k92123k96771l73900m55380
$$ 840772510 840751410 840541780 840235770 839965343 839706063 839387000 839094877 838798106 838424206 837968826
616H37968826n09381m52995o04570j144648k099335m674077o942689k769232M690885
$$ 837968826 837459445 837006450 836401880 835257232 833157897 828483820 821541131 818771899 823462784
634.3H23462784N862236K267242O5028m02450o63221r73701j073301j010835p43390
$$ 823462784 829325020 831592262 831657290 831254840 830591619 829617918 828544617 827533782 826790392
652.7H26790392m51147n40853q60154j021088j101970j473069k667010k881587j169979
$$ 826790392 826339245 825798392 824938238 823917150 822815180 821342111 818675101 815793514 814623535
671H14623535j651287l309131m288852l494740r82046J149058J375437L59476r01163
$$ 814623535 812972248 809663117 805374265 801879525 800897479 802046537 803421974 803781450 802880287
689.4H02880287k170443l498018n382002q314132j1395872j2457609j1292458j0019421
$$ 802880287 800709844 797211826 791829824 783515692 772119820 759662211 748369753 738350332
705.7G38350332r525717r346485j0573744j6860307l3350825o6408396j15817696j51588946
$$ 738350332 728824615 719478130 708904386 692044079 658693254 592284858 476467162 324878216
722C24878216j32008374o4843327J838312M0580243O2341273Q3193585J06224626J20683611
$$ 324878216 192869842 128026515 129864827 170445070 232786343 315979928 422204554 542888165
738.3E42888165J11611485Q0954790M7312975K4456799J2547255O791234L919243K304733
$$ 542888165 654499650 735454440 782767415 807224214 819771469 826562703 830481946 832786679
754.7H32786679J185417L17455m01259j005292j560568k076149k391637k504766k610087
$$ 832786679 833972096 834289551 833888292 832883000 831322432 829246283 826854646 824349880 821739793
773H21739793k731502k981186l685296m936397o978333j0143161j3876319j7154038
$$ 821739793 819008291 816027105 812341809 807405412 800427079 790283918 776407599 759253561
789.3G59253561j6783416p649183P178307J4836370J0556221L404677M69625M88162
$$ 759253561 742470145 734820962 741999269 756835639 767391860 770796537 771266162 771754324
805.6G71754324Q45314R52363R52482R71973R66787Q43346L98755m56452j445294k484262
$$ 771754324 772599638 773552001 774504483 775476456 776443243 777286589 777685344 777228892 775783598 773299336
826G73299336l606915m800379o039918p091522p563770p445097o966531o379008n524934
$$ 773299336 769692421 764892042 758852124 751760602 744196832 736751735 729785204 723406196 717881262
844.4G17881262l556549m09484K373040L445506L105282J909852j73151l511906q671283
$$ 717881262 714324713 713915229 716288269 719733775 722839057 724748909 724575758 721063852 712392569
862.8G12392569j6614974k8837383m3984532m6596289k1179974J3304055K9742956
$$ 712392569 695777595 666940212 622955680 576359391 555179417 568483472 598226428
877E98226428L0754030K7156770K1746099J5890479J0633707O099224K310693k89142
$$ 598226428 628980458 656137228 677883327 693773806 704407513 710506737 712817430 712528288
893.4G12528288j158774J24693L376127P642984J1713684J4538288J5388906J4193415
$$ 712528288 711369514 711494207 714870334 722513318 734227002 748765290 764154196 778347611
909.7G78347611J1607528Q594036N881071L777624K319395J315355N55277j8239l35872
$$ 778347611 789955139 798549175 804430246 808207870 810527265 811842620 812397897 812379658 812043786
928H12043786n21302o98030q02934r02951j037240j160920j288950j442611j610578
$$ 812043786 811522484 810824454 810021520 809118569 808081329 806920409 805631459 804188848 802578270
946.4H02578270j744926j937150k371431l064513l959775n148649o788135q882761
$$ 802578270 800833344 798896194 796524763 793460250 789500475 784351826 777563691 768680930
962.7G68680930j1220872j3263345j3670445j0420620l059983N349517J0583818J1380732
$$ 768680930 757460058 744196713 730526268 720105648 717045665 722395182 732979000 744359732
979G44359732R418368O493270L398061Q86619K65777J332939J768291L97682j649976
$$ 744359732 753778100 760271370 763669431 764556050 764821827 766154766 767923057 768320739 766670763
997.4G66670763l430783n230427p960379j2852609k1273971l6097467o2674820r4476223
$$ 766670763 763239980 758009553 750049174 737196565 715922594 679825127 617150307 522674084
1013.7E22674084r9320829n5694461N616009M1781485N4406375N8828801M7783255
$$ 522674084 423353255 367658794 373274803 415056288 469462663 528291464 576074719
1028E76074719K3920060N534887l018916p172227r054660q120060m063130K332211
$$ 576074719 599994779 605529666 602510750 595338523 586283863 578163803 574100673 576432884
1044.3E76432884R493053J5700757J9756973K1094263J9573688J5462220R694755L505647
$$ 576432884 585925937 601626694 621383667 642477930 662051618 677513838 687208593 690714240
1060.6F90714240k093136o770373j0664343j4229000j8350244k4076283l1930685m1165769
$$ 690714240 688621104 681850731 671186388 656957388 638607144 614530861 582600176 541434407
1076.9E41434407m9524903n4143339n4096431n1350504m8550636m6320006m3225601
$$ 541434407 491909504 437766165 383669734 332319230 283768594 237448588 194222987
1091.2A94222987l7747458k9714405k0227641j0507778j460790O357334J2398005J5258424
$$ 194222987 156475529 126761124 106533483 96025705 94564915 100922249 113320254 128578678
1107.5A28578678J3023913O678283k33740n787790q540138o807968j822055L172368
$$ 128578678 141602591 148280874 148047134 142259344 133719206 126911238 125089183 128261551
1123.8A28261551O186381P511482R595737J5377238K5696218L7717447M6955675N1661521
$$ 128261551 134447932 141959414 151555151 166932389 192628607 230346054 277301729 328963250
1140.1C28963250N3457320N3940832N2884639M9704581M4655621L8378298L1374515
$$ 328963250 382420570 436361402 489246041 538950622 583606243 621984541 653359056
1154.4F53359056K4268329J7843842J2479663P623196K025664n034447j1931956j4775395
$$ 653359056 677627385 695471227 707950890 715574086 717599750 712565303 700633347 685857952
1170.7F85857952j1199177l064155N703270J2142718J4923155J4013529J0669410O753683
$$ 685857952 674658775 671594620 677297890 689440608 704363763 718377292 729046702 735800385
1187.1G35800385L365338M97997k138376m446983o148816p171034p663727p886172
$$ 735800385 739165723 739663720 737525344 733078361 726929545 719758511 712094784 704208612
1203.4G04208612q073329q368791q948266j0096908j1879802j4340400j7626703k1233857
$$ 704208612 696135283 687766492 678818226 668721318 656841516 642501116 624874413 603640556
1219.7F03640556k4102926k6401639l0430436l8747430n1419139o4966738p3665500
$$ 603640556 579537630 553135991 522705555 483958125 432538986 367572248 293906748
1234B93906748p2885021o2435568m6598076l0984492j8971990j1082508o419577l914494
$$ 293906748 221021727 158586159 111988083 81003591 62031601 50949093 44529516 40615022
1250.3D0615022k760552k503965k720561k788795k271445j107421L12893J707447K913013
$$ 40615022 37854470 35350505 32629944 29841149 27569704 26462283 26775176 28482623 31395636
1268.6C1395636L822294M233770M336178M597969N184528O156031P458966R005576
$$ 31395636 35217930 39451700 43787878 48385847 53570375 59726406 67185372 76190948
1285G6190948J0696836J2846582J6020924K0932823K7881369L6263243M3681591M6638549
$$ 76190948 86887784 99734366 115755290 136688113 164569482 200832725 244514316 291152865
1301.3B91152865M4240117M0205866L8559198L8296223L6898047L3958822L0346215
$$ 291152865 335392982 375598848 414158046 452454269 489352316 523311138 553657353
1315.6E53657353K7684212K6133120K4476647K2204340J8155872J0800422p08878j6820670
$$ 553657353 581341565 607474685 631951332 654155672 672311544 683111966 682403088 665582418
1331.9F65582418l5897433n3473831o3605308n5221409j9323438K9254049O5521032
$$ 665582418 629684985 576211154 512605846 457384437 438060999 467315048 532836080
1346.2E32836080P3278725N7585835L6299050J9960225Q660555j67788r409189k1979987
$$ 532836080 606114805 663700640 699999690 719959915 728620470 728452682 719043493 697063506
1362.5F97063506l2299638l2917798k5628447j1773110L358066J4262021J7608404
$$ 697063506 664763868 631846070 606217623 594444513 597802579 612064600 629673004
1376.7F29673004J5988767J2344957P182657L017605Q91745q22604l442585p590950
$$ 629673004 645661771 658006728 665189385 668206990 669098735 668276131 664833546 657242596
1393.1F57242596j3937473k0634353k9337347l9177298n2370787o9887191o6642374
$$ 657242596 643305123 622670770 593333423 554156125 501785338 431898147 365255773
1407.3C65255773l0333459K7696639Q0800205R9767924R2735290P1895719L7880540
$$ 365255773 334922314 362618953 443419158 543187082 635922372 707818091 745698631
1421.6G45698631J5999377N903363k123237r785294j5511156j7365217j9686520j9439757
$$ 745698631 761698008 767601371 765478134 755692840 740181684 722816467 703129947 683690190
1437.9F83690190j2671888p838487n718887m792035n344510n574882l902018J92583
$$ 683690190 671018302 663179815 657460928 652668893 647324383 641749501 637847483 638040066
1454.3F38040066R028554J8564582J7179131J6032338J7302692J1631012K138972O96302
$$ 638040066 647068620 665633202 682812333 698844671 716147363 727778375 729917347 730613649
1470.6G30613649R894371J7765820J5460312J1798978R877801Q576870O889641N651355
$$ 730613649 740508020 758273840 773734152 785533130 795410931 803987801 810877442 816528797
1486.9H16528797M098416J008927k103269o023049j5454292l0008614m1023911l9436936
$$ 816528797 820627213 821636140 819532871 813509822 798055530 768046916 727023005 687586069
1503.2F87586069j6856968L4684121M9003005K7619839J5425205Q075536L357768L70562
$$ 687586069 670729101 705413222 754416227 782036066 797461271 805536807 808894575 809265137
1519.5H09265137j434863j937747r23633K79665J321017K386272L085196K383769K193928
$$ 809265137 807830274 805892527 804968894 805248559 806569576 808955848 812041044 814424813 816618741
1537.9H16618741K583265P92801r01103j094758p68066o59823p01130n38885o6757
$$ 816618741 819202006 819994807 819093704 817998946 817230880 816571057 815869927 815331042 815264285
1556.2H15264285n88477l311336l617227l526926m472673p104695j2198508j4889002
$$ 815264285 814675808 811364472 807747245 804220319 799747646 792642951 780444443 765555441
1572.6G65555441j8305659k1594763p927835J1230469K2510052K2564590J5247226
$$ 765555441 747249782 725655019 717727184 728957653 751467705 774032295 789279521
1586.8G89279521Q214592M085601J861393J76668j390516k416134k917707l414214
$$ 789279521 797494113 801579714 803441107 803617775 802227259 799811125 796893418 793479204
1603.2G93479204m224181n687475p385671p432878m347027J511216P211507O383598
$$ 793479204 789255023 783567548 776181877 768748999 764401972 765913188 773124695 779508293
1619.5G79508293L469944J651108K6286p16389r59813p27177k13444m04358j473844
$$ 779508293 782978237 784629345 784655631 783939242 782979429 782252252 782038808 781634450 780160606
1637.8G80160606j599908j201034p63297p82072j647413j548350j534223l863514m720211
$$ 780160606 778560698 777359664 776596367 775814295 774166882 772618532 771084309 767220795 762500584
1656.2G62500584m459619n431354p757068r557247r044588r909153j1874914j0741353
$$ 762500584 758040965 752609611 744852543 735295296 726250708 716341555 704466641 693725288
1672.5F93725288j1281431j3517201j3383865j2653351j1570692r497225o405473o848216
$$ 693725288 682443857 668926656 655542791 642889440 631318748 621821523 615416050 608567834
1688.8F08567834j0698676j4109016k1040857k9428422l8744897n6603461n7542354
$$ 608567834 597869158 583760142 562719285 533290863 494545966 437942505 380400151
1703.1C80400151o4640045p8701854p2928011o0111642m4478826k7963091j3543373
$$ 380400151 315760106 237058252 164130241 104018599 59539773 31576682 18033309
1717.4A8033309l245823M69185J706869K531629L767755N380479Q678872J8224445
$$ 18033309 14787486 15256671 16963540 19495169 23262924 28643403 37322275 55546720
1733.7E5546720K8008978L5541140N8310650Q2009986R1231376R1608256Q4433914
$$ 55546720 83555698 119096838 177407488 259417474 350648850 442257106 526691020
1748E26691020P4767470N6918681L6321520K6501716K1749675J6246915J3265311R801746
$$ 526691020 601458490 658377171 694698691 721200407 742950082 759196997 772462308 782264054
1764.3G82264054P160663O467522N793810N096554L545821K380311K273083K390266
$$ 782264054 789424717 795892239 801686049 806782603 810328424 812708735 814981818 817372084
1780.6H17372084K047240J780034J502215J408041J573801J371741O35684L96490N73754
$$ 817372084 819419324 821199358 822701573 824109614 825683415 827055156 827690840 828087330 828661084
1799H28661084M33803J31726m2438P0989J66714P6830j55151j50859k8849N3525K71976
$$ 828661084 829094887 829226613 829184175 829255164 829421878 829498708 829343557 829192698 829163849 829217374 829489350
1821.4H29489350O18220R63568J181066J517177J504600J395166J602173J788616J794279
$$ 829489350 830107570 831071138 832252204 833769381 835273981 836669147 838271320 840059936 841854215
1839.8H41854215J926601K209663J901150J408934J317025J384615J328707J175702
$$ 841854215 843780816 845990479 847891629 849300563 850617588 852002203 853330910 854506612
1856.1H54506612R63092P61330O20782O11484P12097N21898K3484j76489l7849k4974
$$ 854506612 855469704 856231034 856851816 857463300 858175397 858697295 858720779 858544290 858506441 858481467
1876.5H58481467r1076j30177j46329j88232k41220l40938n61655o31213o09815o34015
$$ 858481467 858390391 858260214 858113885 857925653 857684433 857343495 856781840 856150627 855540812 854906797
1896.9H54906797o66797o26087n72801n35965n48005o45220p48098p42197o27875o61612
$$ 854906797 854240000 853613913 853041112 852505147 851957142 851311922 850563824 849821627 849193752 848532140
1917.3H48532140q11159q94666j019836j157760j188517j252174j388252j574159j760363
$$ 848532140 847720981 846826315 845806479 844648719 843460202 842208028 840819776 839245617 837485254
1935.6H37485254j867414j908064k018213k189517k067387j707256j318514r56595
$$ 837485254 835617840 833709776 831691563 829502046 827434659 825727403 824408889 823452294
1951.9H23452294p07507n86152l08395L88444J433491K483428L059268K924681K348005
$$ 823452294 822744787 822158635 821850240 822238684 823672175 826155603 829214871 832139552 834487557
1970.3H34487557J833857J462876J149297R30309Q06570P19011O44923O40153P12991
$$ 834487557 836321414 837784290 838933587 839863896 840670466 841389477 842034400 842674553 843387544
1988.7H43387544Q21829Q28147P65622P85648Q27492P86125O95825O29961N84305N49316
$$ 843387544 844209373 845037520 845803142 846588790 847416282 848202407 848898232 849528193 850112498 850661814
2009H50661814N23389N17070N03480M08352K84850K89381L53038L33488K68817K34962
$$ 850661814 851185203 851702273 852205753 852614105 852898955 853188336 853541374 853874862 854143679 854378641
2029.4H54378641K16603J66476Q4102M947m6134j22964j70291j45197j60217k39551
$$ 854378641 854595244 854761720 854845822 854850769 854804635 854681671 854511380 854366183 854205966 853966415
2049.8H53966415l53396m55558m91262m93645n07713n29647n58853n85854n99503o22273
$$ 853966415 853613019 853157461 852666199 852172554 851664841 851135194 850576341 849990487 849390984 848768711
2070.2H48768711o32107o10113n96464n72741n14925m73141m89116n02706m54247l95119
$$ 848768711 848136604 847526491 846930027 846357286 845842361 845369220 844880104 844377398 843923151 843528032
2090.6H43528032l47018k99454k73764k49684k07841j63198j32203j34587j44839j27733
$$ 843528032 843181014 842881560 842607796 842358112 842150271 841987073 841854870 841720283 841575444 841447711
2111H41447711o8545K9504J19567J57773J78337K28763K58327K33948K04086K02894
$$ 841447711 841379166 841408670 841528237 841686010 841864347 842093110 842351437 842585385 842789471 842992365
2131.4H42992365K04206J66893J18255J20521J67191J91510J97947K60532L63886M16041
$$ 842992365 843196571 843363464 843481719 843602240 843769431 843960941 844158888 844419420 844783306 845199347
2151.8H45199347M19557M32908M84884N13256M90427M87089M97877M48644L25919K42769
$$ 845199347 845618904 846051812 846536696 847049952 847540379 848027468 848525345 848973989 849299908 849542677
2172.2H49542677K68877L00109K34247J55150J35065J40845J18196M7625j0431l0935
$$ 849542677 849811554 850111663 850345910 850501060 850636125 850776970 850895166 850942791 850932360 850901425
2192.6H50901425l3617o2108j31250k16543k95997l44694l50356l04222k05576j00851
$$ 850901425 850867808 850805700 850674450 850457907 850161910 849817216 849466860 849162638 848957062 848856211
2213H48856211o7771q5771j01507j34587j77920j86920j73688j75774k24352k75969
$$ 848856211 848788440 848702669 848601162 848466575 848288655 848101735 847928047 847752273 847527921 847251952
2233.4H47251952k65360k45452k61068k89977k99156l31938l97682l88742l30507l01064
$$ 847251952 846986592 846741140 846480072 846190095 845890939 845559001 845161319 844772577 844442070 844141006
2253.8H44141006k38657j46806r8943j07944j16528p5280j3709n067r9480k10583k88189
$$ 844141006 843902349 843755543 843656600 843548656 843432128 843356848 843343139 843338072 843238592 843028009 842739820
2276.2H42739820l76522m37737l97086k38061j6927J94370L53098M85122N67854N54085
$$ 842739820 842363298 841925561 841528475 841290414 841273487 841467857 841820955 842306077 842873931 843428016
2296.6H43428016N05089M38333L07381J35839q6129l17633l55482k67088l43621n72860
$$ 843428016 843933105 844371438 844678819 844814658 844728529 844410896 844055414 843788326 843444705 842871845
2317H42871845q22306j006186r37939o44862m36127l91305k67267q8275j58727l27110
$$ 842871845 842049539 841043353 840105414 839460552 839024425 838633120 838365853 838277578 838118851 837791741
2337.4H37791741l46005k44320L1949N77867P01427j30832j317561k014100j944900
$$ 837791741 837445736 837201416 837233365 837811232 838512659 838381827 837064266 835050166 833105266
2355.8H33105266j480102q62718m15862r8884J87636L88562O47068Q61526Q44002P66217
$$ 833105266 831625164 830762446 830346584 830247700 830435336 830823898 831470966 832332492 833176494 833942711
2376.2H33942711P48992P33376O26504M37856K73526J62601J26362J44839J59979K35081
$$ 833942711 834691703 835425079 836051583 836489439 836762965 836925566 837051928 837196767 837356746 837591827
2396.6H37591827L33428L38674L40223L90411L99351L75867L70741L75330L96788M39584
$$ 837591827 837925255 838263929 838604152 838994563 839393914 839769781 840140522 840515852 840912640 841352224
2417H41352224M68731M51207M06325M38392M96567M36067L39091L35932L81231L57509
$$ 841352224 841820955 842272162 842678487 843116879 843613446 844049513 844388604 844724536 845105767 845463276
2437.4H45463276K88546K74777K66672J95086J10745P0810P5758Q5294N9009K145j5616
$$ 845463276 845751822 846026599 846293271 846488357 846599102 846669912 846745670 846830964 846889973 846892118 846876502
2459.8H46876502p153n7935r8408q6009j20163j85430j88112j79768k18809k59995
$$ 846876502 846869349 846811414 846713006 846626997 846506834 846321404 846133292 845953524 845734715 845474720
2480.2H45474720k91705l06606l12448l17514l29018l65197l56794l02016k87831k53141
$$ 845474720 845183015 844876409 844563961 844246447 843917429 843552232 843195438 842893422 842605591 842352450
2500.6H42352450j86980j79052j91510j71065j41740j59979k15948k33888k25961k30432
$$ 842352450 842165470 841986418 841794908 841623843 841482103 841322124 841106176 840872288 840646327 840415895
2521H40415895k19703k04921j88827j46508q4043m1842n1975n3823l5823l8564k5332
$$ 840415895 840196192 839991271 839802444 839655936 839571893 839530051 839478076 839424253 839388430 839349866 839324534
2543.4H39324534Q94n007j5378N305K2948K8848K3425n543J5974O8426P5340R7871
$$ 839324534 839325428 839320421 839305043 839310348 839333296 839362144 839385569 839380026 839396000 839464426 839539766 839637637
2567.9H39637637R9480K0802m3630l4333P689L3081Q4758J73271K66253L32177L29554
$$ 839637637 839737117 839757919 839714289 839679956 839687645 839720726 839805484 839978755 840245008 840577185 840906739
2590.3H40906739L40402L89338L47435K48969K34544K33233J67608Q1480n245l2425
$$ 840906739 841247141 841636479 841983914 842232883 842467427 842700660 842868268 842949748 842944503 842912078
2610.7H42912078J79L099l9518j03533j66178j90615j74821j01685M4405J87397K85983
$$ 842912078 842912257 842915356 842875838 842772305 842606127 842415512 842240691 842139006 842183411 842370808 842656791
2633.2H42656791L86059M69447M51326L49999K58266K09630J58072Q7797O7771O7532
$$ 842656791 843042850 843512297 843963623 844313622 844571888 844781518 844939590 845027387 845095158 845162690
2653.5H45162690L8147K1279L0040M9055L6836l398O0K4020J669j9908k7477k1577
$$ 845162690 845200837 845222116 845252156 845301211 845338047 845334649 845334709 845358729 845360398 845340490 845313013 845291436
2678H45291436L0398O1095L0577j6928l9458m1842o5327r4891j19865j37150j31428
$$ 845291436 845321834 845382929 845413506 845396578 845357120 845315278 845249951 845155060 845035195 844898045 844766617
2700.5H44766617j50144j95205k07067j93000j96218j70410j12534j24991j66475j86980
$$ 844766617 844616473 844421268 844214201 844021201 843824983 843654573 843542039 843417048 843250573 843063593
2720.9H43063593k38001k75732k55763k40684k86817l47555l39925k83599k71559l05950
$$ 843063593 842825592 842549860 842294097 842053413 841766596 841419041 841079116 840795517 840523958 840218008
2741.2H40218008l14236k90394k59340k07305j58608j42634j20580p9810n6267k2948
$$ 840218008 839903772 839613378 839354038 839146733 838988125 838845491 838724911 838645101 838588834 838565886
2761.6H38565886K1577j252m1783l4809o1452j24812j28210j22249k00391k83956l51906
$$ 838565886 838587463 838586211 838544428 838509619 838448167 838323355 838195145 838072896 837872505 837588549 837236643
2784.1H37236643m25041m00543l13699l22283m34041n46455n42104m42028l64840k85328
$$ 837236643 836811602 836411059 836097360 835775077 835341036 834794581 834252477 833810449 833445609 833160281
2804.5H33160281j86443r3401K8730J34587J46151Q1718l4869k17438m12106n28038
$$ 833160281 832973838 832880437 832909167 833043754 833189905 833271623 833236754 833019316 832607210 832079172
2824.9H32079172n98132p04945q30888r30667r94027j042664j145363j380920j720548
$$ 832079172 831481040 830776095 829945207 829014540 828020513 826977849 825832486 824451566 822731018
2843.2H22731018k066493k297163k306998k162873j938999j622677j282215j003206
$$ 822731018 820664525 818367362 816060364 813897491 811958492 810335815 809053600 808050394
2859.5H08050394q17537p69198q64506r88305j074791j147925j160682j197993j436890
$$ 808050394 807232857 806463659 805599153 804610848 803536057 802388132 801227450 800029457 798592567
2877.9G98592567j797854k067388k102375j831889j260698m94003K22862O88732Q34345
$$ 798592567 796794713 794727325 792624950 790793061 789532363 789038360 789261222 789949954 790784299
2896.3G90784299N43476j89543j046360j420200p67231P24137K182007K877414K738178
$$ 790784299 791327775 791138232 790091872 788671672 787904441 788628578 790810585 793687999 796426177
2914.6G96426177K181351J596332J079976N98133J24454l47375q15273j319587k010465
$$ 796426177 798607528 800203860 801283836 801881969 802006423 801659048 800843775 799524188 797513723
2933G97513723l027618m364430n981386p727444r299100j0424733j0938525j0769963
$$ 797513723 794486105 790121675 784140289 776412845 767113745 756689012 745750487 734980524
2949.3G34980524r950877q671224p078528n165756l058016j034022P11263K114236
$$ 734980524 725029647 716358423 709279895 704114139 701056123 700022101 700733364 702847600
2965.6G02847600L390074M950404O720424P989943Q234560P684529O846666O000221
$$ 702847600 706237674 711188078 717908502 725898445 734133005 741817534 748664200 754664421
2981.9G54664421N278647M717231M234671L745377L259480K812863K444327K193928
$$ 754664421 759943068 764660299 768894970 772640347 775899827 778712690 781157017 783350945
2998.2G83350945K057373K016425K025664K019465J906097J822174K112925K794027
$$ 783350945 785408318 787424743 789450407 791469872 793375969 795198143 797311068 800105095
3014.5H00105095L523111L884971L661216L060937K433359J937628J568854J265228
$$ 800105095 803628206 807513177 811174393 814235330 816668689 818606317 820175171 821440399
3030.9H21440399R82999O71804K99871j65045q18252j726985k879739m077077m696190
$$ 821440399 822423398 823095202 823395073 823230028 822411776 820684791 817805052 813727975 809031785
3049.2H09031785m093290k373218l01063J159191J361668N84721k90274n83768k68996
$$ 809031785 804938495 802565277 802264214 803423405 804785073 805369794 805079520 804495752 804226756
3067.6H04226756K02298M54247M11213J68204n6088O2287O74963J514435K134621K328217
$$ 804226756 804429054 804883301 805294514 805462718 805406630 805468917 806143880 807658315 809792936 812121153
3088H12121153K014041J186728J04547q86679j430631j320183o35505L88504J352548
$$ 812121153 814135194 815321922 815426469 814539790 813109159 811788976 811153471 811541975 812894523
3106.3H12894523J944125K143442K057612J796306J403868Q80778K90691j50024k47598
$$ 812894523 814838648 816982090 819039702 820836008 822239876 823120654 823411345 823261321 823013723
3124.7H23013723o7771K87891P04825R47177R99868J036286R94385P62999N12540L93510
$$ 823013723 822945952 823233843 823938668 824885845 825885713 826921999 827916384 828679383 829191923 829585433
3145.1H29585433L55780L51131L64721L68297L30091K66552K19643J63138J02400P8202
$$ 829585433 829941213 830292344 830657065 831025362 831355453 831622005 831841648 832004786 832107186 832185388
3165.5H32185388P7664P3910L8624O795M3392Q4758N1677K0385K9862J4126k9385l0339
$$ 832185388 832263052 832336962 832375586 832382381 832425773 832510531 832562208 832582593 832612455 832626581 832597196 832566857
3189.9H32566857M0233R1255O7234O6519J13189J06693N3584K3425J3232k1338n2333
$$ 832566857 832607090 832698345 832765579 832832098 832945287 833051980 833105564 833128989 833142221 833120883 833068550
3212.4H33068550n9128j44541k06531j49190j19925j40368j65523j35660l4272N6207
$$ 833068550 833009422 832864881 832658350 832509160 832389235 832248867 832083344 831947684 831913412 831969619
3232.8H31969619N9783q046r358P1704J45257J68264J18076J5200j9968J0192P272
$$ 831969619 832029402 832021356 832011998 832083702 832228959 832397223 832515299 832530499 832510531 832520723 832527995
3255.2H32527995J7107P391n8234o6996j9788p988j549q464r0540j89065j92762j06752
$$ 832527995 832545102 832552493 832494259 832427263 832407475 832399487 832397938 832389474 832298934 832109869 831917107 831810355
3279.7H31810355j02758j75655j80602j81258k14338k25008k27928k15053j71602r3818
$$ 831810355 831707597 831531942 831351340 831170082 830955744 830730736 830502808 830287755 830116153 830022335
3300.1H30022335K0206J05262J28865J02282R179o6519l7611m3332j11222j53840k50101
$$ 830022335 830042541 830147803 830276668 830378950 830388129 830321610 830283999 830240667 830129445 829975605 829725504
3322.5H29725504l86834m51982m36723l88802l16083k09749q4042L1888J13011J87158
$$ 829725504 829338670 828886688 828449965 828061163 827745080 827535331 827451289 827483177 827596188 827783346
3342.9H27783346K52605K86698K99454L15547L69429L76344K45512J14917Q5116M3690
$$ 827783346 828035951 828322649 828622103 828937650 829307079 829683423 829928935 830043852 830128968 830172658
3363.3H30172658j2398m4405p0572n96P6592K6703k9207p2598j22011j16885j26540
$$ 830172658 830160260 830115855 830045283 830044687 830121279 830147982 830118775 830046177 829924166 829807281 829680741
3385.7H29680741k31087l43681l57330l64601m93229o99818q17895q18729r09925j151919
$$ 829680741 829449654 829105973 828748643 828384042 827890813 827190995 826373100 825554371 824644446 823492527
3406.1H23492527j412332j654089j875221k044618k232731k477944k732038l003478
$$ 823492527 822080195 820426106 818550885 816506267 814273536 811795592 809063554 806060076
3422.5H06060076l195286l138602k606809j302659M12106J716733K444983K759516
$$ 806060076 802864790 799726188 797119379 795816720 796228826 797945559 800390542 803150058
3438.8H03150058K675712K358019K055109J914024J830578J669645J482964J307964
$$ 803150058 805825770 808183789 810238898 812152922 813983500 815653145 817136109 818444073
3455.1H18444073J129449R61721Q90076Q12113N84126M17351N23746O67691N19872
$$ 818444073 819573522 820535243 821425319 822237432 822821558 823238909 823762655 824430346 824950218
3473.4H24950218K17080L0160M5359J46628q583k50876k18570j73629k71737l35634
$$ 824950218 825167298 825197458 825242817 825389445 825380862 825129986 824911416 824737787 824466050 824130416
3493.8H24130416l32654l22222l37243l91424m67420m84049n06759o55412p60496o70493
$$ 824130416 823797762 823475540 823138297 822746873 822279453 821795404 821288645 820633233 819872737 819202244
3514.2H19202244n82993n72741n25117n93960p97808r21369r48846q66532p31349o91891
$$ 819202244 818619251 818046510 817521393 816927433 816129625 815208256 814259410 813392878 812661529 811969638
3534.6H11969638p33614p11382n49256l49880k92122l96013l86536k14577q9228j192
$$ 811969638 811236024 810524642 809975386 809625506 809333384 808937371 808550835 808336258 808247030 808245838
3555H08245838J64568M13954O45459Q50558J021088P91013L58104M19140O71089P51257
$$ 808245838 808410406 808824360 809469819 810320377 811341465 812132478 812490582 812909722 813580811 814332068
3575.4H14332068O66738N36501N45084P17700O89804P7785m08948k52426k30133m48823
$$ 814332068 814998806 815535307 816080391 816798091 817487895 817565680 817156732 816904306 816674173 816225350
3595.8H16225350m82023m89771o09160m99427k70665l41296n15818n85497o49512n10871
$$ 816225350 815743327 815253556 814644396 814144969 813874304 813533008 813017190 812431693 811782181 811271310
3616.2H11271310n03957q49784q30948k54274L16143J41800l65138j49429J68920L34918
$$ 811271310 810767353 809917569 809086621 808832347 809148490 809290290 808925152 808775723 808944643 809279561
3636.6H09279561N13434O94395R38236J403630J884699J546740M77434L86297Q19743
$$ 809279561 809792995 810487390 811425626 812829256 814713955 816260695 816738129 817124426 817944169
3655H17944169R51588Q84116R11593R98855J207113J512349J490414J205504J161277
$$ 817944169 818895757 819779873 820691466 821690321 822897434 824409783 825900197 827105701 828266978
3673.3H28266978Q31306Q3804j91629o7234L66271J025557J469553J139700M79579
$$ 828266978 829098284 829182088 828990459 828923225 829289496 830315053 831784606 832924306 833403885
3691.7H33403885L44813M73917O39081O57916L02434P9393M29034Q51810P37131m7684
$$ 833403885 833748698 834222615 834861696 835519612 835822046 835901439 836330473 837182283 837919414 837871730
3712.1H37871730m34458k13325O974J06811N7996k11716m53949j21653M13120O29007
$$ 837871730 837437272 837223947 837230921 837337732 837395728 837184012 836730063 836608410 837021530 837650537
3732.5H37650537L36230l03864l05534K40863L60071o198R5486J38462n60880r27627
$$ 837650537 837986767 837682903 837377369 837618232 837978303 837972105 838067591 838206053 837645173 836717546
3752.9H36717546l86953M5776j05441k65121K7478K68876K48075j1742k89321j99795
$$ 836717546 836330593 836376369 836270928 836005807 836033285 836302161 836550236 836538494 836249173 836049378
3773.3H36049378J30117L37958J36793j19686j44422j87636j39475j2397R2268K27749
$$ 836049378 836179495 836517453 836654246 836534560 836390138 836202502 836063027 836050630 836142898 836370647
3793.7H36370647K52902K47121Q6367m02450l84987j78575k70307j09315L11613N27680
$$ 836370647 836623549 836870670 836957037 836554587 836169600 835991025 835720718 835611403 835923016 836450696
3814.1H36450696L51131L39150O6758n20528l24785k6882K0027M0710J21117L72290
$$ 836450696 836801827 837140977 837207735 836687207 836362422 836335540 836355567 836396277 836517394 836889684
3834.4H36889684L77357K682k37166m08590m87030j84119L86119P88629J05143j023293
$$ 836889684 837267041 837269723 837032557 836623967 836136937 835952818 836338937 837127566 837232709 836209416
3854.8H36209416n77032K5809K49564J87159L7789J97232J25587k32339m08411l43740
$$ 836209416 835632384 835658193 835907757 836094916 836132705 836329937 836455524 836223185 835814774 835471034
3875.2H35471034R3877K44201J2874p8678k83360k23637N3763j30593k58804J04964
$$ 835471034 835564911 835809112 835821986 835743308 835459948 835236311 835290074 835159481 834900677 835005641
3895.6H35005641L70860K72214j9550m09067o02602m26293j94251k1816R5010J01328
$$ 835005641 835376501 835648715 835629165 835220098 834617496 834191203 833996952 833975136 834070146 834171474
3916H34171474o914n9188n1617j49846j32859Q2195J56343p8500k87532j55449P3194
$$ 834171474 834164560 834105372 834053755 833903909 833771050 833853245 834009588 833931088 833643556 833488107 833561301
3938.5H33561301P7665j50740j96278N6982J23918j00613k22623j58787j23381j18018
$$ 833561301 833638966 833488226 833291948 833348930 833472848 833372235 833149612 832990825 832867444 832749426
3958.9H32749426n2511m232o4731j50382j45019q7142j46389k38180j46269l4810l0398
$$ 832749426 832696915 832692683 832627952 832477570 832332551 832245409 832099020 831860840 831714571 831679761 831649363
3981.3H31649363o1572q7976o7651n5909m7625k2113l0100k1517
$$ 831649363 831587791 831499815 831432164 831376255 831328630 831306517 831276417 831254900
3997.6H31254900
$$ 831254900
##END=$$ End of the data block
