##TITLE=DI 14_2020797-2 $$ Begin of the data block
##JCAMP-DX=5.00 $$ ACD/SpecManager v 10.08
##SPECTROMETER/DATA SYSTEM=Alpha
##DATE=12 Nov 2014 09:25:08
##DATA TYPE=INFRARED SPECTRUM
##DATA CLASS=XYDATA
##ORIGIN=
##OWNER=
##NPOINTS=1667
##FIRSTX=599.64648438
##LASTX=3997.64306641
##MAXX=3997.64306641
##MINX=599.64648438
##MAXY=1.03187871
##MINY=0.58084995
##XFACTOR=1.0000000000
##YFACTOR=0.000000010000000
##FIRSTY=0.90955061
##DELTAX=2.03961372
##XUNITS=1/CM
##YUNITS=ARBITRARY UNITS
##XYDATA=(X++(Y..Y))
599.6I0955061k72560l00068k88701k11471j13339n7715n2082o7479k9468O5469J59705
622.1H9787352K99513M57263N69249O24895N99324M78399K69211R936m3047K71529
642.5I3323624O23191P19690O73050O27315N58513M78083M31073L98272L42613K61224
662.9I8436648K3704l58700j45257L91060K11936p1340j70708j99538k26456k67840
683.3I7623509l02690k98268k44415j63882p2772J4997R6559J65683J84417J41192
703.7I7144330R3227Q8984J02341R4438P1454L4117l7169p6747n4532m8387o8492q2040
728.1I7261524r4384j25861j79309k52586l42208m46117n82725p37923q81565j033258
748.5I2585588j146818j058662o76280q6522M93062Q39090Q59100O13617K45643n0867
$$ plain form
599.6 90955061 90682501 90382433 90093732 89882261 89768922 89711207 89659125 89591646 89562178 89627647 89787352
622.1 89787352 90086865 90544128 91113377 91738272 92337596 92815995 93085206 93095142 93052095 93323624
642.5 93323624 93946815 94666505 95339555 95966870 96525383 97003466 97434539 97832811 98175424 98436648
662.9 98436648 98460352 98101652 97956395 98347455 98559391 98488051 98317343 98117805 97891349 97623509
683.3 97623509 97320819 97022551 96778136 96614254 96541482 96556479 96653038 96818721 97003138 97144330
703.7 97144330 97237557 97326541 97428882 97523320 97594774 97628891 97591722 97514975 97460443 97412056 97343564 97261524
728.1 97261524 97167140 97041279 96861970 96609384 96267176 95821059 95238334 94500411 93618846 92585588
748.5 92585588 91438770 90380108 89703828 89617306 90110368 90949458 91808558 92422175 92667818 92616951
768.9I2616951r8019J23787M70697P64519Q55089P22140M96745K71648K7913k85840
789.3I5965630p34812j367599k182978k969206l139227k432079j677161j705146k032977
807.7G7724445j784843r69535j02252N21540R11659J129932J200103J198078J228141
826H1057268J336944J480854J557714J466471J190537P78991L53992P0864j02085l10099
846.4H8881451n21213n06079m8983P68882J499539J732058J477343J057940P84523
864.8I5125461P57944Q58844Q82452P27517M75239K49124R3210O985k8395l8684m5234
887.2I9064463o9135j01417j20396j10662o3658n328J4716l9679j76125l94923o56730
909.7I7341126q42523p57337k70039M23086R01925R50909O99592M04590K27088J71083
$$ plain form
768.9 92616951 92518932 92642719 93113416 93877935 94733024 95455164 95951909 96223557 96251470 95965630
789.3 95965630 95230818 93863219 91680241 88711035 85571808 83139729 81462568 79757422 77724445
807.7 77724445 75939602 74970067 74867815 75389355 76301014 77430946 78631049 79829127 81057268
826 81057268 82394212 83875066 85432780 86899251 88089788 88868779 89222771 89293635 89191550 88881451
846.4 88881451 88360238 87854159 87805176 88574058 90073597 91805655 93282998 94340938 95125461
864.8 95125461 95883405 96742249 97624701 98352218 98827457 99076581 99169791 99176776 99148381 99109697 99064463
887.2 99064463 98995328 98893911 98773515 98662853 98599195 98593867 98608583 98568904 98392779 97997856 97341126
909.7 97341126 96498603 95741266 95471227 95894313 96796238 97747147 98446739 98851329 99078417 99249500
930.1I9249500J54036J06907K1291q4037j74617j90735j17189n090Q1849J22052J14477
952.5I9278444N3740k4599m5175L5656J74856K91240L33470L13330K60973J91331J34528
974.9A00997794J01816P4470N4324N2118M8709K9958J0359J561p772j8489k4247l9936
999.4A01280665o9832j01829j51467k94090n43141r36306k113068l953218l467172
1017.8H9650542O46632M045088L674936J731628M77457k4009k39330l68810l98630
1036.1I9195504k92760j01638Q5747K13951K57719K11465J03915j5211j01614j55556
1056.5I9401522k48516m70304q88676j466733j974964k093572j685190r28926r8372
1074.9H9546269O76191J319617J662284J537335R93508L08478k88832p89535j283533
$$ plain form
930.1 99249500 99403536 99510443 99531734 99447697 99273080 99082345 98965156 98960066 99041915 99163967 99278444
952.5 99278444 99332184 99307585 99262410 99298066 99472922 99764162 100097632 100410962 100671935 100863266 100997794
974.9 100997794 101099610 101174080 101228404 101280522 101329231 101359189 101369548 101371109 101363337 101344848 101320601 101280665
999.4 101280665 101210833 101109004 100957537 100663447 100120306 99184000 97070932 93117714 89650542
1017.8 89650542 90297174 94342262 98017198 99748826 100226283 100202274 99962944 99594134 99195504
1036.1 99195504 98902744 98801106 98886853 99100804 99358523 99569988 99673903 99658692 99557078 99401522
1056.5 99401522 99153006 98682702 97794026 96327293 94352329 92258757 90573567 89644641 89546269
1074.9 89546269 90222460 91542077 93204361 94741696 95735204 96043682 95754850 94965315 93681782
1093.2I3681782j815593k341395k694458k635050k081913j220923k62648P11119J538461
1111.6H2879382J953584J900173J600855J280493J002252P16972L74425L481l31897
1129.9I1379720n99903p82144q60149q29577o71285l75891O14L75235O92272R03416
1150.3H9232308R59617Q69828O90842M80699L14576K53522K82729L50004M26495M69554
1170.7I4330174L93522J26272k40749l65448m4435M22239O37525N69821M15128K97344
1191.1I6541393K14106J55818J41227J39535J03974O4475R9605K55161M41176M91613
1211.5I8648083L70360J77925R633r5463j43385j66696j74213j53655j04666m1514
1231.9I8326409J5485O1810Q6737Q0818P1293O5082M7738K9975J2582j8054n5969r2762
$$ plain form
1093.2 93681782 91866189 89524794 86830336 84195286 82113373 80892450 80629802 81340921 82879382
1111.6 82879382 84832966 86733139 88333994 89614487 90616739 91333711 91708136 91711617 91379720
1129.9 91379720 90779817 89997673 89137524 88307947 87636662 87260771 87261385 87636620 88328892 89232308
1150.3 89232308 90191925 91061753 91752595 92233294 92547870 92801392 93084121 93434125 93860620 94330174
1170.7 94330174 94723696 94849968 94609219 94243771 94199336 94621575 95259100 95828921 96244049 96541393
1191.1 96541393 96755499 96911317 97052544 97192079 97296053 97360528 97460133 97715294 98156470 98648083
1211.5 98648083 99018443 99196368 99206001 99110538 98967153 98800457 98626244 98472589 98367923 98326409
1231.9 98326409 98341894 98403704 98490441 98571259 98642552 98707634 98755372 98785347 98797929 98779875 98723906 98631144
1256.4I8631144j20104j23262j03814p3117m1294j9991k5112o4045j37180k37518l36451
1278.8I7349256m01950l97515k76256n4281J14476O5893j49977k24882Q0639N03206
1299.2I6608609O03723M11660K03794O4141l7271j09005j42485j38128j11085q7565
1319.6I7266388p6687p3409p6616q7774j14572j53619j94317k07842j85984j66506
1340I5929062j77616k12854k77728l60286m29767m72921m84252m70376m39376m20940
1360.4I2182946m32545m19777l64989l22152k62183j73682r2071P177J40017K71416
1380.8I0534157L73178M71056N88190O40446N90629N73545N57053M13591K33048M8668
1401.2I5023561j80597n05238q89260j280564j585704j432520o73396L36445J018685
$$ plain form
1256.4 98631144 98511040 98387778 98283964 98210847 98169553 98149562 98124450 98060405 97923225 97685707 97349256
1278.8 97349256 96947306 96549791 96273535 96219254 96333730 96399623 96249646 96024764 96105403 96608609
1299.2 96608609 97212332 97623992 97827786 97891927 97854656 97745651 97603166 97465038 97353953 97266388
1319.6 97266388 97189701 97116292 97039676 96951902 96837330 96683711 96489394 96281552 96095568 95929062
1340 95929062 95751446 95538592 95260864 94900578 94470811 93997890 93513638 93043262 92603886 92182946
1360.4 92182946 91750401 91330624 90965635 90643483 90381300 90207618 90115547 90122724 90262741 90534157
1380.8 90534157 90907335 91378391 91966581 92607027 93197656 93771201 94328254 94741845 94974893 95023561
1401.2 95023561 94842964 94337726 93448466 92167902 90582198 89149678 88476282 88812727 89831412
1419.6H9831412P95984K58261j76030o15788j051402j157176p36976o3521O11437Q74209
1440H8570410R69529J049268J046372R56142O92606M20201K62969K53040K91252K56592
1460.4I4768381K89202L77154L48771K26211J88017J67597L4475j22500j90895k57707
1480.8I5828706l41326m04209m83888o80298r08583r07004r94176j395398j808149
1499.1H7905675j995730k092856k735043l869581k653629j041257n53197p23356j199090
1517.5G1041936j387030j359368p78710J03658Q83961J535672K279150L321177L332484
1535.8G8972930L046584L925168L706277K287763J628345J248402J021969Q13115O22391
1554.2I7272944M81636L78513P6294k18612l60709n70137j117295k043533k486938
$$ plain form
1419.6 89831412 90627396 90885657 90709627 90093839 89042437 87885261 87148285 87084764 87696201 88570410
1440 88570410 89539939 90589207 91635579 92591721 93284327 93704528 93967497 94220537 94511789 94768381
1460.4 94768381 95057583 95434737 95783508 96009719 96197736 96365333 96399808 96277308 96086413 95828706
1480.8 95828706 95487380 95083171 94599283 93918985 93010402 92103398 91109222 89713824 87905675
1499.1 87905675 85909945 83817089 81082046 77212465 74558836 73517579 72964382 72241026 71041936
1517.5 71041936 69654906 68295538 67516828 67620486 68504447 70040119 72319269 75640446 78972930
1535.8 78972930 82019514 85944682 89650959 91938722 93567067 94815469 95837438 96650553 97272944
1554.2 97272944 97754580 98133093 98209387 97990775 97630066 97059929 95942634 93899101 91412163
1572.6I1412163k611512k135366K765J853061K606016K381814J634163R08130L43174
1590.9I6394408r9874n15556r43464j366210j806718k219951k366394j918042o77282
1609.3H4480917R90439K219111L024047L255612K111620J194942Q91119N41144K64198
1627.6I8973149J31500N2917M6271K1273r5880j31113q7696l1483l99n2274q4501k8968
1652.1I8712796p3874j62673j14703m7797k6101o9875q4060m9961n7071r1702r3216
1674.5I7841763r8580j05732r1499j03140k55639l95864m25410m75669m75442n33396
1694.9I4881392o23000p06756r31752r03559r61363j175022j145607j013589q42429
1713.3H6578315o71941n18041k84803p6461N0485J61546L04270N09346P84772J295132
$$ plain form
1572.6 91412163 88800651 86665285 86668050 88521111 91127127 93508941 95143104 96051234 96394408
1590.9 96394408 96294534 95778978 94835514 93469304 91662586 89442635 87076241 85158199 84480917
1609.3 84480917 85471356 87690467 90714514 93970126 96081746 97276688 98167807 98708951 98973149
1627.6 98973149 99104649 99157566 99203837 99225110 99129230 98998117 98910421 98878938 98878539 98826265 98741764 98712796
1652.1 98712796 98638922 98476249 98361546 98313749 98287648 98217773 98133713 98083752 98026681 97934979 97841763
1674.5 97841763 97743183 97637451 97545952 97442812 97187173 96791309 96365899 95890230 95414788 94881392
1694.9 94881392 94258392 93551636 92619884 91716325 90754962 89579940 88434333 87420744 86578315
1713.3 86578315 85906374 85388333 85103530 85027069 85077554 85239100 85543370 86052716 86837488 88132620
1733.7H8132620J533472J252109J254904J213295J004791R17822Q87191Q56972P19917
1752I7773093N12046M10854L43758K31546J34725J3518j35821l19660n79482r22316
1772.4I7462261r24439m37659J87535P47495R45253Q16136N83118L65329K65557K25341
1792.8A00235927J53554J15907J23429J12164P7856M9746L8027M4144M6777L0411K6178
1815.3A01054120L3963K9075K1160K1123K0564J4675J7512J454k3818k6107k0862j3327
1839.8A01129532K420J5211r310l6574l5810l4428l5965l3164l7003n3692p5245r2351
1864.2A00703621j01197j25170j67656j78813j56516j21928q4322n3400k4200o240
1884.6I9684179j7399m8840r0158j25545j34140j12677p5048k5839M3017J21546J88434
$$ plain form
1733.7 88132620 89666092 90918201 92173105 93386400 94391191 95309013 96196204 97053176 97773093
1752 97773093 98285139 98695993 99039751 99271297 99406022 99419540 99283719 98964059 98384577 97462261
1772.4 97462261 96537822 96100163 96287698 97035193 97980446 98796582 99379700 99745029 100010586 100235927
1792.8 100235927 100389481 100505388 100628817 100740981 100818837 100868583 100906610 100950754 100997531 101027942 101054120
1815.3 101054120 101088083 101117158 101138318 101159441 101180005 101194680 101212192 101213646 101189828 101163721 101142859 101129532
1839.8 101129532 101131952 101147163 101137853 101101279 101065469 101031041 100995076 100961912 100924909 100871217 100795972 100703621
1864.2 100703621 100602424 100477254 100309598 100130785 99974269 99852341 99768019 99714619 99690419 99684179
1884.6 99684179 99666780 99617940 99527782 99402237 99268097 99155420 99080372 99054533 99097550 99219096 99407530
1907.1I9407530K34234K44504K27029K15542K14183J85216J45614J36959J24848J06442
1927.5A01242101R6441Q4292P7618P5197O3944N4371N0437K2543o056j681L195m506
1951.9A01757896p594j0168j6678j7595r215L565J7595K5380K3555K0814J6213J5151
1976.4A01818919J8418J4353O699M042M208M732P153P391K301m518j0634j4889j0324
2002.9A01847851q22j276j0335j7619j8764j7071j6617k1446k8134l2484l8636m4691
2027.4A01599956m6194m6277m6504m9698o5410q8585j09720j25074j34444j44852j53350
2049.8A00589848j61994j77884j89340j91260j96629k03729j97226j76579j51330j21295
2070.2I8822582q5569n2958k5851N764L4988M2826L6806L4469L8624M2891M2099L3176
$$ plain form
1907.1 99407530 99641764 99886268 100113297 100328839 100543022 100728238 100873852 101010811 101135659 101242101
1927.5 101242101 101338542 101422834 101500452 101575649 101639593 101693964 101744401 101766944 101760888 101759207 101762402 101757896
1951.9 101757896 101750302 101740134 101723456 101705861 101696646 101700211 101717806 101743186 101766741 101787555 101803768 101818919
1976.4 101818919 101837337 101851690 101858389 101862431 101866639 101871371 101878524 101885915 101888216 101883698 101873064 101858175 101847851
2002.9 101847851 101847029 101845753 101835418 101817799 101799035 101781964 101765347 101743901 101715767 101683283 101644647 101599956
2027.4 101599956 101553762 101507485 101460981 101411283 101345873 101257288 101147568 101022494 100888050 100743198 100589848
2049.8 100589848 100427854 100249970 100060630 99869370 99672741 99469012 99271786 99095207 98943877 98822582
2070.2 98822582 98737013 98684055 98658204 98663968 98698956 98741782 98778588 98813057 98851681 98894572 98936671 98969847
2094.7I8969847J4222o795k3705m2433p1609j01322j22189j48082j82140k22480k72429
2117.1I7790885l22688l67468m18902m77689n30613n77181o24109o64120o81186o82199
2137.5I2444730o74534o50626o13463n65380n06360m54199m19855l97491l87699l88521
2157.9H7386602l95626m04721m10569m09633m03476l95411l81607l69519l70836l82954
2178.3H3462250m04387m34661m73208n16045n46914n76180o19757o57523o71488o76924
2198.7G7885163o90127p01475p08526p19482p33715p46369p57522p75659q09306q55034
2219.1G0387948r05055r54849r94742j028227j056082j052939j009876r39119q36527
2237.5F1610532p02626n64772m47493l52949k70576k03752j62059j34212j11496j00232
$$ plain form
2094.7 98969847 98984069 98977274 98953569 98911136 98839527 98738205 98616016 98467934 98285794 98063314 97790885
2117.1 97790885 97468197 97100729 96681827 96204138 95673525 95096344 94472235 93808115 93126929 92444730
2137.5 92444730 91770196 91119570 90506107 89940727 89434367 88980168 88560313 88162822 87775123 87386602
2157.9 87386602 86990976 86586255 86175686 85766053 85362577 84967166 84585559 84216040 83845204 83462250
2178.3 83462250 83057863 82623202 82149994 81633949 81087035 80510855 79891098 79233575 78562087 77885163
2198.7 77885163 77195036 76493561 75785035 75065553 74331838 73585469 72827947 72052288 71242982 70387948
2219.1 70387948 69482893 68528044 67533302 66505075 65448993 64396054 63386178 62447059 61610532
2237.5 61610532 60907906 60343134 59895641 59542692 59272116 59068364 58906305 58772093 58660597 58560365
2257.9E8560365r2101p7212o7138o5929n9956m5544k9850k0689j5879j072J8268K9076
2282.3E8132339L8224N2464O3419O6269P5191J02752J44405J79028K05183K48325L12531
2304.8E9620130L79855M47171N23913O04850O56701O49845O24424O29419O50108O43719
2325.2F5430135N94478N50491N67853O05119N96606N65082N48852N82021O94943R01293
2345.6G1636873R11475N91534K64859J71614K84177M62216O57523Q36682R83817J110082
2366G7910852J208914J269471J291621J277721J247877J224184J191550J116193J003635
2384.3H8742018Q92716Q08663P48509O96534O46555O02031N58245N16969M82410M47798
2404.7I5142448M14276L90607L65848L30674K99269K80798K69538K51913K28280K09683
$$ plain form
2257.9 58560365 58468264 58391052 58323914 58257985 58198029 58152485 58122635 58101946 58086067 58084995 58103263 58132339
2282.3 58132339 58170563 58223027 58286446 58352715 58427906 58530658 58675063 58854091 59059274 59307599 59620130
2304.8 59620130 59999985 60447156 60971069 61575919 62232620 62882465 63506889 64136308 64786416 65430135
2325.2 65430135 66024613 66575104 67142957 67748076 68344682 68909764 69458616 70040637 70735580 71636873
2345.6 71636873 72548348 73139882 73404741 73576355 73860532 74322748 74980271 75816953 76800770 77910852
2366 77910852 79119766 80389237 81680858 82958579 84206456 85430640 86622190 87738383 88742018
2384.3 88742018 89634734 90443397 91191906 91888440 92534995 93137026 93695271 94212240 94694650 95142448
2404.7 95142448 95556724 95947331 96313179 96643853 96943122 97223920 97493458 97745371 97973651 98183334
2425.1I8183334J95914J87964J87224J79583J68192J68741J67221J55514J47635J42264
2445.5I9883586J33258J27793J21784J13857J16515J16753J01829Q9216Q7190Q5533
2465.9A00977314P6472P1204P1800O5028N7900N5969N1606M4644M2724M1819L6907
2488.3A01593387L7503M4179M6182L7467K5130K3520K9754K5905J4305J3160K0683
2510.8A01911175J8001N603P63J0085K4366K5797K1207K1816J5974P772R012J0360
2535.3A02081931N042p75l624p98K992N185N889n173j5104n865J418l171k837l69k170
2565.8A02062571r453k2590k8301k6202k7001k8229l2925m4418n5420o5267p1514o7997
2590.3A01583254m2617M709M7648O6280O3956O2370O2311M8911L2390K5367K5452K0551
$$ plain form
2425.1 98183334 98379248 98567212 98754436 98934019 99102211 99270952 99438173 99593687 99741322 99883586
2445.5 99883586 100016844 100144637 100266421 100380278 100496793 100613546 100715375 100804591 100891781 100977314
2465.9 100977314 101053786 101124990 101196790 101261818 101319718 101375687 101427293 101471937 101514661 101556480 101593387
2488.3 101593387 101630890 101675069 101721251 101758718 101783848 101807368 101837122 101863027 101877332 101890492 101911175
2510.8 101911175 101929176 101934779 101935542 101945627 101969993 101995790 102016997 102038813 102054787 102062559 102071571 102081931
2535.3 102081931 102086973 102086198 102082574 102081776 102084768 102089953 102095842 102090669 102075565 102069700 102071118 102067947 102065110 102064741 102062571
2565.8 102062571 102053118 102030528 102002227 101976025 101949024 101920795 101887870 101843452 101788032 101722765 101651251 101583254
2590.3 101583254 101540637 101545346 101592994 101659274 101723230 101785600 101847911 101896822 101929212 101954579 101980031 102000582
2614.8A02000582N949n72Q308J4568Q726K265L099N937O735K027p486r692M172J5426
2643.4A02060044K587j1659n889l46m518n412p427j4650j1802r585j5866j1575p654
2669.9A01956248r870m649o712j2779j276J3411J3554O676n72l362J002O31o842j1695
2698.4A01933765j6069j8084j8060k1136j5044l338k921o115J228O389k873j1456j2421
2724.9A01813865J979K5749K4855P665K515L732O389R489L255q810j4233n305Q988
2751.4A01880133J1993Q666J3363K2710J7583M792J2029K6643K1791P046Q130K4330
2775.9A02059209K7919J6856L744j1743k2840k5642j3089O199J073k0242k3735o258
2800.4A01991451N269r740l6370m8602m0293k2673k4498n4705q1706r9671j27768j52052
$$ plain form
2614.8 102000582 102006531 102005959 102014267 102028835 102037561 102039826 102042925 102048862 102055597 102057624 102050138 102040446 102044618 102060044
2643.4 102060044 102062631 102050972 102045083 102044737 102040219 102034807 102027380 102012730 102000928 101991343 101975477 101963902 101956248
2669.9 101956248 101946378 101941729 101935017 101922238 101920962 101934373 101947927 101954603 101954031 101950669 101951671 101952302 101945460 101933765
2698.4 101933765 101917696 101899612 101881552 101860416 101845372 101842034 101839113 101832998 101834226 101840615 101837742 101826286 101813865
2724.9 101813865 101815844 101841593 101866448 101874113 101876628 101880360 101886749 101896238 101899493 101890683 101876450 101871145 101880133
2751.4 101880133 101892126 101900792 101914155 101936865 101954448 101959240 101971269 101997912 102019703 102026749 102034879 102059209
2775.9 102059209 102087128 102103984 102107728 102095985 102073145 102047503 102034414 102040613 102041686 102021444 101997709 101991451
2800.4 101991451 101996720 101986980 101950610 101902008 101861715 101839042 101814544 101759839 101678133 101578462 101450694 101298642
2824.9A01298642j68562k01380k40588k60318k54881k22093j49047n3048J31l350j3673
2847.3I9731833n287N609P504R513K3120O8045J22786J43569J31882R8073L9470j8143
2871.8A00357974k1613L6k9815r0062j35398j68747j96993k34473k86811l31176l49539
2894.2I8513383l42453l15070k85965k68311k37190j89501j61219j51056j24437p1895
2914.6I6366286k0051J8847O4594J20669J80096K28417K58988K97409L21311K93595
2935I8130161K48849K14279J74647J38170J32745J51420J52486J23084J06680J10108
2955.4I9682629R5123O6424L7461J4114L726j0026l0356o2728j09941j51509j96284
2977.8I9338633k27803k05136j38628n8037n347k1851p1579j02150j35857j72168j90062
$$ plain form
2824.9 101298642 101130080 100928700 100688112 100427794 100172913 99950820 99801773 99748725 99748856 99745506 99731833
2847.3 99731833 99726546 99732155 99739659 99749172 99772292 99840337 99963123 100106692 100238574 100336647 100376117 100357974
2871.8 100357974 100336361 100336397 100306582 100216520 100081122 99912375 99715382 99480909 99194098 98862922 98513383
2894.2 98513383 98170930 97855860 97569895 97301584 97064394 96874893 96713674 96562618 96438181 96366286
2914.6 96366286 96346235 96365082 96429676 96550345 96730441 96958858 97217846 97515255 97836566 98130161
2935 98130161 98379010 98593289 98767936 98906106 99038851 99190271 99342757 99465841 99572521 99682629
2955.4 99682629 99777752 99844176 99881637 99895751 99899477 99889451 99859095 99796367 99686426 99534917 99338633
2977.8 99338633 99110830 98905694 98767066 98709029 98703682 98681831 98610252 98508102 98372245 98200077 98010015
3000.3I8010015j97297j60616q3733m7380n8067n9694n7763p9470j24890j77521j98251
3022.7I6765333j44171l4738O0767J13106J17284R2018L3837q6141j66696j01769M7332
3045.1I6696162J58316J91587K05881K19273J96642J64461J41049R6923N4025N8067
3065.5I8182386J33175K40534K80667K47132J98108J68980J95467K28787K13086J90222
3085.9A00278544J67013J38139J34719J30164Q9801M7028M4954O8879P2646N1427M1890
3108.4A01265204N2130M3500J1813K682K2150M5013N7399N0438L8922M2223N0486M5538
3132.8A01727498K3162K074J7905O5482R1422P7843M5765R084j359M1770Q5605P2407
3157.3A02258658L9125K0063J073p201J097L362k229q345r525q154j3292j4877n245
$$ plain form
3000.3 98010015 97812718 97652102 97568369 97520989 97462922 97403228 97345465 97265995 97141105 96963584 96765333
3022.7 96765333 96621162 96586424 96647191 96760297 96877581 96969599 97003436 96917295 96750599 96648830 96696162
3045.1 96696162 96854478 97046065 97251946 97471219 97667861 97832322 97973371 98070294 98124319 98182386
3065.5 98182386 98315561 98556095 98836762 99083894 99282002 99450982 99646449 99875236 100088322 100278544
3085.9 100278544 100445557 100583696 100718415 100848579 100938380 100985408 101030362 101099241 101171887 101223314 101265204
3108.4 101265204 101317334 101360834 101372647 101375329 101397479 101442492 101499891 101550329 101589251 101631474 101681960 101727498
3132.8 101727498 101750660 101752734 101770639 101836121 101927543 102005386 102051151 102060235 102058876 102100646 102186251 102258658
3157.3 102258658 102297783 102317846 102318919 102311718 102312815 102316177 102313948 102305603 102296078 102287924 102274632 102259755 102254510
3183.8A02254510Q070K2507M0281M5633L4952K7526K5725K6870K4927J6653J5378K5118
3208.3A02568150K9230J9955J4270J9025K1279K2543J6296j4305m4716m7040m2558
3230.7A02562129l6001J216L4213K3973K27j8203k8480j3828J9038K3770m41o711N602
3257.3A02566504O974k336k516q368k9075l3748p737K2209K3031Q154J538l958m971
3283.8A02535701J907l445k3854l4904k4295l123L719j4687l7837n3835n2559k1923
3308.2A02270865Q381O211j8335l2890l3629m7814o3658n3597l6943l9744n3346p3314
3332.7A01832187j00756j16682j06620p8273n4646n4490p7260q8143o9344n6017n6171
3355.2A00973785n6148o0451o2346p1073j06168j29628j06907q1777j04475j49298
$$ plain form
3183.8 102254510 102262580 102285087 102325368 102371001 102405953 102433479 102459204 102486074 102511001 102527654 102543032 102568150
3208.3 102568150 102597380 102617335 102631605 102650630 102671909 102694452 102710748 102696443 102651727 102604687 102562129
3230.7 102562129 102526128 102527344 102561557 102585530 102585757 102567554 102539074 102525246 102544284 102568054 102567613 102560902 102566504
3257.3 102566504 102573478 102571142 102568626 102560258 102531183 102497435 102489698 102511907 102534938 102543092 102544630 102540672 102535701
3283.8 102535701 102537608 102534163 102510309 102475405 102451110 102447987 102451706 102437019 102399182 102345347 102292788 102270865
3308.2 102270865 102279246 102285457 102267122 102234232 102200603 102152789 102089131 102035534 101998591 101958847 101905501 101832187
3332.7 101832187 101731431 101614749 101508129 101429856 101375210 101320720 101243460 101155317 101085973 101029956 100973785
3355.2 100973785 100917637 100857186 100794840 100723767 100617599 100487971 100381064 100299287 100194812 100045514
3375.5A00045514j67012j63704j56200j43635j23764j19793j29724q2826R209N2899
3395.9I9020964M0084N0211J13833J58030J46657J32894J35845J40697J60599J79970
3416.3A00279784J65343J38939J27792J15454Q8323P6353R1553Q1253N5909R7442J65510
3438.8A01483655J58334J05321P3433N8842N1987N0318M9031N2059L9601R322J3006
3461.2A02144909K9218m280k9337K1398Q6403P9155K0456j9657j7298J1182K6179J8727
3485.7A02367055J4210J4281J4639J0991k968m375J0550K3830L3558K9766K3532J5748
3510.2A02550817r835j5211J1420K8849J1551j8656j562M4239M4393J0026p058p462
3534.6A02641511r298p725j2887k1279q46L7992M2153K0027N936j1873j9991j7155
$$ plain form
3375.5 100045514 99878502 99714798 99558598 99414963 99291199 99171406 99041682 98958856 98968065 99020964
3395.9 99020964 99061048 99111259 99225092 99383122 99529779 99662673 99798518 99939215 100099814 100279784
3416.3 100279784 100445127 100584066 100711858 100827312 100915635 100991988 101083541 101164794 101220703 101318145 101483655
3438.8 101483655 101641989 101747310 101820743 101879585 101931572 101981890 102030921 102082980 102122581 102131903 102144909
3461.2 102144909 102174127 102169847 102140510 102161908 102248311 102327466 102347922 102328265 102310967 102322149 102348328 102367055
3485.7 102367055 102381265 102395546 102410185 102421176 102418208 102413833 102424383 102448213 102481771 102511537 102535069 102550817
3510.2 102550817 102540982 102525771 102537191 102566040 102577591 102558935 102557373 102601612 102646005 102656031 102648973 102641511
3534.6 102641511 102632213 102624488 102611601 102590322 102589476 102627468 102669621 102689648 102695584 102683711 102663720 102646565
3559.1A02646565k1171j2708J8037K7227l1293p5924n3501k0802k5642m7266n6422
3581.5A02347100m8423N72M2916j2839n2059j2136L124k5428k3174n281r537J1814
3606A02216649N8556M8375K146k3723m1628l4153l6025o9225o8069k1589M7267K3579
3630.5A02102160n3632n9616n6231o0976n3000m1616k1446J4794J6200q2600j53076
3652.9A01550961j22083j04594j43099j42336j17814j07932p2229k4975o2799j05083
3673.3A00548017n4967p7725j48320j34397r5808o5667k3901P331l3187p0638m5145
3695.8I9805593r173J1754L3212K7227R132N2291J35517J40202L3367j9646J0669M4299
3720.2A00274444O2525P9512Q7393P0000R0312J58430J67918J07789M7815K3961Q8966
$$ plain form
3559.1 102646565 102625394 102612686 102630723 102657950 102626657 102550733 102497232 102476430 102450788 102403522 102347100
3581.5 102347100 102298677 102299249 102342165 102329326 102277267 102265131 102268255 102242827 102219653 102214372 102204835 102216649
3606 102216649 102275205 102323580 102325726 102302003 102260375 102226222 102190197 102120972 102052903 102031314 102078581 102102160
3630.5 102102160 102048528 101988912 101932681 101871705 101818705 101777089 101755643 101770437 101786637 101704037 101550961
3652.9 101550961 101428878 101324284 101181185 101038849 100921035 100813103 100740874 100715899 100653100 100548017
3673.3 100548017 100493050 100415325 100267005 100132608 100036800 99971133 99947232 99954563 99921376 99850738 99805593
3695.8 99805593 99796420 99808174 99841386 99868613 99877745 99930036 100065553 100205755 100239122 100219476 100230145 100274444
3720.2 100274444 100336969 100416481 100503874 100573874 100664186 100822616 100990534 101098323 101146138 101170099 101259065
3742.7A01259065J77359R2554M3130J28746P8821l7419k4915L8719K7382j3101O581
3765.1A01776922K7990K6763J9407o390j1027J8061L7610Q345j4389m65k14j4985k5809
3791.6A01841819j3232L6466O2573O4814P0012n49j6224L0863r167m0185J4484Q6462
3816.1A02128136O5100O7878Q9693p963l9351N448L7563N3847M6718P3361J09768L2365
3840.6A02662563m3475l4774j3661J1623O4039J61588J17481p4851j07480l3426L6872
3863A02746499L8397J2135M9460M0520l4249l1305j0156K1446L9255J681Q655R429
3887.5A02891767n60L0148J5104j0026K8753O1167M4012K0146k0111n2654l4774k706
3912A02970266K0779M0650K9719R393J5557J6868J359K563K3437K4223r429l2485p426
$$ plain form
3742.7 101259065 101436424 101528978 101572108 101700854 101779675 101742256 101717341 101756060 101783442 101770341 101776922
3765.1 101776922 101804912 101831675 101851082 101844692 101833665 101851726 101889336 101897681 101883292 101882827 101882613 101867628 101841819
3791.6 101841819 101828587 101865053 101927626 101992440 102062452 102061903 102045679 102076542 102067375 102027190 102041674 102128136
3816.1 102128136 102193236 102261114 102350807 102342844 102303493 102308941 102346504 102400351 102447069 102520430 102630198 102662563
3840.6 102662563 102619088 102584314 102570653 102582276 102646315 102807903 102925384 102850533 102743053 102709627 102746499
3863 102746499 102784896 102797031 102846491 102887011 102852762 102821457 102811301 102832747 102872002 102873683 102882338 102891767
3887.5 102891767 102891207 102921355 102936459 102926433 102955186 103016353 103060365 103080511 103060400 103007746 102972972 102970266
3912 102970266 102991045 103031695 103061414 103070807 103086364 103103232 103104591 103107154 103130591 103154814 103145385 103112900 103105474
3938.5A03105474L0493K2483j5509j5962J0455J8632J4841K397r954l064P808L040
3962.9A03171134j1098k1804r095J5187R584m458m530l791O354J5187J0359Q977N865
3989.5A03187871j2791k0337l505L731
3997.6A03154969
$$ plain form
3938.5 103105474 103135967 103158450 103142941 103126979 103137434 103156066 103170907 103173304 103163350 103160286 103168094 103171134
3962.9 103171134 103160036 103138232 103129137 103144324 103153908 103149450 103144920 103141129 103147483 103162670 103173029 103182006 103187871
3989.5 103187871 103175080 103154743 103151238 103154969
3997.6 103154969
##END=$$ End of the data block
