##TITLE=DI 14_1838984-8 $$ Begin of the data block
##JCAMP-DX=5.00 $$ ACD/SpecManager v 10.08
##DATE=07 Oct 2014 10:19:14
##DATA TYPE=INFRARED SPECTRUM
##DATA CLASS=XYDATA
##ORIGIN=Marcelo Quint
##OWNER=
##NPOINTS=1765
##FIRSTX=399.76428223
##LASTX=3997.64306641
##MAXX=3997.64306641
##MINX=399.76428223
##MAXY=0.84955508
##MINY=0.02901223
##XFACTOR=1.0000000000
##YFACTOR=1.000000000000000e-9
##FIRSTY=0.75849754
##DELTAX=2.03961372
##XUNITS=1/CM
##YUNITS=ARBITRARY UNITS
##XYDATA=(X++(Y..Y))
399.8 758497536 757235110 755336344 753657937 752419353 750850022 747709811 743186831 738678992
416.1 738678992 734338820 730593622 728367329 726386964 724328518 723448753 723545551 723564386 723679662
434.4 723679662 724670112 726710856 729303122 732378781 736347556 740376472 743198156 745191813 747054577
452.8 747054577 748646677 749395549 748610437 746921420 745113492 743105173 740563154 737611175 734660804
471.2 734660804 731295943 727515817 723977745 720538139 716991663 713517904 709870338 705636561
487.5 705636561 700597346 694405377 686631143 677620351 669544041 665497601 667231202 673753202
503.8 673753202 682844281 693095267 702447236 709060371 713165522 716054857 718350947 720274746
520.1 720274746 722191691 724402189 727190375 730584383 734418333 738468230 742525637 746730208
536.4 746730208 751218855 755719841 759964168 763874471 767573178 771345258 775247335 778999329
552.7 778999329 782490313 785915911 789076984 791672170 793896973 795833349 797347963 798561037
569.1 798561037 799645305 800782800 801988304 802970946 803784251 804648936 805336595 805626631 805747986
587.4 805747986 805954099 806314945 806637943 806747496 806694925 806518435 806477785 806626201 806609392 806399465
607.8 806399465 806222081 805976748 805532038 804945350 804374814 804009855 803454340 802022457 799022079
626.2 799022079 791643798 779681206 773964584 781631768 792518616 797221422 797327101 796216786
642.5 796216786 795213640 794153869 791618466 785267293 774640441 766352057 768511057 778007627
658.8 778007627 785489202 787683070 785542190 778717995 770765960 766999185 762734771 756612539
675.1 756612539 751000166 748065591 749327064 753850222 758654594 761622131 762240052 760476649 756098568
693.5 756098568 747954369 733850241 712581754 686876416 661650360 639242172 619085431 600498617
709.8 600498617 582180381 558741868 519981503 452858478 348822385 224928066 124435313
724.1 124435313 74365929 65673023 78070708 103629403 146915257 219047457 327214509
738.3 327214509 457974911 579552352 667610049 720715821 750132740 766387403 775671661
752.6 775671661 781151831 784374952 786073506 786722183 786534905 785429537 783325911 780315936 776633203
771 776633203 772493839 767796218 761763155 753589690 743940651 734121442 722827375 706157327
787.3 706157327 682194710 656565428 643343568 652751565 675791383 693261564 698390365 697413087
803.6 697413087 695854723 694897652 694544911 694795668 695403576 695769012 695249379 693306386 689669251
822 689669251 684763491 679580033 674731076 669884264 664476097 658267796 651475549 644860983 639223218
840.3 639223218 634715438 631089747 628493428 627520382 628309131 630178988 632273674 633559346 632409394
858.7 632409394 626460195 612713516 588023424 550157309 500590265 450275451 417515606 412080437
875 412080437 428714693 456785232 487364799 514711261 536637843 553233504 565138459 572994828
891.3 572994828 577858567 581556618 586392999 594604135 607602477 625252426 645838082 666598737
907.6 666598737 684605062 697900951 706144929 710072815 710556328 708254993 703783393 697934389
923.9 697934389 691699624 686064959 681879640 679798782 680229425 683283091 688718855 695886970 703818083
942.3 703818083 711573839 718418002 723906934 727873683 730220854 730872929 729696274 726352930 720468402
960.7 720468402 711761177 700109839 686105549 671650946 659866810 653672099 653700590 657966077
977 657966077 663952827 670158803 675884008 680724382 684625983 688290119 692140758 695073605 695278823
995.3 695278823 690917134 681028545 669341087 660806060 650632918 626852810 579358637 498097718
1011.6 498097718 384962022 276746929 223280683 237650558 291195601 349550128 394916981
1025.9 394916981 421025157 428838909 425437123 416803211 405303508 392568022 381399989 375396669
1042.2 375396669 377649039 389834166 411887974 442093104 477405906 513719022 546175122
1056.5 546175122 570386708 583685935 585280895 575053394 552263737 515649080 465966314
1070.8 465966314 409099907 354611248 309185147 272381186 239605263 207282051 174719095
1085.1 174719095 143074006 114353396 90629861 72996624 61234113 54407787 51542331 51847462
1101.4 51847462 54973144 60801860 68635814 76169737 80359638 80014229 76571397 72593838 70261844
1119.8 70261844 70731141 73972411 79190902 85482992 92594668 101220384 112653010 128051743
1136.1 128051743 147817746 171935752 200738370 234719306 273594975 316079289 360333323
1150.3 360333323 404190600 444969893 479637146 505428433 520746112 526233375 524643719 518735409
1166.7 518735409 510262012 501984656 498686910 504750490 521438599 546539843 575414419 602485776
1183 602485776 623353899 636288524 641841888 641415417 636364818 627822399 616731465 603861392
1199.3 603861392 589608133 573750913 555563927 533943653 507370889 474014521 432319939
1213.6 432319939 382224321 326396167 270260155 219915614 179171547 148533553 126199096
1227.9 126199096 109407201 95444411 82440369 69993481 58931105 50271798 44315774 40649015
1244.2 40649015 38568269 37495360 36979184 36657050 36282241 35687339 34900568 34164704 33804398
1262.5 33804398 33891443 34359701 35172071 36343541 37758756 39227162 40710546 42276006 43996695
1280.9 43996695 45933142 48256285 51101685 54712318 59419658 65669216 73996224 84731691
1297.2 84731691 97384252 110494964 122927263 135351911 149980009 168550149 191896021
1311.5 191896021 220183700 252842426 290035099 332517266 379209369 426982939 470586926
1325.8 470586926 503374398 519377291 513917208 485992461 441749752 394354612 361504018
1340 361504018 358853877 390233994 446016490 507236421 557509542 591030300 609034598 613904238
1356.4 613904238 606945395 586395502 547613740 494947374 443080425 403507829 384229451
1370.6 384229451 386771113 407438397 437911361 470545202 500409007 522578418 535039365
1384.9 535039365 538170815 532782912 521035731 504032195 481538445 455013603 422822595 383286685
1401.2 383286685 333901405 273214698 219464913 199235499 230188027 309734821 410310239
1415.5 410310239 507666409 586843908 631206810 648886442 651176870 639859438 614389598
1429.8 614389598 578331888 540061295 502665997 473967910 461149275 457645148 457146078 456423819
1446.1 456423819 453507960 448766470 444967926 446165770 460122168 490071893 521172047 552220166
1462.4 552220166 588625968 621859848 642563581 657037199 673869908 691460729 705268979
1476.7 705268979 716193795 725705802 735151112 745811045 758449376 770970106 778494418 778666258
1493 778666258 770641267 748327076 705656707 647596836 593040287 572106421 617774010 682587802
1509.3 682587802 722551167 746165216 759152412 765505970 767795205 767955005 767533779 767896950
1525.6 767896950 769583046 772552907 776901484 782478511 787113547 790542603 793552935 794680297
1542 794680297 793988287 792597234 790991485 789069116 786967099 784911513 783051968 779796481 773675084
1560.3 773675084 768006027 762095332 754373074 742551684 723259985 699245453 669226348 635024071
1576.6 635024071 622163236 638303995 670587480 702010274 723418772 737271667 747749925
1590.9 747749925 755511284 759133458 757186532 749033749 734360158 713617444 689812601 667982101
1607.2 667982101 653738856 650398135 657056451 673909485 698960781 718185604 728446245 733898044
1623.5 733898044 735819221 735952795 735416114 734755993 734215498 733433008 732044816 730564535 729139030
1641.9 729139030 727751732 726035535 723700583 721603692 718900263 713618934 707634211 701327205
1658.2 701327205 693179786 681949854 668534815 655455172 640933514 623911977 607913911
1672.5 607913911 590775490 571116924 552655876 535862029 519841015 504488289 492396206
1686.8 492396206 480733007 465283960 445980906 418454349 381795764 337421358 279411763
1701.1 279411763 225078166 173899963 122176237 82736708 56714170 41061006 32856472
1715.3 32856472 29599864 29074887 29012227 29350560 30019170 31044057 32309782 34295198 38822621
1733.7 38822621 46144113 56333177 76643877 112957820 165511951 232871562 309655696 390376657
1750 390376657 462015301 514203548 555221379 590377033 618105233 641703665 660370648 674538612
1766.3 674538612 687097907 698227048 708595693 717293620 723972261 730164170 736468196 742289364
1782.6 742289364 747647703 752481282 756648898 760597229 764416277 767448246 769902945 772381842
1799 772381842 774743557 776741505 778384566 779893696 781197131 782220781 782908082 783400238 783926249
1817.3 783926249 784633517 785711825 787305474 789465129 791930676 794857800 798046291 801153541
1833.6 801153541 804415584 807873964 811259151 814554870 818067968 821386099 824172318 826718748
1850 826718748 829157174 831420422 833508074 835366666 836937308 838274121 839510202 840743899 841767073
1868.3 841767073 842383623 842752934 843121886 843419254 843564510 843562722 843445301 843230307 842928350 842508495
1888.7 842508495 841873169 841134131 840335965 839503407 838666558 837825537 836973667 836109161 835162103 834032714
1909.1 834032714 832732737 831363261 829998910 828435063 826633155 824772775 822775900 820611894
1925.4 820611894 818401039 816121399 813704431 811113417 808354974 805486917 802585542 799644828
1941.7 799644828 796750605 794348598 792705297 791825175 791701317 792295277 793441236 794965744 796885431
1960.1 796885431 799278378 802127898 805186331 808010340 810348332 812335014 814092040 815621138
1976.4 815621138 816963673 818164408 819271684 820377767 821624637 823082089 824718833 826417625
1992.7 826417625 828132391 829886734 831604183 833193660 834669828 836113691 837496281 838736713
2009 838736713 839867830 840959430 842022836 843015790 843894780 844705105 845453024 846123457 846771777
2027.4 846771777 847369373 847891450 848376095 848767042 849011064 849186003 849321604 849378347 849340558 849200845
2047.8 849200845 848959625 848640203 848260522 847773075 847180963 846533418 845835388 845080853 844278216 843458772
2068.2 843458772 842612207 841737211 840894699 840124130 839406610 838688433 837971687 837317288 836753070 836261868
2088.6 836261868 835781097 835267723 834757864 834299386 833934128 833648741 833362579 833070815 832854688 832747757
2109 832747757 832693040 832644641 832632899 832713068 832905650 833186448 833504856 833824098 834143877 834434271 834680974
2131.4 834680974 834927976 835202992 835474014 835764825 836112201 836460412 836829424 837299228 837895036 838557661
2151.8 838557661 839220583 839929998 840730250 841549933 842337251 843103826 843849421 844595909 845309258 845922291
2172.2 845922291 846449852 846933305 847398162 847856045 848243177 848531783 848775268 848971367 849138677 849314034
2192.6 849314034 849472284 849555075 849502504 849265456 848850250 848333836 847824514 847437918 847238958 847179651
2213 847179651 847151637 847120762 847088456 847009003 846831441 846572399 846305668 846076548 845847070 845599771 845403671
2235.4 845403671 845246613 845068097 844868839 844658792 844441772 844205737 843942046 843707979 843545973 843429148
2255.8 843429148 843387246 843450665 843525469 843554676 843577683 843546689 843364775 842984974 842417717 841725886 840993702
2278.3 840993702 840289772 839657009 839192152 839017570 839206278 839740396 840488970 841289937 842040777 842660308
2298.7 842660308 843075871 843222082 842988908 842378318 841579974 840711713 839737535 838577509 836976647
2317 836976647 834813058 832569540 830861747 829717159 828689933 827636778 826865017 826399028 825854599
2335.4 825854599 825086713 824285090 823828042 824294567 826226711 828329980 828145981 824955463 820145905
2353.7 820145905 815673649 812315106 810232937 809422731 809771359 811085105 812996745 815204144 817585766
2372.1 817585766 820022166 822399557 824653804 826750159 828529775 829801500 830553651 830964684 831255913
2390.4 831255913 831587672 831994176 832397938 832849085 833453417 834143341 834817350 835492253 836209118 836934388
2410.8 836934388 837623179 838309705 839051545 839813352 840551436 841306269 842088521 842831731 843512595 844153523
2431.2 844153523 844739795 845264792 845747769 846196890 846604466 846957684 847238481 847415268 847474456 847501218
2451.6 847501218 847561777 847592771 847573161 847550690 847530782 847461104 847291112 847033441 846739054 846420586 846061289
2474.1 846061289 845660150 845224142 844781160 844350576 843888819 843366981 842809081 842219293 841611505 841003776
2494.5 841003776 840402484 839836776 839327693 838856757 838397503 838001192 837704003 837417006 837066472 836670995
2514.9 836670995 836266220 835889935 835566759 835297287 835080802 834907830 834770143 834666014 834623992 834654272
2535.3 834654272 834700048 834706247 834696710 834745109 834853530 834959924 835013330 835057557 835142195 835216284 835282087
2557.7 835282087 835379064 835494757 835631847 835799277 835957229 836075842 836177647 836250901 836260140 836248159
2578.1 836248159 836305380 836485684 836802661 837232709 837750375 838338673 838951528 839535534 840022802 840349913
2598.5 840349913 840535283 840647876 840724826 840797365 840938389 841165960 841392815 841591895 841749966 841751635
2618.9 841751635 841567934 841285825 840975583 840719402 840704143 841093838 841837525 842757821 843679726 844473183
2639.3 844473183 845113456 845589757 845910072 846178889 846431494 846660495 846897006 847110033 847263217 847361207
2659.7 847361207 847447753 847571731 847668827 847675562 847655475 847659767 847684026 847693145 847656488 847631156 847689092 847799361
2684.1 847799361 847872913 847880423 847882092 847863197 847728848 847516477 847286046 847019076 846715689 846384585 845990241
2706.6 845990241 845509470 845042765 844664335 844324648 843972623 843561172 843015969 842349768 841678560 841104746
2727 841104746 840585947 839990497 839362025 838808060 838325500 837842643 837283194 836691737 836099744 835462034
2747.4 835462034 834862888 834395409 834005594 833695114 833533764 833507895 833570063 833670557 833776057 833870709
2767.8 833870709 833883882 833730280 833465397 833209932 832917094 832488120 831935704 831313550 830624521 829899013
2788.2 829899013 829247415 828686237 828093767 827385664 826652229 825972140 825310349 824745595 824393809 824258864
2808.6 824258864 824303269 824365377 824273884 823996007 823459029 822635353 821603656 820451260 819297731 818211496
2828.9 818211496 817178011 816162109 815071404 813802838 812373817 810744882 808698833 806069374
2845.3 806069374 802949369 799581468 796079099 792496443 788999736 785734594 782707036 779877365
2861.6 779877365 777127683 774292588 771347880 768289328 765048146 761664093 758159518 754337668
2877.9 754337668 750084281 745596886 741271794 737658143 735384762 734863758 735989928 738278270
2894.2 738278270 741187215 744091451 746336281 747718751 748726845 750189126 752701998 756346941
2910.5 756346941 760726690 765210629 769259989 772518873 774821758 776149094 776476443 775631309 773425162
2928.9 773425162 769781411 764394939 756658912 746010363 732112110 714998066 695200384 673758447
2945.2 673758447 652064860 631399095 612739265 596957207 584740698 576521814 572577953 572865784
2961.5 572865784 576908171 584001184 593392372 604409158 616435826 628820062 640957773 652394414
2977.8 652394414 662941754 672604203 681455851 689637959 697221339 704198360 710591018 716422558
2994.2 716422558 721731186 726663172 731426895 736194551 741098225 746110857 751081049 756046951
3010.5 756046951 761211038 766686380 772360444 777905822 783018351 787509918 791352868 794687092
3026.8 794687092 797509015 799671173 801158130 802028060 802210927 801501215 799676418 796479285 791498482
3045.1 791498482 784612119 776736736 769819856 765784919 765177727 766775787 768467665 768682361 767225504
3063.5 767225504 764946997 762863576 761536181 760952890 760717928 760405898 760039508 760217249 761696994
3081.9 761696994 764826655 769286335 774295270 778932631 782378018 784098804 784031868 782729328 781263411
3100.2 781263411 780749977 781782568 784321487 787912309 791997731 796107233 799794316 802699924
3116.5 802699924 804693580 805808902 806170762 806130946 806247115 806982875 808453023 810438931 812545419
3134.9 812545419 814422786 815985322 817313910 818439722 819367051 820124626 820707619 821169853 821671307
3153.2 821671307 822262943 822818935 823263347 823627710 823931456 824182034 824341893 824416101 824521780 824718237
3173.6 824718237 824937880 825111210 825245738 825331807 825312018 825184941 825031340 824901879 824823916 824863970
3194 824863970 825052857 825365543 825735927 826074183 826345146 826569259 826729655 826781034 826738417 826645613
3214.4 826645613 826504171 826302350 826066375 825871289 825734913 825609207 825498462 825405359 825386822 825529754
3234.8 825529754 825729132 825864613 826002359 826175630 826310813 826404572 826532423 826720297 826906323 827035189
3255.2 827035189 827090025 827085674 827073693 827090681 827152073 827189684 827160418 827151597 827162206 827117145 827041984 826988697
3279.7 826988697 826920629 826760828 826496005 826165140 825811863 825484395 825186431 824968457 824941993 824986994
3300.1 824986994 825022459 825214922 825515509 825806677 826106846 826282263 826266944 826230824 826172650 825924277
3320.5 825924277 825498164 824986935 824423671 823870540 823401213 823060215 822896123 822953522 823270321 823859036
3340.9 823859036 824622750 825429142 826207757 826919436 827627480 828395784 829117239 829686046 830093980 830367804
3361.3 830367804 830517828 830499768 830384731 830394089 830573738 830698133 830605388 830402374 830227256 830032587
3381.7 830032587 829721093 829261601 828610480 827761054 826862574 826033354 825065792 823605120 821739197
3400 821739197 819930494 818139613 815809369 812726796 809161961 805422306 801577747 797508359 793132365
3418.4 793132365 788633108 784342587 780393958 776847601 774049878 772581398 772591949 773726642 775861919
3436.7 775861919 778869927 782284439 785760522 789168119 792567372 795951128 799078763 801887989
3453.1 801887989 804396152 806533754 808411777 810210288 811758161 812770724 813425899 814195216 815173090
3471.4 815173090 816020310 816531241 816746235 816814542 816865087 816801846 816573262 816279948 815878749 815305829
3491.8 815305829 814638555 813960671 813325822 812655628 811852038 811001718 810152173 809218049 808150232
3510.2 808150232 806965232 805765271 804623306 803460479 802232981 800953031 799623430 798264980
3526.5 798264980 796870768 795430839 793982804 792602837 791272581 789960682 788817883 787991285
3542.8 787991285 787388384 786847770 786386013 786149859 786290646 786740363 787353098 788158894 789228499
3561.1 789228499 790573537 792177081 793891966 795380592 796700418 798087180 799420178 800605834
3577.5 800605834 801713169 802639425 803330481 803943694 804319322 804050267 803419173 802854657 802265406
3595.8 802265406 801439762 800406933 799294710 798245966 797291338 796325684 795308232 794219792 793029726
3614.2 793029726 791862488 790778756 789713860 788759708 788131654 787980676 788272381 788612664 788892031
3632.5 788892031 789482474 790463388 791722238 793206453 794850111 796684742 798958480 801723123 804165721
3650.9 804165721 805914760 807736039 809987962 812177062 814266443 816444635 818622589 820899427
3667.2 820899427 823416412 825714231 827568591 829401255 830718100 831394970 832101047 833136976 834602892
3685.6 834602892 836574376 838614881 840025067 841000974 841888368 842754364 843607306 844343066 844866753
3703.9 844866753 845413506 846202970 847098470 847653449 847723305 847607553 847501040 847427845 847219765 846863389
3724.3 846863389 846518099 846353769 846527398 846989214 847407401 847467721 847379923 847557902 848003209 848191082
3744.7 848191082 847986042 847858787 847619832 847020745 846530139 846366167 846305490 846234739 846341312 846631944
3765.1 846631944 846971929 847279251 847441971 847534955 847706020 847965062 848101616 848013997 847929239 847880125
3785.5 847880125 847816527 847780645 847754300 847704887 847647667 847658694 847678185 847432315 847143769 847164690 847202182
3807.9 847202182 847101569 847168982 847556710 848002553 848220706 848215580 848033905 847917438 847919881 847952485 848022401
3830.4 848022401 848119974 848227382 848274052 848175228 847953439 847724855 847580671 847502053 847574472 847956717
3850.8 847956717 848306715 848075569 847739995 847659647 847766280 847919583 847975671 847960711 847872853 847644925
3871.2 847644925 847411811 847240686 847212553 847382545 847537935 847604394 847499669 847188413 847041786 847010016
3891.6 847010016 846853018 846800804 846938908 847054899 847026050 846841693 846524715 846196353 845932662 845774055
3912 845774055 845800281 845928013 845918298 845771253 845691681 845704913 845712125 845712125 845744193 845765591 845723093 845635414 845588207
3938.5 845588207 845631719 845651567 845624268 845648110 845615745 845431030 845185697 844967127 844828308 844775140 844711185
3960.9 844711185 844529450 844244301 843967378 843700469 843372464 843060136 842833698 842648029 842429996 842177212
3981.3 842177212 841996253 841932297 841863573 841702402 841552734 841482818 841437221 841403246
3997.6 841403246
##END=$$ End of the data block
