##TITLE=DI 14-1390708-5 Instantgum BB $$ Begin of the data block
##JCAMP-DX=5.00 $$ ACD/SpecManager v 10.08
##SPECTROMETER/DATA SYSTEM=Alpha
##DATE=04 Aug 2014 09:48:02
##DATA TYPE=INFRARED SPECTRUM
##DATA CLASS=XYDATA
##ORIGIN=
##OWNER=
##NPOINTS=1765
##FIRSTX=399.75695801
##LASTX=3997.56933594
##MAXX=3997.56933594
##MINX=399.75695801
##MAXY=0.73679584
##MINY=0.31993720
##XFACTOR=1.0000000000
##YFACTOR=1.000000000000000e-9
##FIRSTY=0.57956111
##DELTAX=2.03957629
##XUNITS=1/CM
##YUNITS=ARBITRARY UNITS
##XYDATA=(X++(Y..Y))
399.8 579561114 579208493 579045415 578067541 576793432 576218009 576148033 575855553 575100243 573968947 573099792
420.2 573099792 572507322 571535349 570669532 570413530 570140600 569214344 567970634 567305982 567352831 567036152
440.5 567036152 565891027 565043509 564998209 564726055 563802600 563322842 563866794 564197719 563540578 563076913
460.9 563076913 563536108 563993633 563430190 562510908 562605977 563330710 563077271 562113166 562134683 563129902
481.3 563129902 563372195 562574446 562284589 562909126 563006461 561818898 560663939 560550034 560411274 559120536
501.7 559120536 557581961 557038963 556884289 555893719 554352283 553582549 553500175 552654147 550970793
520.1 550970793 549855649 549616754 548995733 547470212 546280086 546127498 546081722 545198619 544052958
538.4 544052958 543746769 544024408 543774009 543034077 542828441 543358386 543818831 543770015 543901384 544736326
558.8 544736326 545533419 545643032 545637369 546136081 546686232 546644211 546380639 546652734 547238529 547275126
579.2 547275126 546800971 546684206 547071099 547176421 546549261 545748532 545412898 545208216 544592559 543819547
599.6 543819547 543490231 543493927 543228745 542623699 542163730 542171717 542417645 542556524 542972863 544261098
620 544261098 546118438 547876835 549472213 551330268 553474963 555427790 556973577 558580160 560558736
638.4 560558736 562418520 563679755 564658582 565956533 567472756 568618417 569354415 570289493 571620882
656.7 571620882 572782159 573498726 574278295 575140417 575526476 576282918 578196824 580296099 582284153
675.1 582284153 583955824 585269868 586708009 588408589 589727879 590291798 590610981 591130614 591480911
693.5 591480911 591198087 590493321 589939773 589631975 589153945 588411450 587948084 588119090 588578641 589055300
713.8 589055300 589972973 591816485 594534576 597767174 601330221 605306089 609437287 613021672 615777731
732.2 615777731 618108273 620274961 621996462 623031139 623649001 624301493 624945521 625186503 624934077
750.6 624934077 624509275 624058247 623235464 621785462 619993329 618143737 616080046 613730609 611563861
768.9 611563861 610271096 610090375 610760689 612098038 614246905 617232263 620559335 623685658 626667678
787.3 626667678 629880071 633233011 636196256 638522089 640411377 641812205 642302334 641896486 641345263
805.6 641345263 641438901 642337501 643881559 646213531 649719954 654197991 658688426 662405252 665147960
824 665147960 666742563 666567087 664215684 660369039 656312227 652890444 650524139 649812162 651330352
842.3 651330352 654756784 658771276 662163198 664681494 666483998 667306542 666853547 665550530 664086998
860.7 664086998 662431717 660056770 656950235 653705657 650586605 647190630 643352509 639676690
877 639676690 636723936 634292543 632034183 630215824 629231095 628728628 627866924 626337111 624589264
895.4 624589264 622994602 621329010 619383514 617594182 616512179 616028845 615734935 615688503 616127551
913.7 616127551 616628766 616304755 614766538 612288177 609111905 605086803 600160241 594763398 589289844
932.1 589289844 583609879 577390075 570703387 563996732 557453394 550913692 544441819 538373828
948.4 538373828 532720149 527040362 521020472 514805317 508671522 502643108 496661842 490958691
964.7 490958691 485891551 481483340 477421582 473464459 469651252 466058373 462560743 459029734
981 459029734 455548882 452271283 449164122 446067899 442968249 439988106 437151641 434322804 431418717
999.4 431418717 428525895 425745189 423038602 420319200 417662829 415269256 413236350 411507636
1015.7 411507636 410028517 408794552 407797366 406941563 406073928 405189902 404420584 403802037 403235823
1034.1 403235823 402632117 401968747 401277632 400553644 399762630 398929447 398117304 397355199 396611452 395872951
1054.5 395872951 395212114 394735277 394430280 394220114 394102484 394106418 394259632 394580185 395058304 395759791
1074.8 395759791 396813691 398240238 399982989 402010739 404339045 406952143 409756839 412691444
1091.2 412691444 415800124 419134527 422638297 426162779 429577857 432835579 435845852 438400805
1107.5 438400805 440383464 441948593 443275958 444392741 445347041 446295351 447400957 448668599 449946046
1125.8 449946046 451119512 452220440 453168124 453646570 453493476 452937216 452323109 451828599 451550215
1144.2 451550215 451674461 452427387 453849316 455754906 458006978 460688680 463876575 467431545 471172780
1162.6 471172780 475121856 479426801 484070033 488882214 493860245 499196827 504969299 511078179
1178.9 511078179 517454982 524151623 531181812 538300574 545114219 551412880 557178319 562287807
1195.2 562287807 566489458 569716752 572192788 574106812 575447798 576234460 576691628 577048957 577281535
1213.5 577281535 577263355 577048838 576849163 576734900 576535285 576172352 575804591 575504363 575089097 574427843
1233.9 574427843 573698223 573134422 572719753 572290301 571826696 571520090 571451068 571431279 571325779 571281850
1254.3 571281850 571479082 571868420 572358251 573065579 574175894 575605333 577018023 578231096 579342306
1272.7 579342306 580378950 581126034 581441104 581486404 581462085 581286132 580777228 580003262 579197705 578427196
1293.1 578427196 577613175 576820433 576266348 575997531 575794399 575480580 575136065 574908674 574722826 574440658
1313.5 574440658 574153483 574031234 574065745 574063599 573892117 573614597 573278308 572755516 571945310 570957184
1333.9 570957184 569941938 568872154 567758262 566871524 566336751 566017091 565754771 565493643 565270722
1352.2 565270722 565036416 564614236 563887954 562864780 561629057 560380101 559116125 557760835 556575656
1370.6 556575656 555650711 554897904 554460645 554338276 554308534 554318130 554601133 555274308 555992186 556312442
1391 556312442 555977702 555019021 553863108 552600503 551200211 549613714 547765613 545960546 544222176
1409.3 544222176 542411804 540763676 539436817 538147748 536834896 536074817 535873294 535978973 536299050
1427.7 536299050 536802471 537686229 538900137 540267169 541854858 543600976 545416772 547093451 548456788
1446 548456788 549638271 550902426 552210808 553420126 554709256 556663394 559110105 561610103 564405620
1464.4 564405620 567694843 571198046 574877739 579235494 584125817 589065552 593912065 598627806
1480.7 598627806 603267610 607737660 612141371 616625369 621107161 625099897 628744245 632393360
1497 632393360 635798275 638786435 641360581 643611670 645931363 648375869 650674880 652748823 654483974
1515.4 654483974 656050801 657547414 659063399 660561144 661811233 662891388 663938046 664709210
1531.7 664709210 665005803 665233076 665293038 664651990 663791001 663242042 662669241 661894977 660684049 659105062
1552.1 659105062 657346368 655484855 652510107 648815691 646684706 644506335 641542017 637560904
1568.4 637560904 632502735 627871275 622714281 615165472 607633591 600859642 593407810 585401952
1584.7 585401952 577180803 568954408 561021209 553564429 546498954 539965153 534191012 529124498
1601.1 529124498 524668276 520840228 517615438 514982104 512997270 511491597 510017514 508793235
1617.4 508793235 508670330 509100437 509557009 510139704 510859370 511750162 512984574 514695346 517283738
1635.7 517283738 520481884 523554146 526584864 529680252 533304155 537533343 541212618 545046091
1652 545046091 550363779 555084169 559038222 563003421 567283034 571738064 575732410 579634190 583963394
1670.4 583963394 588170350 592355251 596703112 600693047 604343951 608002424 612326562 616548836
1686.7 616548836 620195866 623765469 626955271 629793823 632494807 635041296 637694716 640064240
1703 640064240 641895950 643509328 644960284 646108985 646893859 647362471 647804677 648682833 649845302
1721.4 649845302 650974154 652206838 653597295 655058563 656466365 657968819 659971595 662051201
1737.7 662051201 664002836 666055560 668296039 670594633 672867894 675275922 677988946 680676162
1754 680676162 683136642 685412586 687472165 689488232 691479862 693195403 694592953 695843697 697136998
1772.4 697136998 698588669 700003147 701246500 702408373 703533113 704561293 705551863 706526101 707344592
1790.7 707344592 708127081 709061146 710020959 710864544 711641848 712458611 713292897 714103281 714833379 715464711
1811.1 715464711 716081321 716738522 717390239 718004167 718529522 718938291 719377339 719885886 720289886 720738590
1831.5 720738590 721353471 721904874 722327709 722708285 723020971 723224819 723535717 723995209 724449277 724903762
1851.9 724903762 725314379 725627065 725900114 726244390 726649761 726995051 727170765 727259040 727570891 728080690
1872.3 728080690 728471816 728712916 728979588 729273260 729500115 729676306 729869902 730055451 730249643 730457842
1892.7 730457842 730616927 730816007 731063664 731240213 731349170 731490612 731657743 731767774 731849253 731994390
1913.1 731994390 732174039 732254386 732277870 732345343 732452691 732604146 732712448 732718468 732731760 732827246 732907712
1935.5 732907712 732893944 732838750 732796311 732798100 732826948 732823312 732830048 732883096 732885003 732796788 732740939 732777953
1960 732777953 732800722 732715786 732562900 732501209 732545555 732523859 732415974 732348502 732343912 732308388 732230484 732178926
1984.5 732178926 732152939 732075393 731905460 731758535 731763959 731810033 731739819 731600285 731495142 731427968 731330276
2006.9 731330276 731157184 730969131 730848312 730732024 730539262 730331481 730172336 730041444 729881883 729686260
2027.3 729686260 729521036 729411542 729277492 729077518 728887379 728764892 728654087 728485942 728293717 728146911
2047.7 728146911 728058040 727976382 727872849 727771640 727697968 727636039 727561295 727495790 727468312 727459908 727438033
2070.2 727438033 727412462 727410614 727431238 727440000 727424860 727414608 727437317 727479160 727503240 727516294 727521002 727507770
2094.6 727507770 727500439 727498531 727475107 727453113 727457523 727460682 727440178 727412939 727402985 727403164 727394104 727360129 727324009
2121.1 727324009 727326453 727340579 727312863 727275968 727280796 727294862 727289617 727286637 727315724 727366626 727394521 727402806
2145.6 727402806 727454543 727559745 727649570 727695048 727749407 727860451 727991164 728094578 728182554 728306949
2166 728306949 728492618 728674710 728792846 728903234 729087114 729305089 729474902 729617059 729803503 730031669
2186.4 730031669 730223238 730337918 730458021 730665505 730893135 731043637 731158197 731326342 731511712 731654346
2206.8 731654346 731804907 732015014 732239425 732400358 732506037 732646763 732862592 733074069 733217776 733350992
2227.2 733350992 733544111 733765066 733923614 734024107 734174848 734396458 734566212 734637797 734728396 734913647
2247.6 734913647 735093176 735167086 735212982 735342503 735524118 735643208 735678911 735730231 735852003 735963225
2268 735963225 736001909 736053526 736197948 736351192 736417115 736472964 736622393 736786962 736795843 736653388 736543655
2290.4 736543655 736536086 736501813 736364603 736210167 736107469 735987127 735725760 735348701 735017121 734753072
2310.8 734753072 734435499 734045148 733604908 733080268 732486367 731921673 731500149 731176019 730807304 730418026
2331.2 730418026 730111778 729861081 729589939 729248524 728934407 728986621 729746640 730778098 731050432 730148315
2351.6 730148315 728612661 727290630 726369739 725812435 725763977 726160467 726748586 727460921 728369415
2370 728369415 729410350 730403066 731276989 732129097 733030021 733807683 734241784 734374762 734399915 734382987
2390.4 734382987 734266758 734045386 733822167 733668149 733503401 733246386 732977092 732799709 732646763 732386410
2410.8 732386410 732052565 731801212 731627285 731362522 730998933 730685711 730456531 730202436 729853392 729465783
2431.2 729465783 729131103 728842437 728513539 728140712 727797210 727485597 727138638 726737857 726347446 725999117
2451.5 725999117 725643694 725250244 724846780 724466681 724090517 723688066 723276317 722893119 722540021 722157359
2471.9 722157359 721717238 721268058 720858634 720468521 720054626 719640076 719263792 718902886 718499660 718062520
2492.3 718062520 717662692 717310607 716938615 716521859 716105580 715714753 715322435 714925230 714567900 714236259
2512.7 714236259 713877261 713490427 713105440 712721527 712313175 711906850 711545825 711213648 710874259 710527778
2533.1 710527778 710175395 709802926 709425986 709058225 708697975 708372235 708062351 707700253 707314670 706971467
2553.5 706971467 706646979 706307411 705950201 705586851 705238104 704890907 704513371 704123437 703758478 703392625
2573.9 703392625 702975988 702531993 702126145 701749027 701320827 700833380 700352907 699899673 699437439 698942542
2594.3 698942542 698437035 697943985 697440565 696888089 696298003 695728719 695173085 694563746 693926990 693312407
2614.7 693312407 692690432 692031860 691336751 690638363 689969182 689285278 688518107 687717617 686985373 686277926
2635.1 686277926 685494304 684653044 683824778 683016062 682184219 681308746 680436552 679619133 678810656 677941620
2655.5 677941620 677058280 676247120 675473809 674659491 673834324 673072278 672348857 671594977 670818269 670081377
2675.9 670081377 669405401 668731391 668009937 667284071 666616857 665982485 665334880 664688289 664080501 663511813
2696.3 663511813 662916303 662271142 661649466 661081374 660513341 659912229 659313679 658759177 658228815 657676101
2716.7 657676101 657096982 656531692 655995786 655435324 654823124 654227972 653711915 653233767 652726471 652208507
2737.1 652208507 651727498 651262045 650763452 650232136 649703741 649189115 648658156 648083866 647482514 646883965
2757.5 646883965 646266222 645602345 644914687 644245625 643595099 642906129 642156363 641379356 640600145 639803708
2777.9 639803708 638958752 638080537 637226105 636369109 635435879 634456158 633479416 632480025 631428599
2796.2 631428599 630331993 629195571 628041923 626880169 625666022 624400079 623103797 621748984
2812.5 621748984 620314479 618818820 617289722 615729272 614100575 612363994 610523105 608614981
2828.9 608614981 606665075 604670703 602653682 600655556 598680615 596703827 594696939 592640758
2845.2 592640758 590541899 588437498 586374760 584344745 582286119 580183566 578034341 575804949
2861.5 575804949 573487401 571112990 568724275 566360593 564088345 561962843 559974909 558128953
2877.8 558128953 556450129 554919183 553523540 552248478 551038623 549877644 548804522 547828019
2894.1 547828019 546898305 545967400 545043290 544138789 543202579 542189121 541130066 540050328 538916230
2912.5 538916230 537713289 536509514 535408676 534481764 533759475 533251822 532978892 532933950 533066511
2930.8 533066511 533388495 533981323 534909010 536193669 537811458 539723814 541908383 544314206 546891630
2949.2 546891630 549625933 552465737 555364430 558314562 561274230 564165533 566939950 569600701
2965.5 569600701 572139323 574514747 576738954 578873277 580944002 582920671 584740460 586386383
2981.8 586386383 587916911 589371681 590745747 592042923 593220353 594182193 594916761 595456004 595841885
3000.2 595841885 596130431 596272409 596233428 596099615 595887899 595512211 594934881 594198406 593366861 592464507
3020.6 592464507 591480494 590411127 589289248 588175535 587064564 585917592 584684014 583362877
3036.9 583362877 582075953 580819070 579467595 578024030 576560497 575114965 573659837 572153807
3053.2 572153807 570633888 569099665 567503989 565904379 564390957 562949955 561434031 559762716
3069.5 559762716 558077097 556511819 555052340 553586006 551995516 550335467 548702300 547048509
3085.8 547048509 545374334 543736577 542089701 540389955 538705766 537108362 535532176 533875167
3102.2 533875167 532184660 530592859 529068828 527473986 525872231 524366856 522872269 521295190
3118.5 521295190 519573629 517734766 515964806 514346957 512781739 511178374 509548068 507973671
3134.8 507973671 506473958 504946291 503297210 501598179 499959379 498381257 496865094 495383829
3151.1 495383829 493839264 492197692 490529239 488897830 487330794 485816061 484287858 482718468
3167.4 482718468 481147766 479602367 478051007 476498544 474971592 473453492 471944124 470433444
3183.7 470433444 468904883 467403352 465935826 464427441 462863296 461302847 459788442 458310515
3200.1 458310515 456848711 455413818 453985125 452530503 451100111 449710906 448309153 446914792
3216.4 446914792 445534438 444144160 442772031 441407442 440028191 438689649 437436819 436210066
3232.7 436210066 434924603 433604658 432323098 431089520 429895312 428733170 427582651 426433712
3249 426433712 425318271 424274355 423263222 422234565 421211392 420222938 419279665 418390602 417534053
3267.4 417534053 416678697 415777415 414822102 413863778 412910402 411975592 411057115 410103649 409131438 408207238
3287.8 408207238 407332063 406415522 405412078 404350042 403229594 402105570 401080191 400138080 399114251
3306.1 399114251 397873789 396477908 395077705 393767923 392503142 391168386 389765352 388383985
3322.4 388383985 387015402 385531217 383938044 382353157 380787402 379266560 377791971 376219243
3338.8 376219243 374507636 372768044 371030867 369312942 367653340 365925848 364022821 362066299
3355.1 362066299 360191703 358375072 356545448 354729682 353022128 351381868 349621564 347688258
3371.4 347688258 345765769 344011784 342399180 340874135 339398533 337948918 336585134 335429877
3387.7 335429877 334476411 333458424 332225055 331013024 330082208 329318732 328366250 327194333 326137990
3406.1 326137990 325298637 324546844 323822439 323098183 322393268 321773648 321215421 320708513 320357114 320181280
3426.5 320181280 320099682 320021242 320002973 320116907 320170283 320036113 319937199 320092052 320442975 320829093
3446.8 320829093 321209282 321683556 322265744 322893709 323597074 324399322 325168490 325934082 326929420 328054577
3467.2 328054577 328943878 329527080 330152661 331055015 332157850 333222687 334066600 334892958 335933894
3485.6 335933894 337020874 338030398 339106917 340285808 341498226 342706889 343948334 345196903
3501.9 345196903 346327066 347390890 348546654 349864334 351339549 352822721 354202092 355578274
3518.2 355578274 357057631 358684391 360328019 361845076 363330334 364965290 366799146 368735492
3534.5 368735492 370611101 372416317 374363273 376463354 378523797 380450010 382414579 384528935
3550.9 384528935 386709690 388931930 391256273 393709570 396186411 398551464 400833488 403373718
3567.2 403373718 406298012 409264654 412143886 415082932 418145955 421327561 424624711 427924722
3583.5 427924722 431097418 434240699 437650949 441191435 444681466 448240340 451948941 455686957
3599.8 455686957 459406406 463096827 466650426 470220923 473953724 477734327 481528908 485251367
3616.1 485251367 488902152 492736936 496579021 500142336 503418088 506705105 510466456 514315963
3632.4 514315963 517945230 521404982 524780989 528143764 531445503 534593165 537519991 540377319
3648.8 540377319 543538094 546849668 549932182 552924454 555951357 558752596 561301291 563803077
3665.1 563803077 566116035 568057656 570147991 572314084 573974729 575799167 578062057 580284476
3681.4 580284476 582418680 584391236 585971713 587192476 588611126 590311110 591970384 593465686
3697.7 593465686 594712973 595782578 597026289 598398387 599517941 600263953 600973248 602158368 603484869
3716.1 603484869 604499400 605251193 605914712 606527567 607183993 608096480 609014690 609589338 609942675
3734.4 609942675 610557020 611679077 612882376 613404572 613361657 614055514 614948213 615239739 615842998
3752.8 615842998 616966784 617845774 618330657 618913770 619662404 620270193 620770335 621134222 621525824
3771.1 621525824 622216284 622952163 623446286 623721242 624103665 624561906 624920845 625364602 625915349 626455605
3791.5 626455605 626890421 627149820 627452016 627616882 627550125 628008962 628540993 628800213 629372001 630064964
3811.9 630064964 630302727 630137444 630287409 630415916 630522251 631166518 631736636 632065296 632319868 632530272
3832.3 632530272 632867754 633030951 632876873 632999957 633437872 633940279 634506106 635039091 635130405 634276390
3852.7 634276390 633758843 634628534 635620773 636086047 636061311 636064231 636351466 636359155 636307955 636636376 637042701
3875.2 637042701 637436211 637544334 637597322 637891829 637924075 638027191 638313591 638280153 638377309 638847351
3895.5 638847351 639109850 638975739 638794661 638746679 638946950 639382541 639763892 640016079 640171528 640137613
3915.9 640137613 640034914 640105784 640230715 640232921 640287042 640465617 640536249 640503883 640569627 640713871 640862167
3938.4 640862167 640925169 640867352 640915751 641063273 641105592 641133606 641233683 641321480 641362667 641387820 641411781
3960.8 641411781 641469657 641559422 641645193 641731977 641805232 641855717 641886294 641908407 641954184 642028213 642086208
3983.2 642086208 642098546 642105520 642113864 642093539 642093480 642170250 642287314
3997.5 642287314
##END=$$ End of the data block
