##TITLE=DI 14-1390708-5 Instantgum AA $$ Begin of the data block
##JCAMP-DX=5.00 $$ ACD/SpecManager v 10.08
##SPECTROMETER/DATA SYSTEM=Alpha
##DATE=04 Aug 2014 09:48:02
##DATA TYPE=INFRARED SPECTRUM
##DATA CLASS=XYDATA
##ORIGIN=
##OWNER=
##NPOINTS=1765
##FIRSTX=399.75695801
##LASTX=3997.56933594
##MAXX=3997.56933594
##MINX=399.75695801
##MAXY=0.74363947
##MINY=0.40566596
##XFACTOR=1.0000000000
##YFACTOR=1.000000000000000e-9
##FIRSTY=0.62571567
##DELTAX=2.03957629
##XUNITS=1/CM
##YUNITS=ARBITRARY UNITS
##XYDATA=(X++(Y..Y))
$$ plain form
399.8 625715673 623812556 623899996 624582946 624104738 623286486 623590171 624254107 624263942 624316514 624679387
420.2 624679387 624078810 622407317 621203244 621343911 621214926 619864106 618888617 619095504 619006515
438.5 619006515 617873013 617099404 617619038 617825687 616682649 616041780 617042542 617733300 616562903
456.9 616562903 615075469 615114272 615246177 613993943 612889349 613463819 614061713 612779438 611518085
475.2 611518085 612290919 613260567 612503529 611572981 612332642 613340139 612797737 611867607 612413049 613388836
495.6 613388836 612673521 611262381 611385882 612028897 610928476 609110475 609051406 610021651 609482646
514 609482646 607831180 607495785 608190954 607493937 605683088 605249345 606151700 605801404 604004383 603383482
534.4 603383482 604457259 604605556 603019714 602075517 602865458 603280365 602032363 601104915 601997077
$$ packed form
399.8F25715673j903117Q7440O82950m78208q18252L03685O63936R835N2572L62873
420.2F24679387o00577j671493j204073J40667j28985j350820r75489K06887q8989
438.5F19006515j133502p73609N19634K06649j143038o40869J000762O90758j170397
456.9F16562903j487434L8803J31905j252234j104594N74470N97894j282275j261353
475.2F11518085P72834R69648p57038r30548P59661J007497n42402r30130N45442R75787
495.6F13388836p15315j411140J23501O43015j100421j818001n9069R70245n39005
514F09482646j651466l35395O95169o97017j810849m33743R02355l50296j797021o20901
534.4F03383482J073777J48297j585842r44197P89941M14907j248002r27448Q92162
$$ plain form
552.7 601997077 602989435 602543235 602200091 603437483 604666114 604204893 603468776 604295194 605482161
571.1 605482161 605095267 604075015 604451239 605526447 605135202 603762567 603747070 604852498 604721665
589.4 604721665 603352845 603002012 603783011 603517711 602038562 601628840 602808297 603459239 602764904
607.8 602764904 602654099 604093075 605283320 605006278 604812443 606148124 607717156 608048439 608213544
626.1 608213544 609633267 611209750 611448705 611270010 612270832 613792002 614174306 613949239 614875436
644.5 614875436 616514444 617005765 616549909 616935432 618185222 618611932 618071795 618244469 619431317
662.9 619431317 620042264 619422734 619738698 621928513 623598933 624008417 624381065 625778675 627019823
681.2 627019823 626971126 626675844 627328396 628110588 627855361 627324820 627819598 628795862 628944874 628648698
$$ packed form
552.7F01997077R92358m46200l43144J237392J228631m61221p36117Q26418J186967
571.1F05482161l86894j020252L76224J075208l91245j372635j5497J105428j30833
589.4F04721665j368820l50833P80999k65300j479149m09722J179457O50942o94335
607.8F02764904j10805J438976J190245k77042j93835J335681J569032L31283J65105
626.1F08213544J419723J576483K38955j78695J000822J521170L82304k25067R26197
644.5F14875436J639008M91321m55856L85523J249790M26710n40137J72674J186848
662.9F19431317O10947o19530L15964K189815J670420M09484L72648J397610J241148
681.2F27019823m8697k95282O52552P82192k55227n30541M94778R76264J49012k96176
$$ plain form
701.6 628648698 629165888 630181849 630379021 629956424 630371392 631723225 632701993 633155525 634418964
720 634418964 636806250 638951719 640338957 642030954 644527674 646755099 647970319 649136603 651090920
738.3 651090920 652982116 653913796 654686868 656277180 657978594 658782959 659266055 660368264 661503673
756.7 661503673 661606431 661038697 660856605 660809278 659832001 658148527 657084286 656926692 656781554 656586409
777.1 656586409 657347679 659114480 660628021 661333382 662031949 663157761 663855731 663569808 663126469
795.4 663126469 663230240 663229167 662523568 661970437 662549138 663826644 665042281 666712284 669787645
813.8 669787645 673942089 678128719 682291985 686932504 691358984 694100380 694937170 694992423 694803178
832.1 694803178 693934083 692625403 692166328 693152368 694728196 696176231 697937429 700165689 701774895
$$ packed form
701.6F28648698N17190J015961J97172m22597M14968J351833R78768M53532J263439
720F34418964K387286K145469J387238J691997K496720K227425J215220J166284J954317
738.3F51090920J891196R31680P73072J590312J701414Q04365M83096J102209J135409
756.7F61503673J02758n67734j82092m7327r77277j683474j064241j57594j45138j95145
777.1F56586409P61270J766801J513541P05361O98567J125812O97970k85923m43339
795.4F63126469J03771j073p05599n53131N78701J277506J215637J670003L075361
813.8F69787645M154444M186630M163266M640519M426480K741396Q36790N5253j89245
832.1F94803178q69095j308680m59075R86040J575828J448035J761198K228260J609206
$$ plain form
850.5 701774895 702031493 701692820 701586664 701173007 699663043 697638810 696099460 694721758 692617774
868.9 692617774 690078378 688111365 686736345 685150623 683380008 682367682 682350397 682464898 682350397
887.2 682350397 682658911 683514357 683940172 683344901 682432890 681837976 680927575 679002345 676624596
905.6 676624596 674665987 672992110 671192467 669749618 669299185 669276714 668439567 666472435 663966238
923.9 663966238 660965919 656820059 651528537 645926774 640403628 634539962 628243685 622278154
940.2 622278154 617098927 612147927 606895506 601647496 596800208 592007279 586812973 581591070
956.6 581591070 577040851 573168278 569540024 566228092 563674271 561791062 560032666 558328331
972.9 558328331 557143211 556594491 556246579 555843711 555558383 555328727 554521739 552652597 550003886
$$ packed form
850.5G01774895K56598l38673j06156m13657j509964k024233j539350j377702k103984
868.9F92617774k539396j967013j375020j585722j770615j012326j7285J14501j14501
887.2F82350397L08514Q55446M25815n95271r12011n94914r10401j925230k377749
905.6F76624596j958609j673877j799643j442849m50433k2471q37147j967132k506197
923.9F63966238l000319m145860n291522n601763n523146n863666o296277n965531
940.2F22278154n179227m951000n252421n248010m847288m792929n194306n221903
956.6E81591070m550219l872573l628254l311932k553821j883209j758396j704335
972.9E58328331j185120n48720l47912m02868k85328k29656q06988j869142k648711
$$ plain form
991.2 550003886 547030926 543710649 539975464 536207914 532842278 529823184 526825130 523851931
1007.5 523851931 521176815 518798649 516494572 514323294 512605250 511379361 510328591 509271264
1023.9 509271264 508332133 507618845 507066071 506657481 506573617 506975412 507686317 508361101 508872569 509298146
1044.3 509298146 509593129 509595215 509358585 509091675 508843362 508490264 507990479 507482827 507036209 506520629
1064.7 506520629 505907953 505372882 505027771 504824460 504748225 504953980 505566835 506534755 507748306 509182990
1085 509182990 510873139 512796998 514855146 516971707 519146025 521365106 523562491 525702536 527830660
1103.4 527830660 529950798 531983793 533906281 535774291 537600577 539371014 541074395 542652667
1119.7 542652667 544059873 545304775 546392143 547360718 548345208 549379647 550335288 551132619 551768839
$$ packed form
991.2E50003886k972960l320277l735185l767550l365636l019094k998054k973199
1007.5E23851931k675116k378166k304077k171278j718044j225889j050770j057327
1023.9E09271264r39131p13288n52774m08590q3864M01795P10905O74784N11468M25577
1044.3E09298146K94983K086k36630k66910k48313l53098m99785n07652m46618n15580
1064.7E06520629o12676n35071l45111k03311p6235K05755O12855R67920J213551J434684
1085E09182990J690149J923859K058148K116561K174318K219081K197385K140045K128124
1103.4E27830660K120138K032995J922488J868010J826286J770437J703381J578272
1119.7E42652667J407206J244902J087368R68575R84490J034439R55641P97331O36220
$$ plain form
1138.1 551768839 552242398 552582860 552875936 553249240 553849757 554768026 556002080 557507992 559243441
1156.4 559243441 561179876 563310862 565594733 567973673 570488453 573206186 576123893 579243541
1172.7 579243541 582638144 586385429 590509772 594972968 599724054 604744613 609884679 614810050
1189.1 614810050 619285047 623251498 626637697 629331708 631348133 632919908 634244263 635282874
1205.4 635282874 635995686 636506498 636870801 636979103 636780620 636389256 635946333 635465622 634935617 634443879
1225.8 634443879 634118497 634012759 634060681 634235263 634628475 635248423 635947645 636632681 637310266 637949228
1246.2 637949228 638429403 638642788 638653755 638620496 638586283 638542235 638547659 638646781 638794661 638862967 638741970
1268.6 638741970 638432086 637925804 637149930 636149526 635113835 634177208 633378685 632771134 632436574
$$ packed form
1138.1E51768839M73559L40462K93076L73304O00517R18269J234054J505912J735449
1156.4E59243441J936435K130986K283871K378940K514780K717733K917707L119648
1172.7E79243541L394603L747285M124343M463196M751086N020559N140066M925371
1189.1F14810050M474997L966451L386199K694011K016425J571775J324355J038611
1205.4F35282874P12812N10812L64303J08302j98483l91364m42923m80711n30005m91738
1225.8F34443879l25382j05738M7922J74582L93212O19948O99222O85036O77585O38962
1246.2F37949228M80175K13385J0967l3259l4213m4048N424R9122J47880O8306j20997
1268.6F38741970l09884n06282p75874j000404j035691r36627p98523o07551l34560
$$ plain form
1287 632436574 632358432 632410944 632510960 632662952 632872701 633080781 633201838 633236647 633275092 633332193 633362353
1309.4 633362353 633430600 633665264 634077191 634555340 634945273 635177016 635275126 635177910 634845078 634369969
1329.8 634369969 633850992 633338571 632909715 632573485 632095158 631346524 630547583 629840791 629187107 628525019
1350.2 628525019 627842546 627209961 626649916 626185060 625892699 625587523 624983728 624343157 623919666 623651385
1370.6 623651385 623595715 623517215 623052061 622339427 621447027 620543838 620247722 620682776 620982289 620879173
1391 620879173 620869100 620755136 620061576 618855953 617358387 615878880 614405990 612802029 611263394
1409.3 611263394 609823883 608493745 607568085 607133150 606581807 605682135 605094433 604938090 605147958
1427.7 605147958 605715215 606325924 607139826 608669102 610116124 610807657 611612678 612693131 613788784
$$ packed form
1287F32436574p8142N2512J00016J51992K09749K08080J21057L4809L8445N7101L0160
1309.4F33362353O8247K34664M11927M78149L89933K31743R8110r7216l32832m75109
1329.8F34369969n18977n12421m28856l36230m78327p48634p98941p06792o53684o62088
1350.2F28525019o82473o32585n60045m64856k92361l05176o03795o40571m23491k68281
1370.6F23651385n5670p8500m65154p12634q92400r03189k96116M35054K99513j03116
1391F20879173j0073j13964o93560j205623j497566j479507j472890j603961j538635
1409.3F11263394j439511j330138r25660m34935n51343q99672n87702j56343K09868
1427.7F05147958N67257O10709Q13902J529276J447022O91533Q05021J080453J095653
$$ plain form
1446 613788784 614699066 615222514 615639806 616521120 618523419 620450199 620889783 621605456 623576224
1464.4 623576224 625839353 627834857 630680144 634871781 638653636 641407549 644001782 646885276
1480.7 646885276 650043666 653337538 657092929 661190867 664402485 666389525 668758512 672010660
1497 672010660 674468398 675825536 677226603 680170536 684179485 685258985 685027063 685477018 686680377
1515.4 686680377 688140571 689509749 691004276 691676974 691749871 691949844 692031324 692530572 693356872
1533.7 693356872 693468392 693985999 696130574 697095692 696167886 695088267 694376349 694030643 693789065
1552.1 693789065 693754613 694146335 695183277 694189727 691106021 688366532 686013699 683538914 680161536
1570.5 680161536 676045358 671752036 666239202 659667909 653121352 646350503 639361382 632449389
$$ packed form
1446F13788784R10282N23448M17292Q81314K002299J926780M39584P15673J970768
1464.4F23576224K263129J995504K845287M191637L781855K753913K594233K883494
1480.7F46885276L158390L293872L755391M097938L211618J987040K368987L252148
1497F72010660K457738J357138J401067K943933M008949J079500k31922M49955J203359
1515.4F86680377J460194J369178J494527O72698P2897J99973Q1480M99248Q26300
1533.7F93356872J11520N17607K144575R65118r27806j079619p11918l45706k41578
1552.1F93789065l4452L91722J036942r93550l083706k739489k352833k474785l377378
1570.5F80161536m116178m293322n512834o571293o546557o770849o989121o911993
$$ plain form
1586.8 632449389 625770688 619307578 613207936 607630849 602667809 598325908 594564378 591414392
1603.1 591414392 588958383 587102592 585557222 584267259 583516479 583520889 583640099 583280623 583307803
1621.4 583307803 583935678 584261894 584199011 584116042 584394276 585788369 588210166 589537978 589993656
1639.8 589993656 590918958 592594206 595447540 598171771 599471986 602031887 605914772 607031941
1656.1 607031941 607662857 609465301 612193644 614732623 616768360 619646370 622963667 625228345
1672.4 625228345 627804220 630791187 632979274 635174036 638816476 643753707 646508992 648145556
1688.8 648145556 650426507 652916193 656524420 660734773 664535940 668528736 670783162 672497153
1705.1 672497153 674735904 676580667 678300500 680293262 682929337 686207891 688030303 688331008
$$ packed form
1586.8F32449389o678701o463110o099642n577087m963040m341901l761530l149986
1603.1E91414392k456009j855791j545370j289963p50780M410J19210l59476K7180
1621.4E83307803O27875L26216o2883q2969K78234J394093K421797J327812M55678
1639.8E89993656R25302J675248K853334K724231J300215K559901L882885J117169
1656.1F07031941O30916J802444K728343K538979K035737K878010L317297K264678
1672.4F25228345K575875K986967K188087K194762L642440M937231K755285J636564
1688.8F48145556K280951K489686L608227M210353L801167L992796K254426J713991
1705.1F72497153K238751J844763J719833J992762K636075L278554J822412L00705
$$ plain form
1721.4 688331008 688973188 690251708 691709340 693242073 694913387 697612643 699618340 700048983 701078951
1739.7 701078951 702641487 703930080 705240011 706834435 708767474 710225523 710806370 711581230 712707996
1758.1 712707996 713889301 715293348 716040075 716509700 717610121 719163120 720838189 721531391 721420944
1776.5 721420944 721759379 722546697 723176360 723779976 724337101 724709272 725670099 727139235 727667272
1794.8 727667272 727614760 727999330 728749931 729237437 729386330 729587734 730092227 730773985 731161773 731318235
1815.2 731318235 731624126 732047915 732459188 733052552 733750105 734281003 735031009 735477149 735237241 735252380
1835.6 735252380 735666573 735867381 736101568 737104356 737989843 737929523 737682104 737661242 737884879 738202631
1856 738202631 738437772 738611519 738819540 739080966 739542127 740367055 740852058 740621686 740357816 740331233
$$ packed form
1721.4F88331008O42180J278520J457632J532733J671314K699256K005697M30643J029968
1739.7G01078951J562536J288593J309931J594424J933039J458049N80847P74860J126766
1758.1G12707996J181305J404047P46727M69625J100421J552999J675069O93202j10447
1776.5G21420944L38435P87318O29663O03616N57125L72171R60827J469136N28037
1794.8G27667272n2512L84570P50601M87506J48893K01404N04493O81758L87788J56462
1815.2G31318235L05891M23789M11273N93364O97553N30898P50006M46140k39908J5139
1835.6G35252380M14193K00808K34187J002788Q85487o0320k47419k0862K23637L17752
1856G38202631K35141J73747K08021K61426M61161Q24928M85003k30372k63870k6583
$$ plain form
1876.4 740331233 740453482 740707755 740955174 741061091 741165519 741623700 742068946 742029250 741988182 742138803
1896.8 742138803 742257774 742322981 742362738 742473185 742736340 743018866 743071020 742923319 742948353 743363082
1917.2 743363082 743633687 743564129 743626893 743600905 743348539 743202746 743255198 743361235 743329883 743186355
1937.6 743186355 743172407 743465543 743639469 743360698 743077815 743026316 742995143 742877901 742778420 742773950 742771029
1960 742771029 742610812 742444158 742549360 742671371 742457688 742172658 742104769 742125213 742059588 741917372
1980.4 741917372 741841853 741861701 741834521 741712511 741724193 741865933 741756678 741447270 741244912 741178155
2000.8 741178155 741109490 740957618 740796864 740726352 740695655 740576625 740420341 740351617 740257859 740036428
2021.2 740036428 739794910 739625752 739526689 739396274 739169776 738942564 738803387 738671482 738467097 738263428
$$ packed form
1876.4G40331233J22249K54273K47419J05917J04428M58181M45246l9696m1068J50621
1896.8G42138803J18971O5207L9757J10447K63155K82526N2154j47701K5034M14729
1917.2G43363082K70605o9558O2764k5988k52366j45793N2452J06037l1352j43528
1937.6G43186355j3948K93136J73926k78771k82883n1499l1173j17242r9481m470k921
1960G42771029j60217j66654J05202J22011k13683k85030o7889K0444o5625j42216
1980.4G41917372p5519J9848k7180j22010J1682J41740j09255l09408k02358o6757
2000.8G41178155o8665j51872j60754p0512l0697j19030j56284o8724r3758k21431
2021.2G40036428k41518j69158r9063j30415k26498k27212j39177j31905k04385k03669
$$ plain form
2041.6 738263428 738117278 737984061 737779319 737525582 737344384 737262011 737175226 737024248 736865342 736763656
2062 736763656 736717701 736613691 736420691 736277640 736201167 736063123 735872626 735751987 735691488 735575914
2082.4 735575914 735377908 735198081 735119343 735060692 734906375 734716058 734601915 734517038 734353364 734167099
2102.8 734167099 734070301 734015584 733907044 733743131 733626783 733610034 733587861 733495176 733420432 733417630 733393788
2125.2 733393788 733287454 733187497 733180165 733218789 733199775 733103514 733026803 733029544 733045042 733002782 732962310 733000398
2149.7 733000398 733047247 733025491 733006120 733074725 733160853 733166456 733148396 733211339 733334064 733413398 733441770
2172.1 733441770 733514369 733652651 733761013 733797729 733850658 733978570 734107912 734162509 734206617 734341204
2192.5 734341204 734512687 734610021 734661818 734764397 734916449 735033274 735095859 735175371 735302687 735410154
$$ packed form
2041.6G38263428j46150j33217k04742k53737j81198q2373q6785j50978j58906j01686
2062G36763656m5955j04010j93000j43051p6473j38044j90497j20639o0499j15574
2082.4G35575914j98006j79827p8738n8651j54317j90317j14143q4877j63674j86265
2102.8G34167099r6798n4717j08540j63913j16348j6749k2173r2685p4744k802k3842
2125.2G33393788j06334r9957p332L8624j9014r6261p6711K741J5498m2260m0472L8088
2149.7G33000398M6849k1756j9371O8605Q6128N603j8060O2943J22725P9334K8372
2172.1G33441770P2599J38282J08362L6716N2929J27912J29342N4597M4108J34587
2192.5G34341204J71483R7334N1797J02579J52052J16825O2585P9512J27316J07467
$$ plain form
2212.9 735410154 735459983 735527694 735646129 735745192 735791504 735838473 735942066 736067414 736135840 736173034 736253798
2235.4 736253798 736363709 736442149 736467242 736494482 736581266 736674190 736691773 736690283 736768365 736863077 736877680
2257.8 736877680 736861110 736913025 737015784 737056732 737042487 737086058 737173319 737215877 737219334 737244725 737301886
2280.2 737301886 737317145 737223446 737073243 736950934 736837924 736693501 736540437 736413121 736276090 736063659
2300.6 736063659 735797286 735514760 735187173 734812558 734470248 734218180 733928025 733434319 732836068 732387185
2321 732387185 732184470 731977880 731568635 731264591 731273174 731217623 730915964 730611324 730488956 730722964
2341.4 730722964 731720626 733092904 732781827 730502546 728169501 727095723 726881623 727008045 727381408
2359.8 727381408 727894425 728574872 729460359 730453312 731400251 732189775 732836127 733363926 733718693 733837664
$$ packed form
2212.9G35410154M9829O7711J18435R9063M6312M6969J03593J25348O8426L7194Q0764
2235.4G36253798J09911P8440K5093K7240Q6784R2924J7583j490P8082R4712J4603
2257.8G36877680j6570N1915J02759M0948j4245M3571Q7261M2558L457K5391N7161
2280.2G37301886J5259r3699j50203j22309j13010j44423j53064j27316j37031k12431
2300.6G36063659k66373k82526l27587l74615l42310k52068k90155m93706n98251m48883
2321G32387185k02715k06590m09245l04044Q583n5551l01659l04640j22368K34008
2341.4G30722964R97662J372278l11077k279281k333045j073778k14100J26422L73363
2359.8G27381408N13017O80447Q85487R92953R46939P89524O46352N27799L54767J18971
$$ plain form
2380.2 733837664 733744740 733561933 733346224 733088911 732838690 732653499 732477307 732243836 731987238 731754005
2400.6 731754005 731539249 731302023 731042504 730805814 730578244 730310619 730016828 729727924 729451001 729171395
2421 729171395 728865802 728549182 728246987 727951109 727644265 727322519 726978719 726622939 726274490 725939095
2441.3 725939095 725616217 725293040 724950850 724588156 724226832 723884225 723542273 723172784 722791433 722436309
2461.7 722436309 722110629 721782684 721431613 721066356 720708907 720366299 720002294 719615459 719250560 718901694
2482.1 718901694 718539357 718160748 717783749 717432737 717089176 716715753 716343939 715992153 715632260 715266705
2502.5 715266705 714899361 714525580 714150727 713791013 713445365 713097632 712754309 712410271 712057352 711722970
2522.9 711722970 711423516 711120307 710783899 710442066 710124671 709809422 709475219 709151924 708856106 708556354
$$ packed form
2380.2G33837664r2924j82807k15709k57313k50221j85191j76192k33471k56598k33233
2400.6G31754005k14756k37226k59519k36690k27570k67625k93791k88904k76923k79606
2421G29171395l05593l16620l02195k95878l06844l21746l43800l55780l48449l35395
2441.3G25939095l22878l23177l42190l62694l61324l42607l41952l69489l81351l55124
2461.7G22436309l25680l27945l51071l65257l57449l42608l64005l86835l64899l48866
2482.1G18901694l62337l78609l76999l51012l43561l73423l71814l51786l59893l65555
2502.5G15266705l67344l73781l74853l59714l45648l47733l43323l44038l52919l34382
2522.9G11722970k99454l03209l36408l41833l17395l15249l34203l23295k95818k99752
$$ plain form
2543.3 708556354 708220661 707884252 707587302 707294881 706980050 706663907 706361651 706056833 705726981 705375433
2563.7 705375433 705033481 704717278 704392910 704025626 703639865 703280568 702929795 702546716 702131093 701701343
2584.1 701701343 701276004 700853109 700423300 699984133 699519694 699038208 698563576 698076248 697560310 697029173
2604.5 697029173 696486533 695947766 695435166 694910944 694314063 693649113 692978024 692350388 691743612 691112816
2624.9 691112816 690471590 689819276 689116061 688376248 687657118 686970770 686275899 685527623 684760034 684036791
2645.3 684036791 683325529 682581842 681831419 681107938 680396736 679667294 678933859 678241372 677598119 676928699
2665.7 676928699 676214635 675545812 674922526 674270749 673611403 672998369 672404826 671774507 671130478 670530319
2686.1 670530319 669963360 669390261 668804646 668251097 667760849 667270303 666730285 666187346 665679812 665181339
$$ packed form
2543.3G08556354l35693l36409k96950k92421l14831l16143l02256l04818l29852l51548
2563.7G05375433l41952l16203l24368l67284l85761l59297l50773l83079m15623m29750
2584.1G01701343m25339m22895m29809m39167m64439m81486m74632m87328n15938n31137
2604.5F97029173n42640n38767n12600n24222n96881o64950o71089o27636o06776o30796
2624.9F91112816o41226o52314p03215p39813p19130o86348o94871p48276p67589p23243
2645.3F84036791p11262p43687p50423p23481p11202p29442p33435o92487o43253o69420
2665.7F76928699p14064o68823o23286o51777o59346o13034n93543o30319o44029o00159
2686.1F70530319n66959n73099n85615n53549m90248m90546n40018n42939n07534m98473
$$ plain form
2706.5 665181339 664649963 664096653 663581014 663102508 662600696 662081480 661609769 661176801 660705984 660180449
2726.9 660180449 659668505 659213305 658756375 658256352 657769680 657331288 656896055 656442285 656004071 655578971
2747.3 655578971 655103505 654534519 653930247 653393030 652919531 652416468 651843190 651255548 650689065 650098383
2767.7 650098383 649463654 648849487 648285985 647677600 646952033 646195233 645494044 644809246 644091964 643358707
2788.1 643358707 642623484 641857624 641049623 640238166 639425695 638563514 637661874 636758924 635867774 634988248
2808.5 634988248 634037852 632955134 631850958 630828619 629830241 628767610 627638936 626488447 625319481
2826.8 625319481 624100208 622850180 621627212 620426178 619153738 617730677 616221786 614737928
2843.1 614737928 613246500 611683309 610078871 608491302 606932819 605381846 603851616 602316499
$$ packed form
2706.5F65181339n31376n53310n15639m78506n01812n19216m71711m32968m70817n25535
2726.9F60180449n11944m55200m56930n00023m86672m38392m35233m53770m38214m25100
2747.3F55578971m75466n68986o04272n37217m73499n03063n73278n87642n66483n90682
2767.7F50098383o34729o14167n63502o08385p25567p56800p01189o84798p17282p33257
2788.1F43358707p35223p65860q08001q11457q12471q62181r01640r02950q91150q79526
2808.5F34988248r50396j082718j104176j022339r98378j062631j128674j150489j168966
2826.8F25319481j219273j250028j222968j201034j272440j423061j508891j483858
2843.1F14737928j491428j563191j604438j587569j558483j550973j530230j535117
$$ plain form
2859.5 602316499 600685775 598939419 597163022 595447063 593805552 592208147 590602577 589015245
2875.8 589015245 587604403 586397409 585290432 584277987 583373129 582528174 581699371 580932498 580303371
2894.1 580303371 579726636 579083145 578436136 577855229 577279210 576632857 575958371 575362444 574776530 574025393
2914.5 574025393 573144972 572336793 571691513 571159303 570709169 570430338 570369184 570372581 570394337 570629060
2934.9 570629060 571206093 572086871 573195815 574494362 575961053 577516675 579079866 580668807 582289040
2953.3 582289040 583894551 585455477 586967230 588443696 589841187 591082335 592132330 593036473
2969.6 593036473 593935430 594857514 595693350 596507430 597428083 598354161 599153519 599892497 600702703 601585150
2990 601585150 602360308 602872372 603219092 603484929 603554547 603447080 603290141 603092492 602867365 602630377
$$ packed form
2859.5F02316499j630724j746356j776397j715959j641511j597405j605570j587332
2875.8E89015245j410842j206994j106977j012445r04858q44955q28803p66873o29127
2894.1E80303371n76735o43491o47009n80907n76019o46353o74486n95927n85914p51137
2914.5E74025393q80421q08179o45280n32210m50134k78831o1154L397K1756K34723
2934.9E70629060N77033Q80778J108944J298547J466691J555622J563191J588941J620233
2953.3E82289040J605511J560926J511753J476466J397491J241148J049995R04143
2969.6E93036473Q98957R22084Q35836Q14080R20653R26078P99358P38978Q10206Q82447
2990F01585150P75158N12064L46720K65837O9618j07467j56939j97649k25127k36988
$$ plain form
3010.4 602630377 602275312 601684034 600863457 599898100 598891199 597948432 597034395 596007943 594936311
3028.7 594936311 594021261 593206525 592207253 590970993 589802384 588823557 587783754 586532831 585225940
3047.1 585225940 584058285 582947493 581731141 580456972 579186916 577923477 576694310 575557232
3063.4 575557232 574527323 573432505 572137535 570771396 569497406 568424881 567495227 566411138
3079.7 566411138 565129399 563864887 562626958 561358750 560055792 558706582 557416499 556251287
3096 556251287 555121005 553965449 552737772 551458836 550290525 549220443 548071802 546937108 545981467
3114.4 545981467 545052111 543940663 542616606 541164637 539762259 538551509 537437975 536266387
3130.7 536266387 535072565 533938050 532907784 531886995 530678451 529368579 528184652 527114034
$$ packed form
3010.4F02630377l55065n91278q20577r65357j006901r42767r14037j026452j071632
3028.7E94936311r15050q14736r99272j236260j168609r78827j039803j250923j306891
3047.1E85225940j167655j110792j216352j274169j270056j263439j229167j137078
3063.4E75557232j029909j094818j294970j366139j273990j072525r29654j084089
3079.7E66411138j281739j264512j237929j268208j302958j349210j290083j165212
3096E56251287j130282j155556j227677j278936j168311j070082j148641j134694r55641
3114.4E45981467r29356j111448j324057j451969j402378j210750j113534j171588
3130.7E36266387j193822j134515j030266j020789j208544j309872j183927j070618
$$ plain form
3147 527114034 526089191 525116980 524063647 522834778 521583319 520428002 519336045 518265724 517182827
3165.4 517182827 516065657 514966846 513917804 512850702 511745989 510685980 509678185 508650422
3181.7 508650422 507595956 506542563 505507112 504488111 503443897 502356410 501314938 500354171
3198 500354171 499346852 498263896 497225076 496254414 495290965 494312227 493337870 492400438 491457969
3216.4 491457969 490497023 489573061 488651067 487703621 486784458 485925734 485149711 484407753 483537227 482539684
3236.8 482539684 481584013 480727643 479968190 479307026 478615820 477779984 476917058 476182193 475527734 474827617
3257.2 474827617 474099308 473391086 472690195 472019523 471441895 470952690 470385700 469670147 468922704 468188286
3277.6 468188286 467437685 466704607 466041535 465423435 464819193 464265525 463739783 463114709 462351471 461511552
$$ packed form
3147E27114034j024843r72211j053333j228869j251459j155317j091957j070321j082897
3165.4E17182827j117170j098811j049042j067102j104713j060009j007795j027763
3181.7E08650422j054466j053393j035451j019001j044214j087487j041472r60767
3198E00354171j007319j082956j038820r70662r63449r78738r74357r37432r42469
3216.4D91457969r60946r23962r21994r47446r19163q58724p76023p41958q70526r97543
3236.8D82539684r55671q56370p59453o61164o91206q35836q62926p34865o54459p00117
3257.2D74827617p28309p08222p00891o70672n77628m89205n66990p15553p47443p34418
3277.6D68188286p50601p33078o63072o18100o04242n53668n25742o25074p63238q39919
$$ plain form
3298 461511552 460680991 460001200 459460407 458824813 457959831 456941307 455910385 454937339 453980833 453041643
3318.4 453041643 452161103 451301455 450397223 449379057 448264837 447189838 446207255 445305824 444457561
3336.7 444457561 443491429 442339957 441133469 439920753 438793212 437831163 436794609 435511887 434187233
3355.1 434187233 432983845 431876957 430814326 429814935 428954571 428092360 426979482 425634474 424317777
3373.4 424317777 423200160 422223568 421271682 420298070 419360936 418530464 417840272 417301774 416716546
3391.8 416716546 415835023 414916605 414364725 413979709 413292080 412308544 411457270 410880208 410371661 409828156
3412.2 409828156 409231842 408596128 408088535 407756627 407415062 407045633 406806648 406698793 406598955 406528831
3432.6 406528831 406534314 406430781 406082362 405753314 405665964 405782610 406048685 406213880 406206340 406296611 406553477
$$ packed form
3298D61511552q30561o79791n40793o35594q64982j018524j030922r73046r56506r39190
3318.4D53041643q80540q59648r04232j018166j114220j074999r82583r01431q48263
3336.7D44457561r66132j151472j206488j212716j127541r62049j036554j282722j324654
3355.1D34187233j203388j106888j062631r99391q60364q62211j112878j345008j316697
3373.4D24317777j117617r76592r51886r73612r37134q30472o90192n38498n85228
3391.8D16716546q81523r18418n51880l85016o87629r83536q51274n77062n08547n43505
3412.2D09828156n96314o35714n07593l31908l41565l69429k38985j07855r9838p0124
3432.6D06528831N483j03533l48419l29048q7350J16646K66075J65195p540R0271K56866
$$ plain form
3455 406553477 406908303 407327205 407718748 408098727 408657640 409349531 409773141 409861237 410034925 410483509
3475.4 410483509 411047548 411622256 412175596 412680715 413229376 413824946 414335608 414799660 415404409 416168630
3495.8 416168630 416823804 417405576 418321669 419238091 419624716 420074105 421003222 421934903 422590494 423150808
3516.2 423150808 423793793 424625993 425780624 426979989 427933991 428881526 429805428 430589408 431592673
3534.5 431592673 432823181 433806568 434624285 435772240 437452137 439088583 439986944 440825492 442179263
3552.9 442179263 443373114 444345444 445609570 446845114 447601885 449222714 452782601 455450028 455977857
3571.3 455977857 456581831 458081901 459855288 461689413 463289618 464432389 466525763 470495552
3587.6 470495552 473241299 473897725 475362420 477965653 480267256 482501626 484618843 485753596
$$ packed form
3455D06553477L54826M18902L91543L79979N58913O91891M23610Q8096J73688M48584
3475.4D10483509N64039N74708N53340N05119N48661N95570N10662M64052O04749P64221
3495.8D16168630O55174N81772R16093R16422L86625M49389R29117R31681O55591N60314
3516.2D23150808O42985Q32200J154631J199365R54002R47535R23902P83980J003265
3534.5D31592673J230508R83387Q17717J147955J679897J636446Q98361Q38548J353771
3552.9D42179263J193851R72330J264126J235544P56771J620829L559887K667427N27829
3571.3D55977857O03974J500070J773387J834125J600205J142771K093374L969789
3587.6D70495552K745747O56426J464695K603233K301603K234370K117217J134753
$$ plain form
3603.9 485753596 487088889 490213394 493605047 496159464 498249233 499697328 502785325 507251084
3620.2 507251084 508742929 507556736 507788062 513967752 520735681 521906495 522343218 523887575 525615394
3638.6 525615394 527428091 528413594 528395593 530604005 538397789 545129240 544702351 544010401 547151387
3656.9 547151387 549434185 549907804 550507784 550383210 550473750 554360211 558262348 558748841 563284934
3675.3 563284934 568322420 567812741 566349030 564963639 563692331 566100001 572567999 575887144
3691.6 575887144 574910164 573530257 572912216 573692739 576470017 577873230 576263905 575160503 577991605
3709.9 577991605 583582759 585071385 582525730 580692291 580880940 582024395 583341539 584266186 582952261
3728.3 582952261 580700159 581533611 586407661 591135144 590276778 584855735 583043396 588957846 590977192
$$ packed form
3603.9D85753596J335293L124505L391653K554417K089769J448095L087997M465759
3620.2E07251084J491845j186193K31326O179690O767929J170814M36723J544357J727819
3638.6E25615394J812697R85503j8001K208412P793784O731451m26889o91950L140986
3656.9E47151387K282798M73619N99980j24574R0540L886461L902137M86493M536093
3675.3E63284934N037486n09679j463711j385391j271308K407670O467998L319145
3691.6E75887144r76980j379907o18041P80523K777278J403213j609325j103402K831102
3709.9E77991605N591154J488626k545655j833439J88649J143455J317144R24647j313925
3728.3E82952261k252102Q33452M874050M727483q58366n421043j812339N914450K019346
$$ plain form
3746.7 590977192 589268386 593655467 597507954 595017135 592414200 593447566 594477892 593135357
3763 593135357 592523813 593237102 595054626 596959472 596147835 594074786 593897223 596139371 597387314
3781.3 597387314 596953392 597212732 597477973 597128928 596418917 595660269 596086562 596130848 596716821 600614548
3801.7 600614548 601390719 600577891 602539837 601508141 597361863 595831513 598658204 599903286 601302266
3820.1 601302266 605058193 604298830 601905227 600761473 599925399 599775612 599463820 600720644 604541183
3838.4 604541183 606315613 605822980 604965627 602276027 597430110 594405353 601534963 611910582
3854.8 611910582 610239148 604320824 601381183 602297664 603859901 602875769 603564739 606513977 607089221
3873.1 607089221 605860770 603303611 602673888 604250908 604297101 605582178 605922520 604217172 605506837
$$ packed form
3746.7E90977192j708806M387081L852487k490819k602935J033366J030326j342535
3763E93135357o11544P13289J817524J904846q11637k073049j77563K242148J247943
3781.3E97387314m33922K59340K65241l49045p10011p58648M26293M4286N85973L897727
3801.7F00614548P76171q12828J961946j031696m146278j530350K826691J245082J398980
3820.1F01302266L755927p59363k393603j143754q36074j49787l11792J256824L820539
3838.4F04541183J774430m92633q57353k689600m845917l024757P129610J0375619
3854.8F11910582j671434n918324k939641R16481J562237r84132O88970K949238N75244
3873.1F07089221j228451k557159o29723J577020M6193J285077L40342j705348J289665
$$ plain form
3891.5 605506837 606352866 603331268 601078212 602320492 605277956 608338475 609315217 607260823 604972363
3909.8 604972363 603684008 602752566 603208899 604984224 605548382 604780495 604779422 604990125 604086518 603890538
3930.2 603890538 605246484 605758429 604747534 603609383 603299856 604135096 604591012 604165554 604387403
3948.6 604387403 604815662 604535580 604081094 603864014 603797257 603946447 604162812 604007602 603698552 603609383
3969 603609383 603624940 603679657 603797972 603758931 603579581 603547037 603609025 603523493 603366733 603378952 603478670
3991.4 603478670 603501737 603493273 603427947
3997.5 603427947
$$ packed form
3891.5F05506837Q46029l021598k253056J242280K957464L060519R76742k054394k288460
3909.8F04972363j288355r31442M56333J775325N64158p67887j073K10703r03607j95980
3930.2F03890538J355946N11945j010895j138151l09527Q35240M55916m25458K21849
3948.6F04387403M28259k80082m54486k17080o6757J49190K16365j55210l09050q9169
3969F03609383J5557N4717J18315l9041j79350l2544O1988q5532j56760J2219R9718
3991.4F03478670K3067q464o5326
3997.5F03427947
##END=$$ End of the data block
