##TITLE=DI 14-1390708-5 Eficacia M $$ Begin of the data block
##JCAMP-DX=5.00 $$ ACD/SpecManager v 10.08
##SPECTROMETER/DATA SYSTEM=Alpha
##DATE=04 Aug 2014 09:48:02
##DATA TYPE=INFRARED SPECTRUM
##DATA CLASS=XYDATA
##ORIGIN=
##OWNER=
##NPOINTS=1765
##FIRSTX=399.75695801
##LASTX=3997.56933594
##MAXX=3997.56933594
##MINX=399.75695801
##MAXY=0.78104836
##MINY=0.32503903
##XFACTOR=1.0000000000
##YFACTOR=1.000000000000000e-9
##FIRSTY=0.46867695
##DELTAX=2.03957629
##XUNITS=1/CM
##YUNITS=ARBITRARY UNITS
##XYDATA=(X++(Y..Y))
399.8D68676955J87307l52204j845926j177490P04855N27054r08941m88311Q37237
418.1D66160536j78218j675189r59485J92374l50356j450092q53986K92331k72363
436.5D60905552j325697m87566Q74460K30938j075148m05640Q10951J4722j118123
454.8D58424449j73271Q21322m15474j428097l91573O63847k79308j306742l28362
473.2D55586791P56025M7446p73311J19299J191258L22729p95900j5021Q92103j18732
493.6D57212687j057148r6262N83470o05047j385569j88679N78046o15358j470238
511.9D52955902n14388K28554p87497j704037p47651J60158p23631j451969l94225
530.3D47021216M79251l84777j282514n11258L88681l72052j186967k76893O31094
$$ y = [468676955, 468864262, 468512058, 466666132, 465488642, 466193497, 466720551, 465811610, 465323299, 466160536, 465982318, 464307129, 463347644, 463540018, 463189662, 461739570, 460885584, 461177915, 460905552, 459579855, 459092289, 459966749, 460197687, 459122539, 458716899, 459527850, 459542572, 458424449, 458251178, 459072500, 458657026, 457228929, 456837356, 457501203, 457221895, 455915153, 455586791, 456342816, 456390262, 455616951, 455736250, 456927508, 457250237, 456454337, 456439316, 457331419, 457212687, 456155539, 456059277, 456642747, 456037700, 454652131, 454463452, 455041498, 454426140, 452955902, 452441514, 452670068, 451882571, 450178534, 449430883, 449591041, 448867410, 447415441, 447021216, 447500467, 447115690, 445833176, 445321918, 445710599, 445338547, 444151580, 443874687, 444505781]
548.6D44505781n6863o09070M59313J355023M90754l52859M30047J268238M45754n60314
569D47375804J22607J002371K77460o36011K5630Q28027R6590o82444P6086Q14646
589.4D49300766k8729r89378m17739M43995l9607o79553K13742J396239J118600L74258
609.8D50692594Q17567J635164J125574J86265O88076J675665J346469N09352R64522
628.2D59641248J974195J630187N25177O81340J679838J581073O95765Q55744J696914
646.5D70961481J418323L96877M06563J198084J005739Q255R5934J149415J317770
664.9D77958441P88569J155526J931905J767368J023680Q39769J563907J494318L12150
683.3D88835633j66059N03987O30528k01225l35664O41942J035273K34247j58579O27131
$$ y = [444505781, 444448918, 443839848, 444299161, 445654184, 446144938, 445792079, 446222126, 447490364, 447936118, 447375804, 447498411, 448500782, 448778242, 448142231, 448167861, 448995888, 449092478, 448410034, 448486120, 449300766, 449272037, 448282659, 447864920, 448308915, 448269308, 447589755, 447803497, 449199736, 450318336, 450692594, 451510161, 453145325, 454270899, 454457164, 455145240, 456820905, 458167374, 458676726, 459641248, 461615443, 463245630, 463770807, 464452147, 466131985, 467713058, 468408823, 469264567, 470961481, 472379804, 472776681, 473183244, 474381328, 475387067, 475395322, 475491256, 476640671, 477958441, 478747010, 479902536, 481834441, 483601809, 484625489, 485465258, 487029165, 488523483, 488835633, 488669574, 489173561, 489804089, 489602864, 489267200, 489909142, 490944415, 491178662, 491020083, 491647214]
703.7D91647214J046329K99395k9386Q97885J599610J179158J058042K261907L245920
722E03206074K717734K222359L017664L662646K836406J931429K408802K931178K062142
740.4E26996434J180947J802921K584815J923203R59039J327694J938581J107395j27673
758.7E39693356j41025J15752r54687k353907k239168j262188j133382j169086K25783
777.1E30781448K050757K278805J468062J491488K024769J429856P8797j93774L37124
795.4E41747332j38760j245975j067698K70485R68993R45628J831174L720462M987419
813.8E52019060N395591O328463P734061P627308N536437L427625K169907N49495j541853
832.1E89246094k260148j073301K39372P52986J599967L117025L712356K636015J395882
$$ y = [491647214, 492693543, 492992938, 492963552, 493861437, 495461047, 496640205, 497698247, 499960154, 503206074, 505923808, 508146167, 511163831, 514826477, 517662883, 519594312, 522003114, 524934292, 526996434, 528177381, 529980302, 532565117, 534488320, 535447359, 536775053, 538713634, 539821029, 539693356, 539552331, 539668083, 538713396, 536359489, 534120321, 532858133, 531724751, 530555665, 530781448, 532832205, 535111010, 536579072, 538070560, 540095329, 541525185, 541603982, 541410208, 541747332, 541608572, 540362597, 539294899, 539565384, 540534377, 541480005, 543311179, 547031641, 552019060, 557414651, 563743114, 571477175, 579104483, 584640920, 588068545, 590238452, 590787947, 589246094, 586985946, 585912645, 586152017, 586905003, 588504970, 591621995, 595334351, 597970366, 599366248]
850.5E99366248J045942M69506j053155k219498k193391k214611l115535l741860l270566
868.9E83073080k789855l187538l473699k669573j661837j464963j260995j61291R44972
887.2E67348301R08792K33174L2365k7418q75533j999735k365113k402544l081620
905.6E57770669l874301l524900k274871j419604j185357r82523j128078k395808m317463
923.9E36667764n681157o428420p414937q567453q962631q546025q190304q130520
940.2D74746317p732123o893427o419181o611109o738603o394625o087780o058991
956.6D21810478n735666m803210l850252l366500k986371k329350j724928j526326
972.9C95487875j370698p84874j11402j192l39210o79195j205891k249628l398389
$$ y = [599366248, 600412190, 600881696, 599828541, 597609043, 595415652, 593201041, 590085506, 586343646, 583073080, 580283225, 577095687, 573621988, 570952415, 569290578, 567825615, 566564620, 566403329, 567348301, 568257093, 568490267, 568522632, 568495214, 567619681, 565619946, 563254833, 560852289, 557770669, 553896368, 550371468, 548096597, 546676993, 545491636, 544509113, 543381035, 540985227, 536667764, 530986607, 524558187, 517143250, 508575797, 499613166, 491067141, 482876837, 474746317, 467014194, 460120767, 453701586, 447090477, 440351874, 433957249, 427869469, 421810478, 416074812, 411271602, 407421350, 404054850, 401068479, 398739129, 397014201, 395487875, 394117177, 393332303, 393220901, 393219709, 392880499, 392201304, 390995413, 388745785, 385347396]
991.2C85347396l965288m029840m111052m161060l838539l323376l106684l141492
1007.5C55670065k944917k483189k154916k029479j728713j192511q82268r54538r62258
1025.9C40337276o52343l39806k21371L7998N72979R04441Q22335O46145N89460M79460
1046.3C43176574J27553j80572j44034o9082k88129n15789m33624k82406m09842n99235
1066.7C40381414m64052j65016n7310Q017M01587R78231J334399J502156J835644K271265
1087.1C48026335K429217K380997K524585K859413K976299K792656K700478K857029
1103.4C69547009K885193K623052K458989K547175K513081K176255J890897J904399
1119.7C88546050J862913J489967J143634J136363J212776J020848P87914Q46237Q73000
$$ y = [385347396, 381382108, 377352268, 373241216, 369080156, 365241617, 361918241, 358811557, 355670065, 352725148, 350241959, 348087043, 346057564, 344328851, 343136340, 342254072, 341299534, 340337276, 339684933, 339345127, 339123756, 339161754, 339734733, 340639174, 341461509, 342107654, 342697114, 343176574, 343304127, 343123555, 342979521, 342910439, 342622310, 342106521, 341672897, 341390491, 340980649, 340381414, 339917362, 339752346, 339695036, 339703053, 340104640, 341082871, 342417270, 343919426, 345755070, 348026335, 350455552, 352836549, 355361134, 358220547, 361196846, 363989502, 366689980, 369547009, 372432202, 375055254, 377514243, 380061418, 382574499, 384750754, 386641651, 388546050, 390408963, 391898930, 393042564, 394178927, 395391703, 396412551, 397200465, 398046702, 398919702]
1138.1C98919702N71429L17276M66615P71791R36031J154423J692742K281964K508252
1156.4D09620225K567947K884865L286034L372639L314019L528863L939181M184664
1172.7D36698437M369735M860700N575865O084025O338984O709039P114857P007003
1189.1D84758645O329447N617172N046159M238725L174841K413511K119720J796484
1205.4E15494704J188874O88851N28574K92004k40624o34253o22154n75661p40350
1223.7E15379965p47561l44813P7188J83463K80917O76989J074851J116037J022578
1242.1E18719614J107931J124024P36594K16365M4227J14023L160j77980k8014K81274
1262.5E22141218K45631r7156l14474m01556p35820j252412j474917j353622j282930
$$ y = [398919702, 399491131, 399808407, 400275022, 401046813, 401982844, 403137267, 404830009, 407111973, 409620225, 412188172, 415073037, 418359071, 421731710, 425045729, 428574592, 432513773, 436698437, 441068172, 445928872, 451504737, 457588762, 463927746, 470636785, 477751642, 484758645, 491088092, 496705264, 501751423, 505990148, 509164989, 511578500, 513698220, 515494704, 516683578, 517372429, 517901003, 518193007, 517952383, 517318130, 516695976, 516120315, 515379965, 514632404, 514287591, 514364779, 514548242, 514829159, 515506148, 516580999, 517697036, 518719614, 519827545, 520951569, 521688163, 521904528, 521948755, 522062778, 522065938, 521887958, 521859944, 522141218, 522386849, 522289693, 521975219, 521573663, 520837843, 519585431, 518110514, 516756892, 515473962]
1280.8E15473962j282871r64224l59655K7597P4685J91510N01573O32643M79699M08053
1301.2E15182972N28157N27799L15547K41577M88580P32243P50541P76947Q80003P49767
1321.6E21174133L06845j31608l19838m41253o89030q31842o78182n17011o75738q92281
1342E16304195q37922p27296q15272r55820q83401p23123p33018p76351o40869n30303
1362.4E08680820n99443o00875m10795j59204r6202l15845n16355n69046p71701r49144
1382.8E03692210o19471m0174P4029j73509l61621n89848r86516j545400j868605j858116
1403.2D95722979j963645k075374k021819j868874j557470j175493r72777r10729n98878
1421.6D82577920j91301R9838M70280R18478J169890J298934J725942K009452J700729
$$ y = [515473962, 514191091, 513226867, 512867212, 512894809, 512969494, 513161004, 513662577, 514295220, 514774919, 515182972, 515711129, 516238928, 516554475, 516796052, 517284632, 518016875, 518767416, 519544363, 520424366, 521174133, 521480978, 521349370, 521029532, 520588279, 519899249, 519067407, 518389225, 517872214, 517196476, 516304195, 515466273, 514738977, 513923705, 512967885, 512084484, 511361361, 510628343, 509851992, 509211123, 508680820, 508081377, 507480502, 507069707, 506910503, 506814301, 506498456, 505982101, 505413055, 504641354, 503692210, 503072739, 503032565, 503106594, 502933085, 502571464, 501981616, 500995100, 499449700, 497581095, 495722979, 493759334, 491683960, 489662141, 487793267, 486235797, 485060304, 484087527, 483176798, 482577920, 482386619, 482486457, 482956737, 483875215, 485045105, 486344039, 488069981, 490079433, 491780162]
1439.9D91780162J599133J580596J456261J191139Q09252P15822J065642J746058J957238
1458.3E03901303J570403J967132K964616L396094L294170L961206N379319N521357
1474.6E31955600M851699M838764N176127N328179N128145N292177N718589N349874
1490.9E73639154M201472M086852M685402M123509L132343K846837L528536M129410
1507.2F04373515K407670J524627J830995K052367J987755J831412J990974J631320
1523.6F19630635J094222J024544J041412J178861J095772P53701R69290J510084P49290
1541.9F29047811o7294q4757K9683K0981p0751j6391Q9049n19097k354562k576292
1562.3F23498380k582669l122091m184723n716324n907357o687045r659469j0173261
$$ y = [491780162, 493379295, 494959891, 496416152, 497607291, 498416543, 499132365, 500198007, 501944065, 503901303, 505471706, 507438838, 510403454, 513799548, 517093718, 521054924, 526434243, 531955600, 536807299, 541646063, 546822190, 552150369, 557278514, 562570691, 568289280, 573639154, 577840626, 581927478, 586612880, 590736389, 593868732, 596715569, 600244105, 604373515, 606781185, 608305812, 610136807, 612189174, 614176929, 616008341, 617999315, 619630635, 620724857, 621749401, 622790813, 623969674, 625065446, 625819147, 626788437, 628298521, 629047811, 628980517, 628895760, 628925443, 628946424, 628875673, 628859282, 628948331, 628429234, 626074672, 623498380, 620915711, 617793620, 613608897, 607892573, 601985216, 595298171, 585638702, 575465441]
1578.6E75465441r390474j0102808j0620773j0553956j0257959r845138r210169q464903
1594.9D97019261p535279o503105n576283m652619l647208k775699k129018j474887
1611.3D62725163q17806l39985q047M19736Q97855J239419J082390Q55595Q94904J179487
1631.6D68128711J871347K708406K402484J886815K116024K510429L283411L576100
1648D88483727K724022L319621M562199L042310K498687L073215L631175L664434L289282
1666.3E18288672L656626M107892L612459L757179M124343L788233L806651M569768
1682.6E49711823N526305M503607L850818M360855M332661M885257N452990N264580
1699E87888896N507350M329026L799498M099250L634691L281713L308594L515184L612936
$$ y = [575465441, 566074967, 555972159, 545351386, 534797430, 524539471, 514694333, 505484164, 497019261, 489483982, 482980877, 477404594, 472751975, 469104767, 466329068, 464200050, 462725163, 461907357, 461567372, 461559325, 461979061, 462876916, 464116335, 465198725, 466054320, 466949224, 468128711, 470000058, 472708464, 475110948, 476997763, 479113787, 481624216, 484907627, 488483727, 491207749, 494527370, 499089569, 502131879, 504630566, 507703781, 511334956, 514999390, 518288672, 521945298, 526053190, 529665649, 533422828, 537547171, 541335404, 545142055, 549711823, 555238128, 559741735, 563592553, 567953408, 572286069, 577171326, 582624316, 587888896, 593396246, 597725272, 601524770, 605624020, 609258711, 612540424, 615849018, 619364202, 622977138]
1717.3F22977138K833187K207756K408505K622544K559662K676547K848565L228724
1733.6F44362628K923787K312541K713621K969503K713263K707243K914250K988994
1749.9F66605830K617896K212703K370596K498984K255917K189875K072513K004623
1766.3F84828937K052128J979053J916051J626671J319050J380206J547575J514494
1782.6F98164165J352310J241327J322388J544357J507580J123190J052260J243293
1798.9G08550870J239002J018942R71674J124204J166999J036108R02831R40144R94742
1817.2G17945516R43959R61363J102627J133322R83477R08017Q46028P77126P82251
1835.6G26383686Q16822Q87573R80019R74954P58051O19948O78659O91593O47187P02202
$$ y = [622977138, 625810325, 628018081, 630426586, 633049130, 635608792, 638285339, 641133904, 644362628, 647286415, 649598956, 652312577, 655282080, 657995343, 660702586, 663616836, 666605830, 669223726, 671436429, 673807025, 676306009, 678561926, 680751801, 682824314, 684828937, 686881065, 688860118, 690776169, 692402840, 693721890, 695102096, 696649671, 698164165, 699516475, 700757802, 702080190, 703624547, 705132127, 706255317, 707307577, 708550870, 709789872, 710808814, 711780488, 712904692, 714071691, 715107799, 716010630, 716950774, 717945516, 718889475, 719850838, 720953465, 722086787, 723070264, 723978281, 724824309, 725601435, 726383686, 727200508, 728088081, 729068100, 730043054, 730801105, 731421053, 732099712, 732791305, 733438492, 734140694]
1856G34140694P74384P14898O12557O75499Q26955P60436M65214L75212N35368N97537
1876.4G40478754N19037M93706N84960O22689N18203M76182N38349N39481M59850M25220
1896.8G45656431N01454N32925M09722L65555N04077N30243L31342K38657M03225N08070
1917.2G49981701L41952J95444K84731L30270J98185J02341J96397L17455K16544P3194
1937.6G52238214J64151L21329J80483m7148J4365J86682J62959J7405M4405J78874
1958G53461719J30474l8326J4365K14398J68264n6923n1617J35839J45554o735o139
1980.4G54110873J86205K10702K7835J3769K02716J91450n0962q9944R3878J26659
2000.8G55023181o1214j24573M2975J10268n8353j27196K9087P8738j07348k15590
$$ y = [734140694, 734915078, 735629976, 736242533, 736918032, 737744987, 738505423, 738970637, 739345849, 739881217, 740478754, 740997791, 741491497, 742076457, 742699146, 743217349, 743693531, 744231880, 744771361, 745231211, 745656431, 746157885, 746690810, 747100532, 747466087, 747970164, 748500407, 748831749, 749070406, 749473631, 749981701, 750323653, 750519097, 750803828, 751134098, 751332283, 751434624, 751631021, 751948476, 752165020, 752238214, 752402365, 752723694, 752904177, 752857029, 752871394, 753058076, 753221035, 753238440, 753282845, 753461719, 753592193, 753553867, 753568232, 753782630, 753950894, 753893971, 753842354, 753978193, 754123747, 754117012, 754110873, 754297078, 754507780, 754535615, 754549384, 754752100, 754943550, 754892588, 754802644, 754896522, 755023181, 754961967, 754837394, 754880369, 754990637, 754932284, 754805088, 754834175, 754912913, 754805565, 754589975]
2021.2G54589975p4268J3710j29819k21789q9884j9908j80662k83122j25766M232j30355
2043.6G53352344k46465j24812J0729p1347j79708p9274M4763l6300j35362j8537R9361
2066.1G52615392j1563j47998o6519P4982J9670j16289p6353M7922J4841q9347m9174
2088.5G52215564M8518k2053j40906p9035L5643j1027j05560m1246Q3864N2154o8009
2110.9G51967907k6763J20521J29640K8193J4961J09911J49429Q6784P7903J73390
2131.3G52831876K01524J18792R5009J79828K13086J40369J26779K30193K90513K37823
2151.7G54665792K02477K63691L20852K78949K36631L02970L60132L08394K95043L92556
2172.1G57627487M41671L80158L30329L75330M20988L90410L64125M02212M45426M26829
$$ y = [754589975, 754515707, 754529417, 754399598, 754177809, 754087925, 754068017, 753887355, 753604233, 753478467, 753482699, 753352344, 753105879, 752981067, 752991796, 752920449, 752740741, 752661467, 752706230, 752669930, 752534568, 752516031, 752615392, 752603829, 752455831, 752389312, 752464294, 752483964, 752367675, 752291322, 752339244, 752354085, 752264738, 752215564, 752264082, 752242029, 752101123, 752022088, 752057731, 752046704, 751941144, 751899898, 751983762, 752035916, 751967907, 751941144, 752061665, 752191305, 752219498, 752234459, 752344370, 752493799, 752580583, 752658486, 752831876, 753033400, 753152192, 753247201, 753427029, 753640115, 753780484, 753907263, 754137456, 754427969, 754665792, 754868269, 755131960, 755452812, 755731761, 755968392, 756271362, 756631494, 756939888, 757234931, 757627487, 758069158, 758449316, 758779645, 759154975, 759575963, 759966373, 760330498, 760732710, 761178136, 761604965]
2192.5G61604965L96490M23074M57584M27008L73662L95834M58658M38809L74377L78191
2212.9G65728652M20452M19438L73005L62575M06504M27663M02213L73244L81470L91900
2233.3G69687116L55065L30925L71516L88443L36349L06785L51549L97861L72588L28183
2253.7G73226380L39568L68595L42548L05414L25322L58820L30747K56896K42590K80619
2274.1G76377499K40922J81317K22445K67923K20299J50799J44482J70052J63496J42395
2294.5G78281629J62006K10165J81854J00553J00851J64748J78396J40786J36018J59443
2314.9G79816449J10209J7225L7432J36018J45554R5845R7334Q1241J5140j4007M291
2337.3G80542731N3644O6817L6538M7684j5915j49965j51754n245J38402K18392J94490
$$ y = [761604965, 762001455, 762424529, 762882113, 763309121, 763682783, 764078617, 764537275, 764976084, 765350461, 765728652, 766149104, 766568542, 766941547, 767304122, 767710626, 768138289, 768540502, 768913746, 769295216, 769687116, 770042181, 770373106, 770744622, 771133065, 771469414, 771776199, 772127748, 772525609, 772898197, 773226380, 773565948, 773934543, 774277091, 774582505, 774907827, 775266647, 775597394, 775854290, 776096880, 776377499, 776618421, 776799738, 777022183, 777290106, 777510405, 777661204, 777805686, 777975738, 778139234, 778281629, 778443635, 778653800, 778835654, 778936207, 779037058, 779201806, 779380202, 779520988, 779657006, 779816449, 779926658, 779943883, 779981315, 780117333, 780262887, 780358732, 780456066, 780537307, 780552447, 780538440, 780542731, 780596375, 780663192, 780699730, 780747414, 780731499, 780581534, 780429780, 780424535, 780562937, 780781329, 780975819]
2359.8G80975819O5684r54P808r1135j59860r5248l8862o8247j23501j12355j04487
2382.2G80254662j58548j91987j59025j40011j93775k44081k16544j85191k37644k88844
2402.6G78239012k57135k28583k89262l68237l60191k88069k90990l83437m12464l69012
2423G74991632l85523m49837m38094l93152m19199m78626m81426m33684m38630n08666
2443.4G70564795n29170m75884m72784n29170n25653m65036m61340n30362n48720m88937
2463.8G65537739m85718n61774n68450m85837m65334n45442n67674n00739m99845n72681
2484.2G60284245n79894m98831m70459n45144n88298n18263m71174n50211o04391n26547
2504.6G54931033m58598n37158o10232n18680m25338m89772n63144m96567m19557m57823
$$ y = [780975819, 781041503, 781040549, 781048357, 780957222, 780797362, 780702114, 780663252, 780595005, 780471504, 780359149, 780254662, 780096114, 779904127, 779745102, 779605091, 779411316, 779167235, 778950691, 778765500, 778527856, 778239012, 777981877, 777753294, 777464032, 777095795, 776735604, 776447535, 776156545, 775773108, 775360644, 774991632, 774606109, 774156272, 773718178, 773325026, 772905827, 772427201, 771945775, 771512091, 771073461, 770564795, 770035625, 769559741, 769086957, 768557787, 768032134, 767567098, 767105758, 766575396, 766026676, 765537739, 765052021, 764490247, 763921797, 763435960, 762970626, 762425184, 761857510, 761356771, 760856926, 760284245, 759704351, 759205520, 758735061, 758189917, 757601619, 757083356, 756612182, 756061971, 755457580, 754931033, 754472435, 753935277, 753325045, 752806365, 752381027, 751891255, 751328111, 750831544, 750411987, 749954164]
2525G49954164n08904m51088l73066m20749n00977m46439l52204l95357m79699m28915
2545.4G45596766l40104l86953m76778m48882l87013m28736n05388m88997m09424m09722
2565.8G41314769m99130n26547m71532m94957n96822n93960n09858n36025o65545p05063
2586.2G35715330o34015o41584p29859p46191p13825p47263q30591q49128p91550p99834
2606.6G28231490r14932r85860r32575q98838r98616j072526j017451j011849j116693
2624.9G19282150j168966j126766j110971j182139j251996j219272j158178j201511
2641.2G09862351j271843j241327j202524j245915j277864j226366j177490j205384
2657.5G00013638j220286j144171j065672j094877j149535j102210j027107j052439
$$ y = [749954164, 749445260, 748994172, 748621106, 748200357, 747699380, 747252941, 746900737, 746505380, 746025681, 745596766, 745256662, 744869709, 744392931, 743944049, 743557036, 743128300, 742622912, 742133915, 741724491, 741314769, 740815639, 740289092, 739817560, 739322603, 738725781, 738131821, 737621963, 737085938, 736420393, 735715330, 735081315, 734439731, 733709872, 732963681, 732249856, 731502593, 730672002, 729822874, 729031324, 728231490, 727316558, 726330698, 725398123, 724499285, 723500669, 722428143, 721410692, 720398843, 719282150, 718113184, 716986418, 715875447, 714693308, 713441312, 712222040, 711063862, 709862351, 708590508, 707349181, 706146657, 704900742, 703622878, 702396512, 701219022, 700013638, 698793352, 697649181, 696583509, 695488632, 694339097, 693236887, 692209780, 691157341]
2673.9F91157341j105309j052796r68218r66549r89497r31501q50320q64387r26196
2692.2F82502568r10223q18729p64966p87914q12173p89404p75337p98821p91669p33555
2712.6F74519777p15792p56740p66814p63893p95067q03053p64012p08104o59406o58750
2733F67128146o99520p04587o89208p22945p41661p00354o93083p35164p58469p49111
2753.4F59934044p55072q28981r01222q74222q35776q96096r65238r73105r70006j004219
2773.8F50930107j057208j065731j060724j090229j142382j200676j225770j216352
2790.1F41871035j233280j282990j301348j306116j368761j440287j443625j446545
2806.4F31048083j526951j623512j649260j648069j702070j778901j819849j839578
$$ y = [691157341, 690052032, 688999236, 688031018, 687064469, 686074972, 685143471, 684293151, 683428764, 682502568, 681592345, 680773616, 680008650, 679220736, 678408563, 677619159, 676843822, 676045001, 675253332, 674519777, 673803985, 673047245, 672280431, 671516538, 670721471, 669918418, 669154406, 668446302, 667786896, 667128146, 666428626, 665724039, 665034831, 664311886, 663570225, 662869871, 662176788, 661441624, 660683155, 659934044, 659178972, 658349991, 657448769, 656574547, 655738771, 654842675, 653877437, 652904332, 651934326, 650930107, 649872899, 648807168, 647746444, 646656215, 645513833, 644313157, 643087387, 641871035, 640637755, 639354765, 638053417, 636747301, 635378540, 633938253, 632494628, 631048083, 629521132, 627897620, 626248360, 624600291, 622898221, 621119320, 619299471, 617459893]
2822.7F17459893j897037j995683k046048k040506k084910k170444k202749k223194
2839.1F00799322k314687k422809k470672k501369k561390k623380k641558k614320
2855.4E80649137k619504k706349k807737k842784k858698k909839k895415k735734
2871.7E58273077k542377k385973k153039j845062j598418j455307j343250j205087
2888E43744564j090407j044035j010597r33349q73208q79348q86023q70049q92579
2906.4E35264969r63628j010359r84847r78709j037478j022220q82327o97732n31733
2924.7E27155936l72827j70052N8591L10302O51479J105845J597702K020717K329945
2943.1E34687638K576590K763033K856552K906263K942562K955199K929330K877056
$$ y = [617459893, 615562856, 613567173, 611521125, 609480619, 607395709, 605225265, 603022516, 600799322, 598484635, 596061826, 593591154, 591089785, 588528395, 585905015, 583263457, 580649137, 578029633, 575323284, 572515547, 569672763, 566814065, 563904226, 561008811, 558273077, 555730700, 553344727, 551191688, 549346626, 547748208, 546292901, 544949651, 543744564, 542654157, 541610122, 540599525, 539666176, 538792968, 537913620, 537027597, 536157548, 535264969, 534301341, 533290982, 532306135, 531327426, 530289948, 529267728, 528385401, 527687669, 527155936, 526783109, 526613057, 526671648, 526981950, 527633429, 528739274, 530336976, 532357693, 534687638, 537264228, 540027261, 542883813, 545790076, 548732638, 551687837, 554617167, 557494223]
2959.4E57494223K822995K704203K462089K192140K002299J906216J862586J820922
2975.7E75267673J837313J903891J860976J721681J655578J653552J591981J430034
2992E88922679J214624J006067P46488M29929K02179O2763j22666l24965m55022o06656
3012.4E91075420q52763j101852j261532j325905j371503j483202j578570j536667
3028.7E80563426j475453j512826j631617j740277j701355j620531j671136j781165
3045.1E67429066j833201j822650j823485j834512j836181j878678j909256j855135
3061.4E52635968j775801j748324j799405j879692j890957j820981j692474j610935
3077.7E38417399j717627j860678j867533j833260j814723j812756j849890j835763
$$ y = [557494223, 560317218, 563021421, 565483510, 567675650, 569677949, 571584165, 573446751, 575267673, 577104986, 579008877, 580869853, 582591534, 584247112, 585900664, 587492645, 588922679, 590137303, 591143370, 591889858, 592319787, 592521966, 592584729, 592462063, 592137098, 591682076, 591075420, 590222657, 589120805, 587859273, 586533368, 585161865, 583678663, 582100093, 580563426, 579087973, 577575147, 575943530, 574203253, 572501898, 570881367, 569210231, 567429066, 565595865, 563773215, 561949730, 560115218, 558279037, 556400359, 554491103, 552635968, 550860167, 549111843, 547312438, 545432746, 543541789, 541720808, 540028334, 538417399, 536699772, 534839094, 532971561, 531138301, 529323578, 527510822, 525660932, 523825169]
3094E23825169j739383j662731j689494j785755j782298j653075j606226j711548j708567
3112.4E08486092j540720j495541j613378j756907j846194j801580j679391j625806
3128.7D95126575j652360j646846j555920j460105j489997j628041j669884j587003
3145D82436419j524330j470089j422405j487136j600504j599490j531065j501977j487136
3163.4D68812287j448304j427263j454442j463324j420260j386106j401692j423955
3179.7D57386941j426250j417756j407385j388371j345247j341820j380384j381933
3196D46297795j356990j327574j286626j264214j253307j257956j280844j272232j242935
3214.3D34755117j226306j218409j196980j172274j166016j160115j138538j083553
$$ y = [523825169, 522085786, 520423055, 518733561, 516947806, 515165508, 513512433, 511906207, 510194659, 508486092, 506945372, 505449831, 503836453, 502079546, 500233352, 498431772, 496752381, 495126575, 493474215, 491827369, 490271449, 488811344, 487321347, 485693306, 484023422, 482436419, 480912089, 479442000, 478019595, 476532459, 474931955, 473332465, 471801400, 470299423, 468812287, 467363983, 465936720, 464482278, 463018954, 461598694, 460212588, 458810896, 457386941, 455960691, 454542935, 453135550, 451747179, 450401932, 449060112, 447679728, 446297795, 444940805, 443613231, 442326605, 441062391, 439809084, 438551128, 437270284, 435998052, 434755117, 433528811, 432310402, 431113422, 429941148, 428775132, 427615017, 426476479, 425392926]
3230.7D25392926j039833j103461j189887j160890j082003j021266r65059r45151r70334
3249D15915042r77397r22113q50589q40395q63016q58754q32826p88390p22081o75946
3269.4D07583535p14779p86990q20935q31216q18193q00521q00401p89374p47114p16031
3289.8C99757981p66873q56251r10699r45449r26226q44509q02219q98569j073987
3308.2C91733199j172036j184225j155108j135468j160324j160055j115144j128405
3324.5C82522434j249790j339704j317680j302391j307815j270354j307547j453251
3340.8C71973902j558959j583636j500249j385033j463473j667291j731545j619726
3357.1C59463990j515717j543909j557916j455277j437516j570791j687884j655698
$$ y = [425392926, 424353093, 423249632, 422059745, 420898855, 419816852, 418795586, 417830527, 416885376, 415915042, 414937645, 414015532, 413164943, 412324548, 411461532, 410602778, 409769952, 408981562, 408259481, 407583535, 406868756, 406081766, 405260831, 404429615, 403611422, 402810901, 402010500, 401221126, 400474012, 399757981, 398991108, 398134857, 397224158, 396278709, 395352483, 394507974, 393705755, 392807186, 391733199, 390561163, 389376938, 388221830, 387086362, 385926038, 384765983, 383650839, 382522434, 381272644, 379932940, 378615260, 377312869, 376005054, 374734700, 373427153, 371973902, 370414943, 368831307, 367331058, 365946025, 364482552, 362815261, 361083716, 359463990, 357948273, 356404364, 354846448, 353391171, 351953655, 350382864, 348694980, 347039282]
3373.4C47039282j505851j380444j311481j291513j251966j122862r30757p69883q45283
3391.8C36629242j078546j066476p80583o20723p96020r96411q91238p00295o52999
3410.1C29045951o63817o73592o25938n06788m47929m33475l30329j73181o3300n4658
3430.5C25072944J341J11372L5315j16706o5237J26928K83718L44873L41415M08858
3450.9C26544821N22971N90027O49780P14630O87211O97107Q86797R97425P99626N16832
3471.3C33607227N18858P38710R39220R34035P51734P34031R09448R51230Q80808R15080
3491.7C41880381R94831J056016J054645J083880J136363R88453Q38429R63837J177281
3510.1C51174116J285195J247198J154840J197129J344324J493096J451164J263053
$$ y = [347039282, 345533431, 344152987, 342841506, 341549993, 340298027, 339175165, 338244408, 337474525, 336629242, 335550696, 334484220, 333703637, 333082914, 332286894, 331290483, 330399245, 329698950, 329045951, 328382134, 327708542, 327082604, 326575816, 326127887, 325694412, 325364083, 325190902, 325127602, 325072944, 325074285, 325185657, 325220972, 325104266, 325039029, 325165957, 325449675, 325794548, 326135963, 326544821, 327067792, 327657819, 328307599, 329022229, 329709440, 330406547, 331293344, 332290769, 333090395, 333607227, 334126085, 334864795, 335804015, 336738050, 337489784, 338223815, 339133263, 340084493, 340965301, 341880381, 342875212, 343931228, 344985873, 346069753, 347206116, 348194569, 349032998, 349996835, 351174116, 352459311, 353706509, 354861349, 356058478, 357402802, 358895898, 360347062, 361610115]
3526.4C61610115J240015J377999J530201J667827J667678J559824J661480J889586
3542.7C74204725J918942J685619J575351J773536J934290J905352J933604K108306
3559C89039725K200931K102942K166718K604514K687782K343953K285421K521515K723813
3577.4D10677314K887457L019572K990812L013104L237486L220588L015876L201157
3593.7D35263366L494471L552705L562003L537417L385722L366202L714264L908574
3610D63784724L833801L825843L707171L892898M220695L770441L255575L360987M303903
3628.4D97956038M662811L776312L598690L743589L699005L762185L759504L615379
3644.7E28573513L847957M637599M529833L341675L119469L836334L807068L302872
$$ y = [361610115, 362850130, 364228129, 365758330, 367426157, 369093835, 370653659, 372315139, 374204725, 376123667, 377809286, 379384637, 381158173, 383092463, 384997815, 386931419, 389039725, 391240656, 393343598, 395510316, 398114830, 400802612, 403146565, 405431986, 407953501, 410677314, 413564771, 416584343, 419575155, 422588259, 425825745, 429046333, 432062209, 435263366, 438757837, 442310542, 445872545, 449409962, 452795684, 456161886, 459876150, 463784724, 467618525, 471444368, 475151539, 479044437, 483265132, 487035573, 490291148, 493652135, 497956038, 502618849, 506395161, 509993851, 513737440, 517436445, 521198630, 524958134, 528573513, 532421470, 537059069, 541588902, 544930577, 548050046, 551886380, 555693448, 558996320]
3661E58996320L176510L180206L171325L468215L497183K852977K992272L111839K477408
3679.4E86924255K338529K462804K513707K754807K825618K270162J838207J785219
3695.7F05713308J779139J794636J897395J770019J541436J580536J704693J665712
3712F19446874J445174J259625J273513J340747J310944J255572J241267J152217J133025
3730.3F30858958J396954J507997J261950R59456O52313N95093J025796J091957P09772
3748.7F40060246Q30531R56595P41243O70076Q06272Q56519P32004P78258Q43287P58826
3769.1F48033857O98150O30140O63102Q25941Q70645O93679N39720N64218O12378O52730
3789.5F54784560O88434O53803P01070P18474O01352O85334O16968M18543N25535N21242
$$ y = [558996320, 562172830, 565353036, 568524361, 571992576, 575489759, 578342736, 581335008, 584446847, 586924255, 589262784, 591725588, 594239295, 596994102, 599819720, 602089882, 603928089, 605713308, 607492447, 609287083, 611184478, 612954497, 614495933, 616076469, 617781162, 619446874, 620892048, 622151673, 623425186, 624765933, 626076877, 627332449, 628573716, 629725933, 630858958, 632255912, 633763909, 635025859, 635985315, 636637628, 637232721, 638258517, 639350474, 640060246, 640890777, 641847372, 642588615, 643258691, 644064963, 644921482, 645653486, 646431744, 647275031, 648033857, 648732007, 649362147, 650025249, 650851190, 651721835, 652415514, 652955234, 653519452, 654131830, 654784560, 655472994, 656126797, 656827867, 657546341, 658147693, 658833027, 659449995, 659868538, 660394073, 660915315]
3809.9F60915315M05550M84646P75396P59721M99845N50627M69983L30091L42726M16518
3830.3F65950418O06536P18773O30617M79221L29852K74957L14295L38852L66688L49343
3850.7F70359552M35173O85990M97878K26199K15710L59058M73976L41892L04819M67240
3871.1F74367487L48449K11299K00390L06666M47631L18945K55465K44320J55031K43783
3891.5F77099466K64287J58906K10941L20733L33667K70366J78814N6863k444R9480
3911.9F78991079K51413L08752K73406J89305J00851Q8930J03235R1791J37389K01821
3932.3F80737972J63377R5546R8169J32858J63496J40607J09315J30475J12831O7711
3952.7F81952357P2420P1108O6161J43290K16365J84297J22607J08481J40071J49428
$$ y = [660915315, 661320865, 661805511, 662580907, 663340628, 663840473, 664391100, 664861083, 665191174, 665533900, 665950418, 666556954, 667275727, 667906344, 668385565, 668715417, 668990374, 669304669, 669643521, 670010209, 670359552, 670794725, 671480715, 671978593, 672204792, 672420502, 672779560, 673253536, 673595428, 673900247, 674367487, 674715936, 674927235, 675127625, 675434291, 675881922, 676200867, 676456332, 676700652, 676855683, 677099466, 677363753, 677522659, 677733600, 678054333, 678388000, 678658366, 678837180, 678894043, 678891599, 678991079, 679242492, 679551244, 679824650, 680013955, 680114806, 680203736, 680306971, 680398762, 680536151, 680737972, 680901349, 680996895, 681095064, 681227922, 681391418, 681532025, 681641340, 681771815, 681884646, 681952357, 682024777, 682095885, 682162046, 682305336, 682521701, 682705998, 682828605, 682937086, 683077157, 683226585]
3973.1F83226585J04785O1632O5505J22130J31190P8499P6175R9301J07765J26422
3993.4F84199989J30296J21951
3997.5F84452236
$$ y = [683226585, 683331370, 683393002, 683458507, 683580637, 683711827, 683790326, 683866501, 683965802, 684073567, 684199989, 684330285, 684452236]
##END=$$ End of the data block
