##TITLE=DI 14-1194686-5 Instant gum BB $$ Begin of the data block
##JCAMP-DX=5.00 $$ ACD/SpecManager v 10.08
##SPECTROMETER/DATA SYSTEM=Alpha
##DATE=09 Jul 2014 10:22:58
##DATA TYPE=INFRARED SPECTRUM
##DATA CLASS=XYDATA
##ORIGIN=
##OWNER=
##NPOINTS=1765
##FIRSTX=399.75695801
##LASTX=3997.56933594
##MAXX=3997.56933594
##MINX=399.75695801
##MAXY=0.76012385
##MINY=0.33744225
##XFACTOR=1.0000000000
##YFACTOR=1.000000000000000e-9
##FIRSTY=0.50797683
##DELTAX=2.03957629
##XUNITS=1/CM
##YUNITS=ARBITRARY UNITS
##XYDATA=(X++(Y..Y))
$$ plain form
399.8 507976830 507279754 506650209 505866051 505243599 504889905 504626930 504570842 504851758 504707694 503803790
420.2 503803790 503132522 502339065 501266658 500779450 500703633 500225961 499540061 499140799 498764843 498157173
440.5 498157173 497691810 497412354 496874392 496550679 496869981 497137666 497052222 497129321 497392356 497431785
460.9 497431785 497499615 497737706 497589022 497090995 496928066 497045457 497005969 497045100 497405499 497625232
481.3 497625232 497454137 497398376 497555166 497417986 497020483 496729702 496271789 495524287 495049477 494743705
501.7 494743705 494108349 493484199 493058622 492421389 491600990 490979403 490404338 489553422 488771886 488294154
522.1 488294154 487660915 486737490 486088067 485813171 485401243 484851569 484546095 484333813 484016925 483877987
542.5 483877987 483878046 483736575 483742565 484140366 484557867 484863579 485360563 485996783 486555964 487069577 487542391
$$ packed form
399.8E07976830o97076o29545p84158o22452l53694k62975n6088K80916j44064r03904
420.2E03803790o71268p93457j072407m87208p5817m77672o85900l99262l75956o07670
440.5D98157173m65363k79456n37962l23713L19302K67685q5444P7099K63035L9429
460.9D97431785O7830K38091j48684m98027j62929J17391l9488L9131L60399K19733
481.3D97625232j71095n5761J56790j37180l97503k90781m57913p47502m74810l05772
501.7D94743705o35356o24150m25577o37233q20399o21587n75065q50916p81536m77732
522.1D88294154o33239r23425o49423k74896m11928n49674l05474k12282l16888j38938
542.5D83877987N9j41471N990L97801M17501L05712M96984O36220N59181N13613M72814
$$ plain form
565 487542391 487956852 488406837 488853902 489131510 489222616 489318848 489477962 489516079 489481628 489446729 489252150
587.4 489252150 488868952 488372087 487760305 487093747 486481696 485899389 485394150 485067755 484780490 484411895
607.8 484411895 484057248 483789772 483618706 483624011 484120250 485211760 486567825 488042623 489656985
626.1 489656985 491306931 492896289 494467735 495959133 497279376 498567402 499900550 501092076
642.5 501092076 502100348 503031194 503825128 504533827 505383730 506380498 507244766 507983923 508873165 509782314
662.9 509782314 510024428 509419322 510083199 512408793 514301836 515833437 517388344 518786013 520037830
681.2 520037830 521352947 522524655 523260057 523762167 524200022 524319768 524158120 523948312 523527861
699.6 523527861 522861660 522318602 522002637 521756113 521706223 522133946 522981465 524081767 525681138 528099835
$$ packed form
565D87542391M14461M49985M47065K77608R1106R6232J59114L8117l4451l4899j94579
587.4D89252150l83198m96865o11782o66558o12051n82307n05239l26395k87265l68595
607.8D84411895l54647k67476j71066N305M96239J091510J356065J474798J614362
626.1D89656985J649946J589358J571446J491398J320243J288026J333148J191526
642.5E01092076J008272R30846P93934P08699Q49903R96768Q64268P39157Q89242R09149
662.9E09782314K42114o05106O63877K325594J893043J531601J554907J397669J251817
681.2E20037830J315117J171708P35402N02110M37855J19746j61648k09808m20451
699.6E23527861o66201n43058l15965k46524m9890M27723Q47519J100302J599371K418697
$$ plain form
720 528099835 531197429 534728289 538592994 542396188 545733511 548638403 551180184 553203285 554711401
738.3 554711401 555977285 557074666 557931185 558632433 559219480 559507489 559478402 559292257 558799803 557807446
758.7 557807446 556499422 555004895 553189278 551203072 549532294 548539579 548318505 548988938 550660491
777.1 550660491 553111017 556033373 559317112 562823176 566283524 569656968 573068559 576352656
793.4 576352656 579179168 581373811 582794309 583389044 583419383 583316386 583481729 584278107 586053610
811.7 586053610 588958800 592910111 597709477 602927983 607799172 611567259 613737047 613950014 612176657
830.1 612176657 608904064 604921758 601164103 598705888 598334372 600154340 603750229 608378172 613042593
848.5 613042593 616809368 619296730 620639563 621017814 620578468 619564652 618098736 616074800 613485277
$$ packed form
720E28099835L097594L530860L864705L803194L337323K904892K541781K023101J508116
738.3E54711401J265884J097381Q56519P01248N87047K88009k9087j86145m92454r92357
758.7E57807446j308024j494527j815617j986206j670778r92715k21074O70433J671553
777.1E50660491K450526K922356L283739L506064L460348L373444L411591L284097
793.4E76352656K826512K194643J420498N94735L0339j02997J65343P96378J775503
811.7E86053610K905190L951311M799366N218506M871189L768087K169788K12967j773357
830.1F12176657l272593l982306l757655k458215l71516J819968L595889M627943M664421
848.5F13042593L766775K487362J342833L78251m39346j013816j465916k023936k589523
$$ plain form
866.8 613485277 610507250 607208371 603658020 600136161 596814513 593697608 590989470 588997841
883.1 588997841 587697446 586858571 586351395 585863233 584904850 583395422 581658423 579858482 578006566
901.5 578006566 576357186 575192213 574488163 574252844 574628234 575363934 575867057 575763047 574813366
919.8 574813366 572669089 569289982 565060496 560220122 554830074 549118459 543272734 537129700
936.2 537129700 530566514 523871124 517271936 510734379 504424393 498605877 493103594 487533301
952.5 487533301 481825411 476003200 469935238 463736206 457810313 452368885 447424114 443050444
968.8 443050444 439278990 435876966 432592273 429461867 426505595 423573792 420696974 418040037
985.1 418040037 415524065 412982047 410488516 408110619 405695707 403173536 400683224 398224294
$$ packed form
866.8F13485277k978027l298879l550351l521859l321648l116905k708138j991629
883.1E88997841j300395q38875n07176m88162r58383j509428j736999j799941j851916
901.5E78006566j649380j164973p04050k35319L75390P35700N03123j04010r49681
919.8E74813366k144277l379107m229486m840374n390048n711615n845725o143034
936.2E37129700o563186o695390o599188o537557o309986n818516n502283n570293
952.5D87533301n707890n822211o067962o199032n925893n441428m944771m373670
968.8D43050444l771454l402024l284693l130406k956272k931803k876818k656937
985.1D18040037k515972k542018k493531k377897k414912k522171k490312k458930
$$ plain form
1001.4 398224294 395652324 393039882 390532970 388090611 385737389 383707970 382092327 380745500
1017.7 380745500 379629582 378808111 378127724 377413422 376772761 376299113 375890046 375509918 375235230
1036.1 375235230 374967426 374504745 373875082 373200864 372439116 371576309 370752722 370016932 369272828 368564665
1056.5 368564665 368070960 367749989 367449492 367204547 367073745 366948009 366830736 366965055 367456108 368248373
1076.9 368248373 369424641 371108592 373178750 375458837 377982438 380755842 383605599 386501938
1093.2 386501938 389608562 392893285 396184295 399452627 402619541 405425191 407726675 409580946
1109.5 409580946 411007255 411966205 412610054 413199544 413793415 414423168 415257633 416284084 417280793
1127.9 417280793 418221891 419088572 419528216 419340491 418787897 418159693 417583346 417263567 417478830 418306589
$$ packed form
1001.4C98224294k571970k612442k506912k442359k353222k029419j615643j346827
1017.7C80745500j115918q21471o80387p14302o40661m73648m09067l80128k74688
1036.1C75235230k67804m62681o29663o74218p61748q62807q23587p35790p44104p08163
1056.5C68564665m93705l20971l00497k44945j30802j25736j17273J34319M91053P92265
1076.9C68248373J176268J683951K070158K280087K523601K773404K849757K896339
1093.2C86501938L106624L284723L291010L268332L166914K805650K301484J854271
1109.5D09580946J426309R58950O43849N89490N93871O29753Q34465J026451R96709
1127.9D17280793R41098Q66681M39644j87725n52594o28204n76347l19779K15263Q27759
$$ plain form
1148.3 418306589 419630468 421449482 423796892 426506490 429442734 432686955 436251521 439973176
1164.6 439973176 443846256 448011041 452421337 456982106 461865187 467200160 472861707 478854716
1180.9 478854716 485309124 492074341 498845756 505522132 511982918 517862499 522933841 527278900
1197.2 527278900 530882418 533634245 535692930 537305295 538465917 539182067 539708793 540152431 540369809
1215.6 540369809 540395916 540421784 540426373 540293753 540108502 539950907 539675832 539209723 538699448 538176656
1236 538176656 537548363 536909819 536420584 536023200 535624981 535320401 535139501 534951389 534776449 534768462
1256.4 534768462 534936428 535272539 535925806 536939085 538125694 539350867 540622771 541847944 542813599
1274.7 542813599 543474019 543915570 544098258 543974578 543666780 543262780 542689860 541951418 541208804 540535092
$$ packed form
1148.3D18306589J323879J819014K347410K709598K936244L244221L564566L721655
1164.6D39973176L873080M164785M410296M560769M883081N334973N661547N993009
1180.9D78854716O454408O765217O771415O676376O460786N879581N071342M345059
1197.2E27278900L603518K751827K058685J612365J160622P16150N26726M43638K17378
1215.6E40369809K6107K5868M589j32620j85251j57595k75075m66109n10275n22792
1236E38176656o28293o38544m89235l97384l98219l04580j80900j88112j74940p987
1256.4E34768462J67966L36111O53267J013279J186609J225173J271904J225173R65655
1274.7E42813599O60420M41551J82688j23680l07798m04000n72920p38442p42614o73712
$$ plain form
1295.1 540535092 539916277 539475858 539314926 539312124 539337099 539378047 539417982 539412796 539411962 539500773 539658487
1317.6 539658487 539852440 540085793 540276647 540271163 540020704 539587677 538986862 538194358 537274897 536338210
1338 536338210 535439134 534652710 534065068 533683360 533436000 533259749 533114195 532890141 532453775 531781018
1358.3 531781018 530891061 529759288 528505087 527260184 526008785 524821401 523809016 523096502 522767067
1376.7 522767067 522687912 522681177 522805154 523374677 524480164 525545835 526035666 525959253 525445402 524631441
1397.1 524631441 523504972 522106171 520518005 518720925 516822577 514880180 512933314 511131644
1413.4 511131644 509497643 507928371 506554842 505674660 505180955 504986286 505159259 505666256 506414235
1431.8 506414235 507363379 508750379 510515392 512116969 513658762 515128613 516401887 517601669
$$ packed form
1295.1E40535092o18815m40419j60932k802K4975M0948L9935n186q34Q8811J57714
1317.6E39658487J93953K33353J90854n484k50459m33027o00815p92504r19461r36687
1338E36338210q99076p86424n87642l81708k47360j76251j45554k24054m36366o72757
1358.3E31781018q89957j131773j254201j244903j251399j187384j012385p12514l29435
1376.7E22767067p9155o735J23977N69523J105487J065671M89831p6413n13851q13961
1397.1E24631441j126469j398801j588166j797080j898348j942397j946866j801670
1413.4E11131644j634001j569272j373529q80182m93705j94669J72973N06997P47979
1431.8E06414235R49144J387000J765013J601577J541793J469851J273274J199782
$$ plain form
1448.1 517601669 518736184 519671857 520539105 521966815 524213016 526264369 528282464 531090677 534462214
1466.4 534462214 537631273 541107476 545892060 551171422 556002796 560689211 565457940 570236564
1482.8 570236564 574775100 579348564 584285855 589236856 593396127 597241759 601451755 605447590
1499.1 605447590 608728111 611340940 614002585 617637277 620741785 622873604 624815464 626869738
1515.4 626869738 629054070 630988419 632961571 634856522 636313856 637577355 638631165 639526486
1531.7 639526486 640253365 640611231 640762389 640962958 640776336 640255511 639582455 638545692 637156129
1550.1 637156129 635685861 634089828 632236063 629865170 626983881 624401510 621521831 618203878
1566.4 618203878 614233553 609183550 604079843 598461509 590812445 582965732 575739920 568038464
$$ packed form
1448.1E17601669J134515R35673Q67248J427710K246201K051353K018095K808213L371537
1466.4E34462214L169059L476203M784584N279362M831374M686415M768729M778624
1482.8E70236564M538536M573464M937291M951001M159271L845632M209996L995835
1499.1F05447590L280521K612829K661645L634692L104508K131819J941860K054274
1515.4F26869738K184332J934349J973152J894951J457334J263499J053810Q95321
1531.7F39526486P26879L57866J51158K00569j86622n20825o73056j036763j389563
1550.1F37156129j470268j596033j853765k370893k881289k582371k879679l317953
1566.4F18203878l970325n050003n103707n618334p649064p846713p225812p701456
$$ plain form
1582.7 568038464 559913814 551763892 543916166 536455333 529431224 523019493 517430007 512575805
1599 512575805 508350968 504895151 502179205 499942780 498157889 496943742 496088952 495342493 494880557
1617.4 494880557 494898647 495055467 495285600 495674431 496108711 496561795 497206211 498287201 499960184
1635.7 499960184 501727819 503371656 505137801 506955266 509249389 512084782 514338315 516869783
1652 516869783 520842791 523984432 526390910 529101729 532534540 536206782 539285958 542651713 546868622
1670.4 546868622 550684571 554483712 558803737 562699616 566073596 569878936 575212240 579919517
1686.7 579919517 583456814 587091088 590460420 593837738 597280025 600525439 604065895 606642187
1703 606642187 608521998 610517681 612099707 613199234 614172399 615174890 616291702 617440104 618561745
$$ packed form
1582.7E68038464q124650q149922p847726p460833p024109o411731n589486m854202
1599E12575805m224837l455817k715946k236425j784891j214147q54790p46459m61936
1617.4D94880557J8090J56820K30133L88831M34280M53084O44416J080990J672983
1635.7D99960184J767635J643837J766145J817465K294123K835393K253533K531468
1652E16869783L973008L141641K406478K710819L432811L672242L079176L365755M216909
1670.4E46868622L815949L799141M320025L895879L373980L805340N333304M707277
1686.7E79919517L537297L634274L369332L377318L442287L245414L540456K576292
1703F06642187J879811J995683J582026J099527R73165J002491J116812J148402J121641
$$ plain form
1721.4 618561745 619770527 621156335 622840047 624914408 627145290 630108118 633551359 636238337
1737.7 636238337 638916850 641978204 645113945 648171067 651184857 654677391 658449113 661528885
1754 661528885 664309919 667264342 670000255 672609746 675017476 677117467 679015934 680801094 682913005
1772.4 682913005 684999406 686517060 687936366 689580500 691140771 692527473 693938613 695221782
1788.7 695221782 696387291 697841465 699340820 700483859 701466918 702665627 704004049 705086589
1805 705086589 705998540 707036853 708154738 709110439 710007608 710990071 711887360 712606192 713369668 714252353
1825.4 714252353 714980960 715723097 716667891 717448294 718035400 718714476 719389856 719863713 720455766 721320570
1845.8 721320570 722019970 722544968 723143220 723793030 724349678 724855065 725450456 726047516 726499856 726900816
$$ packed form
1721.4F18561745J208782J385808J683712K074361K230882K962828L443241K686978
1737.7F36238337K678513L061354L135741L057122L013790L492534L771722L079772
1754F61528885K781034K954423K735913K609491K407730K099991J898467J785160K111911
1772.4F82913005K086401J517654J419306J644134J560271J386702J411140J283169
1788.7F95221782J165509J454174J499355J143039R83059J198709J338422J082540
1805G05086589R11951J038313J117885R55701Q97169R82463Q97289P18832P63476Q82685
1825.4G14252353P28607P42137R44794P80403N87106O79076O75380M73857N92053Q64804
1845.8G21320570O99400N24998N98252O49810N56648N05387N95391N97060M52340M00960
$$ plain form
1866.2 726900816 727481723 728182852 728760779 729283333 729796112 730243087 730685055 731162429 731591165 731940687
1886.6 731940687 732347369 732831657 733233690 733608067 734047771 734421432 734703600 735022902 735390306 735712349
1907 735712349 736027420 736398041 736701310 736895263 737175226 737545669 737797081 738039434 738353848 738609433
1927.4 738609433 738802850 739008009 739221334 739380181 739497185 739607811 739753306 739939213 740103722 740239024
1947.8 740239024 740374267 740516901 740648746 740757346 740847766 740958154 741077065 741134703 741163373 741247833
1968.2 741247833 741328716 741354704 741395712 741467297 741523385 741567314 741646469 741713405 741714358 741710722 741765022 741834939
1992.6 741834939 741865456 741897166 741927385 741900802 741844594 741802394 741745055 741671443 741612434 741526008 741383970
2015.1 741383970 741268694 741199255 741074443 740888357 740717888 740580022 740428627 740272462 740144849 740003228
$$ packed form
1866.2G26900816N80907P01129N77927N22554N12779M46975M41968M77374M28736L49522
1886.6G31940687M06682M84288M02033L74377M39704L73661K82168L19302L67404L22043
1907G35712349L15071L70621L03269J93953K79963L70443K51412K42353L14414K55585
1927.4G38609433J93417K05159K13325J58847J17004J10626J45495J85907J64509J35302
1947.8G40239024J35243J42634J31845J08600R0420J10388J18911N7638K8670Q4460
1968.2G41247833Q0883K5988M1008P1585N6088M3929P9155O6936R53l636N4300O9917
1992.6G41834939L0517L1710L0219k6583n6208m2200n7339p3612n9009q6426j42038
2015.1G41383970j15276o9439j24812j86086j70469j37866j51395j56165j27613j41621
$$ plain form
2035.5 740003228 739805937 739620626 739501119 739381492 739245474 739137113 739041150 738927305 738833845 738779426
2055.9 738779426 738712668 738635361 738602102 738596141 738563418 738532841 738548636 738580525 738591254 738614917 738664031 738685310
2080.3 738685310 738700330 738764644 738813877 738794029 738784671 738816381 738821745 738801956 738825500 738864779 738857627 738847673
2104.8 738847673 738854587 738813758 738745511 738751948 738805890 738807857 738794863 738827884 738831341 738788724 738803029 738868117
2129.3 738868117 738900602 738917947 738975883 739027143 739044309 739100158 739212573 739308417 739385962 739522994 739687741
2151.7 739687741 739815891 739972591 740191102 740386367 740561604 740803480 741088331 741329372 741553664 741847694
2172.1 741847694 742173254 742463350 742749691 743050754 743322253 743596673 743949771 744315088 744603693 744890690
2192.5 744890690 745221198 745509148 745766401 746081412 746427357 746737361 747055948 747429550 747772038 748049378
$$ packed form
2035.5G40003228j97291j85311j19507j19627j36018j08361r5963j13845r3460n4419
2055.9G38779426o6758p7307l3259n961l2723l0577J5795L1889J0729K3663M9114K1279
2080.3G38685310J5020O4314M9233j9848r358L1710N364j9789K3544L9279p152r954
2104.8G38847673O914m0829o8247O437N3942J967j2994L3021L457m2617J4305O5088
2129.3G38868117L2485J7345N7936N1260J7166N5849J12415R5844P7545J37032J64747
2151.7G39687741J28150J56700K18511J95265J75237K41876K84851K41041K24292K94030
2172.1G41847694L25560K90096K86341L01063K71499K74420L53098L65317K88605K86997
2192.5G44890690L30508K87950K57253L15011L45945L10004L18587L73602L42488K77340
$$ plain form
2212.9 748049378 748361349 748718977 749039531 749350965 749714971 750079095 750398576 750726640 751082122 751401842
2233.3 751401842 751695037 752029538 752359748 752620101 752884388 753196478 753477633 753710449 753964484 754225016
2253.7 754225016 754429936 754633665 754902124 755170047 755372822 755564809 755771041 755962074 756192505 756478131
2274.1 756478131 756741047 756990492 757281601 757544518 757668972 757679880 757672191 757644296 757567585 757486880 757404447
2296.5 757404447 757237792 756954849 756617665 756214440 755659997 755016983 754443944 753970265 753442883 752639830
2316.9 752639830 751541376 750449240 749711990 749223053 748595357 747909606 747524261 747320652 746965408
2335.3 746965408 746552765 746266484 746214151 746940911 748851538 750352800 749720633 747315705 744639337
2353.6 744639337 742688179 741509795 741108239 741492689 742526293 744044363 745896757 747938991 750034809
$$ packed form
2212.9G48049378L11971L57628L20554L11434L64006L64124L19481L28064L55482L19720
2233.3G51401842K93195L34501L30210K60353K64287L12090K81155K32816K54035K60532
2253.7G54225016K04920K03729K68459K67923K02775J91987K06232J91033K30431K85626
2274.1G56478131K62916K49445K91109K62917J24454J0908p689k7895p6711q0705q2433
2296.5G57404447j66655k82943l37184m03225n54443o43014n73039m73679n27382q03053
2316.9G52639830j098454j092136p37250m88937o27696o85751l85345k03609l55244
2335.3G46965408m12643k86281n2333P26760J910627J501262o32167k404928k676368
2353.6G44639337j951158j178384m01556L84450J033604J518070J852394K042234K095818
$$ plain form
2372 750034809 752069235 753992438 755793512 757408857 758703947 759583890 760019600 760123849 760105133
2390.4 760105133 760034800 759889722 759722948 759570956 759389937 759177327 758974254 758781135 758568764 758345485
2410.8 758345485 758141696 757924974 757650137 757360101 757069886 756729841 756373167 756068170 755784690 755445540
2431.2 755445540 755065322 754687071 754287064 753879428 753511786 753139794 752715945 752295375 751906753 751497626
2451.5 751497626 751052916 750610232 750172436 749710083 749226749 748747706 748264611 747776628 747321963 746881127
2471.9 746881127 746400058 745889127 745393634 744919002 744430065 743919313 743405342 742895424 742403030 741928101
2492.3 741928101 741449833 740971684 740519941 740091980 739627540 739119411 738636255 738184273 737735987 737300336
2512.7 737300336 736865878 736392856 735898733 735441923 735013664 734568357 734119236 733696938 733289182 732872188
$$ packed form
2372G50034809K034426J923203J801074J615345J295090Q79943M35710J04249j8716
2390.4G60105133p0333j45078j66774j51992j81019k12610k03073j93119k12371k23279
2410.8G58345485k03789k16722k74837k90036k90215l40045l56674l04997k83480l39150
2431.2G55445540l80218l78251m00007m07636l67642l71992m23849m20570l88622m09127
2451.5G51497626m44710m42684m37796m62353m83334m79043m83095m87983m54665m40836
2471.9G46881127m81069n10931m95493m74632m88937n10752n13971n09918m92394m74929
2492.3G41928101m78268m78149m51743m27961m64440n08129m83156m51982m48286m35651
2512.7G37300336m34458m73022m94123m56810m28259m45307m49121m22298m07756m16994
$$ plain form
2533.1 732872188 732446492 732029200 731607199 731167555 730737269 730330169 729929507 729521751 729117095 728722513
2553.5 728722513 728320241 727919400 727538764 727143168 726717234 726289392 725846589 725375772 724918187 724481285
2573.9 724481285 724012792 723507404 723012626 722540796 722045124 721498787 720927179 720350385 719778657 719205022
2594.3 719205022 718587995 717919350 717255712 716619015 715969622 715290427 714601815 713898838 713133931 712317884
2614.7 712317884 711528659 710742772 709888995 709015250 708172679 707294881 706329823 705341697 704385459 703423619
2635.1 703423619 702441752 701468825 700463831 699374616 698266208 697198391 696120381 695021093 693960845
2653.5 693960845 692911208 691817641 690746665 689743459 688742340 687712729 686694145 685706735
2669.8 685706735 684727550 683751166 682803869 681883216 680973589 680094421 679251969 678412378 677585781 676810682
$$ packed form
2533.1G32872188m25696m17292m22001m39644m30286m07100m00662m07756m04656l94582
2553.5G28722513m02272m00841l80636l95596m25934m27842m42803m70817m57585m36902
2573.9G24481285m68493n05388m94778m71830m95672n46337n71608n76794n71728n73635
2594.3G19205022o17027o68645o63638o36697o49393o79195o88612p02977p64907q16047
2614.7G12317884p89225p85887q53777q73745q42571q77798r65058r88126r56238r61840
2635.1G03423619r81867r72927j004994j089215j108408j067817j078010j099288j060248
2653.5F93960845j049637j093567j070976j003206j001119j029611j018584r87410
2669.8F85706735r79185r76384r47297r20653r09627q79168q42452q39591q26597p75099
$$ plain form
2690.2 676810682 676037788 675223291 674429417 673687935 672944605 672200084 671508193 670811772 670044243 669278622
2710.6 669278622 668576837 667889774 667179167 666491747 665837824 665148258 664439917 663777649 663121819 662445128
2731 662445128 661800027 661208630 660621703 660006464 659401417 658790708 658120513 657441080 656808078 656166792
2751.4 656166792 655473769 654766321 654046237 653267264 652460814 651673734 650875032 650033653 649165809 648297787
2771.8 648297787 647399187 646443784 645476043 644487143 643433571 642355204 641279221 640157342 639001846
2790.1 639001846 637877822 636737883 635505438 634219050 632908404 631544590 630137563 628724754
2806.4 628724754 627289474 625766516 624155045 622511744 620835662 619082272 617259383 615393102
2822.7 615393102 613447666 611411393 609328389 607185304 604955375 602703631 600495040 598306298
$$ packed form
2690.2F76810682p72894q14497p93874p41482p43330p44521o91891o96421p67529p65621
2710.6F69278622p01785o87063p10607o87420o53923o89566p08341o62268o55830o76691
2731F62445128o45101n91397n86927o15239o05047o10709o70195o79433o33002o41286
2751.4F56166792o93023p07448p20084p78973q06450p87080p98702q41379q67844q68022
2771.8F48297787q98600r55403r67741r88900j053572j078367j075983j121879j155496
2790.1F39001846j124024j139939j232445j286388j310646j363814j407027j412809
2806.4F28724754j435280j522958j611471j643301j676082j753390j822889j866281
2822.7F15393102j945436k036273k083004k143085k229929k251744k208591k188742
$$ plain form
2839.1 598306298 596113861 593959510 591820180 589606345 587350488 585132062 582902193 580591381
2855.4 580591381 578239918 575873971 573418558 570863247 568296671 565742135 563213885 560801804
2871.7 560801804 558529675 556366622 554378033 552652895 551138878 549725235 548396349 547161937
2888 547161937 545993447 544902623 543909371 542963922 541998684 541013420 540052712 539102018 538123667 537123442
2908.4 537123442 536098421 535028517 533897519 532733858 531580210 530481040 529555082 528861344 528349042
2926.8 528349042 528011143 527887702 528004348 528399169 529154420 530309796 531810760 533623517 535746574
2945.1 535746574 538067698 540468633 542985618 545630813 548324525 551065445 553924203 556885540
2961.4 556885540 559823334 562647939 565338850 567883492 570313275 572645903 574822843 576834261
$$ packed form
2839.1E98306298k192437k154351k139330k213835k255857k218426k229869k310812
2855.4E80591381k351463k365947k455413k555311k566576k554536k528250k412081
2871.7E60801804k272129k163053j988589j725138j514017j413643j328886j234412
2888E47161937j168490j090824r93252r45449r65238r85264r60708r50694r78351j000225
2908.4E37123442j025021j069904j130998j163661j153648j099170r25958o93738n12302
2926.8E28349042l37899j23441J16646L94821P55251J155376J500964J812757K123057
2945.1E35746574K321124K400935K516985K645195K693712K740920K858758K961337
2961.4E56885540K937794K824605K690911K544642K429783K332628K176940K011418
$$ plain form
2977.8 576834261 578707397 580402017 581913948 583291888 584555209 585745215 586833119 587675452
2994.1 587675452 588264823 588663459 588841617 588846266 588731587 588459849 588069081 587613940 587021947 586194038
3014.5 586194038 585142672 583973348 582736731 581429899 580082774 578688383 577248275 575827599
3030.8 575827599 574434340 572945178 571295679 569662929 568141103 566566408 564839005 563050449
3047.1 563050449 561318755 559600532 557821572 556045115 554273486 552463055 550674796 548951149
3063.4 548951149 547258973 545508504 543650448 541777253 539979458 538300514 536716700 535052061
3079.7 535052061 533230543 531357169 529479802 527642787 525872052 524060190 522187769 520382643
3096 520382643 518707156 517050028 515273035 513448298 511741340 510117948 508408010 506673694 505102277
$$ packed form
2977.8E76834261J873136J694620J511931J377940J263321J190006J087904Q42333
2994.1E87675452N89371L98636J78158M649j14679k71738l90768m55141n91993q27909
3014.5E86194038j051366j169324j236617j306832j347125j394391j440108j420676
3030.8E75827599j393259j489162j649499j632750j521826j574695j727403j788556
3047.1E63050449j731694j718223j778960j776457j771629j810431j788259j723647
3063.4E48951149j692176j750469j858056j873195j797795j678944j583814j664639
3079.7E35052061j821518j873374j877367j837015j770735j811862j872421j805126
3096E20382643j675487j657128j776993j824737j706958j623392j709938j734316j571417
$$ plain form
3114.4 505102277 503602862 501978695 500198662 498343140 496521652 494804382 493157417 491490066
3130.7 491490066 489813179 488216907 486705363 485182285 483556390 481863201 480206728 478626758
3147 478626758 477131456 475679785 474154174 472521961 470884383 469293773 467754573 466279089 464823484
3165.4 464823484 463347316 461860806 460378468 458911628 457468629 456041336 454603612 453134507
3181.7 453134507 451671243 450264961 448894501 447526962 446157843 444785178 443416029 442069799
3198 442069799 440757900 439458072 438158840 436882615 435617089 434336841 433066070 431831807 430607080
3216.4 430607080 429386169 428205520 427047789 425872892 424695611 423560113 422497690 421495378
3232.7 421495378 420451850 419318378 418204427 417193800 416271299 415366262 414409101 413418442 412472397
$$ packed form
3114.4E05102277j499415j624167j780033j855522j821488j717270j646965j667351
3130.7D91490066j676887j596272j511544j523078j625895j693189j656473j579970
3147D78626758j495302j451671j525611j632213j637578j590610j539200j475484j455605
3165.4D64823484j476168j486510j482338j466840j442999j427293j437724j469105
3181.7D53134507j463264j406282j370460j367539j369119j372665j369149j346230
3198D42069799j311899j299828j299232j276225j265526j280248j270771j234263j224727
3216.4D30607080j220911j180649j157731j174897j177281j135498j062423j002312
3232.7D21495378j043528j133472j113951j010627r22501r05037r57161r90659r46045
$$ plain form
3251.1 412472397 411614180 410811275 409988225 409123123 408261776 407439172 406654596 405918151 405246407 404562503
3271.4 404562503 403779954 402939796 402118504 401332617 400547773 399749756 398976028 398254156 397583514 396914959
3291.8 396914959 396171331 395334959 394429803 393526733 392705351 391951680 391177744 390299857 389285773
3310.2 389285773 388201803 387167692 386184424 385181755 384171695 383207470 382261515 381213099 380054861
3328.6 380054861 378912896 377817541 376749307 375741929 374713421 373554587 372342587 371142089
3344.9 371142089 369953811 368846864 367750704 366497129 365169793 363948405 362828761 361710161
3361.2 361710161 360586256 359579682 358667046 357621521 356346518 355037719 353897899 352906257 351965368
3379.5 351965368 351006746 350051910 349187642 348488599 347949475 347347140 346508145 345669925 345129609 344733745
$$ packed form
3251.1D12472397q58217q02905q23050q65102q61347q22604p84576p36445o71744o83904
3271.4D04562503p82549q40158q21292p85887p84844p98017p73728p21872o70642o68555
3291.8C96914959p43628q36372r05156r03070q21382p53671p73936q77887j014084
3310.2C89285773j083970j034111r83268j002669j010060r64225r45955j048416j158238
3328.6C80054861j141965j095355j068234j007378j028508j158834j212000j200498
3344.9C71142089j188278j106947j096160j253575j327336j221388j119644j118600
3361.2C61710161j123905j006574r12636j045525j275003j308799j139820r91642r40889
3379.5C51965368r58622r54836q64268o99043n39124o02335q38995q38220n40316l95864
$$ plain form
3399.9 344733745 344091505 343202472 342433840 341897905 341429949 340929270 340367109 339787900 339316040 338953137
3420.3 338953137 338614821 338335842 338173300 338110238 338064700 338038415 338074535 338018209 337762773 337503463
3440.7 337503463 337442249 337578326 337787330 337946177 338089794 338314950 338633418 339024276 339482933 339916736
3461.1 339916736 340340316 340929717 341633320 342161179 342395693 342612058 343052924 343698978 344386250 344923407
3481.5 344923407 345410317 346058816 346740425 347329080 347975254 348749280 349589348 350385517 351146042 351974875
3501.9 351974875 352752030 353392869 354106426 355027795 356092632 357115746 357990414 358867794 359900355
3520.3 359900355 361101091 362270713 363256782 364259243 365430266 366686136 368028045 369407356
3536.6 369407356 370664269 371919334 373346627 374905318 376398563 377725244 379104942 380668968
$$ packed form
3399.9C44733745o42240q89033p68632n35935m67956n00679n62161n79209m71860l62903
3420.3C38953137l38316k78979j62542o3062m5538k6285L6120n6326k55436k59310
3440.7C37503463o1214J36077K09004J58847J43617K25156L18468L90858M58657M33803
3461.1C39916736M23580N89401P03603N27859K34514K16365M40866O46054O87272N37157
3481.5C44923407M86910O48499O81609N88655O46174P74026Q40068P96169P60525Q28833
3501.9C51974875P77155O40839P13557R21369J064837J023114Q74668Q77380J032561
3520.3C59900355J200736J169622R86069J002461J171023J255870J341909J379311
3536.6C69407356J256913J255065J427293J558691J493245J326681J379698J564026
$$ plain form
3552.9 380668968 382231057 383758813 385397404 387054920 388521016 390145332 392529070 395044327
3569.2 395044327 396957666 398705900 400723875 402938455 405249476 407558471 409711480 411993027
3585.5 411993027 414828897 417654157 419974297 422414780 425258160 428167760 431085885 433992535
3601.9 433992535 436633319 439217716 442334890 445737869 448982209 452101320 454977363 458322942
3618.2 458322942 462383986 465629846 467747420 469973594 474179059 479308456 482805371 485851258
3634.5 485851258 489140630 492380977 495655984 498665661 501109362 504001737 509017885 514413595
3650.8 514413595 517420828 519866884 523638427 527328372 530135751 532701612 534920096 536953330
3667.1 536953330 540075719 543596625 545895815 549154282 553058565 555292785 556946397 558486938
$$ packed form
3552.9C80668968J562089J527756J638591J657516J466096J624316K383738K515257
3569.2C95044327J913339J748234K017975K214580K311021K308995K153009K281547
3585.5D11993027K835870K825260K320140K440483K843380K909600K918125K906650
3601.9D33992535K640784K584397L117174L402979L244340L119111K876043L345579
3618.2D58322942M061044L245860K117574K226174M205465N129397L496915L045887
3634.5D85851258L289372L240347L275007L009677K443701K892375N016148N395710
3650.8E14413595L007233K446056L771543L689945K807379K565861K218484K033234
3667.1E36953330L122389L520906K299190L258467L904283K234220J653612J540541
$$ plain form
3683.4 558486938 559826732 562063396 565552592 568269610 569667041 570753098 571855724 573176980
3699.8 573176980 575116038 576900005 577716172 578347921 580000281 582795203 584802091 585385382 585728526
3718.1 585728526 586468279 587533653 588722825 589896500 590540826 590701342 591480196 593515694 595925927
3736.5 595925927 596952915 596278250 595947742 597852767 599299312 599362850 600942910 603010237 603342891
3754.8 603342891 603185415 603919625 604929030 605247319 605534375 606189549 607227802 608449996 608972609
3773.2 608972609 608945131 609261453 610299170 611227572 611601889 612094402 612687647 613110125 613338530 613395333
3793.6 613395333 613716245 614038885 614411414 615822434 616704524 616946638 618005633 618382990 617609501
3811.9 617609501 617207229 618076146 618788362 619385123 620918870 621430099 621151388 621102154 621045649 621145129
$$ packed form
3683.4E58486938J339794K236664L489196K717018J397431J086057J102626J321256
3699.8E73176980J939058J783967Q16167O31749J652360K794922K006888N83291L43144
3718.1E85728526P39753J065374J189172J173675O44326J60516P78854K035498K410233
3736.5E95925927J026988o74665l30508J905025J446545O3538J580060K067327L32654
3754.8F03342891j57476P34210J009405L18289K87056O55174J038253J222194N22613
3773.2F08972609k7478L16322J037717R28402L74317M92513N93245M22478K28405N6803
3793.6F13395333L20912L22640L72529J411020Q82090K42114J058995L77357p73489
3811.9F17609501m02272Q68917P12216N96761J533747N11229k78711m9234n6505R9480
$$ plain form
3832.3 621145129 621319473 621893227 623236716 624209344 624569595 624828875 624464691 623189628 622003078
3850.7 622003078 623576283 627144754 627738178 626516342 625744760 626004398 626657963 626627147 626875460
3869 626875460 628011227 628619254 628653109 628217578 628002882 628558159 628881633 629465461 629903555 629564047
3889.4 629564047 629939377 630495429 629896820 629147232 629300594 630140066 631270409 632100105 632048070 631642580
3909.8 631642580 631365538 631099522 631142020 631688356 632062376 631972253 631996155 632171750 632037103 631992996
3930.2 631992996 632474840 632876873 632789314 632512569 632346511 632514477 632739961 632727563 632843912 633091867
3950.6 633091867 633141100 633051097 633007348 633061230 633219957 633422732 633493364 633440256 633423686 633464754 633518457
3973.1 633518457 633608043 633701205 633723021 633741796 633810043 633829415 633780539 633795619 633899570 633982182 634024024
$$ packed form
3832.3F21145129J74344N73754J343489R72628L60251K59280l64184j275063j186550
3850.7F22003078J573205L568471N93424j221836p71582K59638O53565l0816K48313
3869F26875460J135767O08027L3855m35531k14696N55277L23474N83828M38094l39508
3889.4F29564047L75330N56052n98609p49588J53362Q39472J130343Q29696n2035m05490
3909.8F31642580k77042k66016M2498N46336L74020r0123K3902J75595j34647m4107
3930.2F31992996M81844M02033q7559k76745j66058J67966K25484j2398J16349K47955
3950.6F33091867M9233r0003m3749N3882J58727K02775P0632n3108j6570M1068N3703
3973.1F33518457Q9586R3162K1816J8775O8247J9372m8876J5080J03951Q2612M1842
$$ plain form
3995.5 634024024 634069264
3997.5 634069264
$$ packed form
3995.5F34024024M5240
3997.5F34069264
##END=$$ End of the data block
