##TITLE=DI 14-1194686-5 Instant gum AB $$ Begin of the data block
##JCAMP-DX=5.00 $$ ACD/SpecManager v 10.08
##SPECTROMETER/DATA SYSTEM=Alpha
##DATE=09 Jul 2014 10:22:58
##DATA TYPE=INFRARED SPECTRUM
##DATA CLASS=XYDATA
##ORIGIN=
##OWNER=
##NPOINTS=1765
##FIRSTX=399.75695801
##LASTX=3997.56933594
##MAXX=3997.56933594
##MINX=399.75695801
##MAXY=0.78461570
##MINY=0.36875916
##XFACTOR=1.0000000000
##YFACTOR=1.000000000000000e-9
##FIRSTY=0.53638101
##DELTAX=2.03957629
##XUNITS=1/CM
##YUNITS=ARBITRARY UNITS
##XYDATA=(X++(Y..Y))
399.8 536381006 535628140 535085559 534989297 534868240 533768356 532417953 532453120 533349991 533013225 531641066
420.2 531641066 531223059 530643761 528939664 527549863 527319670 526894808 525676966 524983943 524934590
438.5 524934590 524182498 522941947 522702992 522928178 522160530 521241069 521374345 521640301 520939708 520073414
458.9 520073414 519996226 519685447 518443823 517425954 517329395 517091513 516170919 515722752 516049981 516093791
479.3 516093791 515710950 515718579 516079664 516069412 515792072 515922785 516159117 515617490 514765859 514599979
499.7 514599979 514671445 514079690 513277411 512995183 512743056 511840343 510774434 510182798 509613395 508566439
520.1 508566439 507648826 507309198 506896734 506020010 505360782 505284667 505135715 504464805 503894806 503747582
540.5 503747582 503304660 502403319 501846552 501838207 501815856 501776516 502268016 503235877 503992558 504299581
560.9 504299581 504605114 505095303 505410969 505445480 505537987 505809963 505920410 505751967 505680263 505733311
581.3 505733311 505526364 505168736 505067647 504959464 504426479 503749490 503293157 502830982 502133310 501648068
601.7 501648068 501787245 502266288 502716362 503249586 504008055 504685998 505053759 505455971 506229579 507179856
622.1 507179856 508103848 509139776 510325789 511390746 512240171 513041258 513879538 514707923 515516460
640.4 515516460 516449332 517549157 518553555 519306660 519985497 520635188 521020472 521156371 521298766
658.8 521298766 521478951 521705925 522212744 523208320 524321914 525156915 526284933 527766764 529220343
677.1 529220343 530447423 531403601 532074213 532418787 532506406 532529354 532584965 532678008 532831967 533048928
697.5 533048928 533328176 533687413 534115851 534494698 534782052 535200119 535940588 536905468 538040876 539578140
717.9 539578140 541590869 543804049 546118498 548726797 551532209 554158807 556498647 558778107
734.2 558778107 561064959 563090026 564821005 566590667 568460405 570072532 571405351 572848856
750.6 572848856 574396253 575621665 576441288 577145934 577664495 577602744 576962113 576060236 574910462
768.9 574910462 573496878 572374523 572202265 572898805 574026227 575576961 577594638 579503059 580740809
787.3 580740809 581616819 582534969 583170295 583139360 582699060 582256079 581777453 581253707 581267357 582298994
807.7 582298994 584080279 586450160 589943171 594943702 601044297 607686222 614562929 620933652
824 620933652 625577271 628001094 628772318 628430545 627226174 625945449 625774026 627112687 629473209
842.3 629473209 632465959 636004746 639544487 642160058 643632770 644439042 644679308 644042134 642684937
860.7 642684937 641096711 639308333 637047768 634457052 631993473 629721463 627377689 625098884
877 625098884 623357475 622234046 621518552 621326864 621901929 622960985 623863161 624341309 624488413 624179900
897.4 624179900 623182595 621610343 619706273 617397845 614543021 611609101 609452784 608375967 608010530
915.8 608010530 607866883 607436717 606038749 603112936 598665118 593066156 586466670 578797340 570305705
934.1 570305705 561564684 552906752 544399738 536243677 528664947 521517932 514379323 507064402
950.4 507064402 499724597 492442995 485175610 478208899 472122937 467087388 462784111 459094435
966.8 459094435 456178755 453920245 451996922 450433105 449543297 449343264 449457020 449581236 449511290
985.1 449511290 448727727 446619749 443210721 439004630 434267402 429096371 423905820 419177532 414869577
1003.5 414869577 410675079 406664759 403062373 399722308 396465927 393560022 391358793 389758497
1019.8 389758497 388433456 387309790 386440367 385686368 384952843 384579509 384952486 385917157 387075216
1038.1 387075216 388344467 389654040 390625089 391030759 391081452 390990347 390627116 389886260 389042795 388342023
1058.5 388342023 387600422 386704743 385909408 385340512 384784311 384151012 383736908 383771122 384149551 384832680
1078.9 384832680 386043549 387839586 389942527 392156333 394618601 397394955 400233448 403010666
1095.2 403010666 405895799 408928722 411857247 414574981 417281568 420033723 422618747 424996614
1111.6 424996614 427379787 429808259 432070196 434060693 435876101 437535793 438929528 440097183
1127.9 440097183 441341728 442780703 444133192 445200205 446037054 446689337 447129011 447429150 447863460
1146.2 447863460 448719025 450062633 451819777 453955263 456454724 459206492 462074757 465094328
1162.6 465094328 468387216 471910506 475524515 479318023 483545393 488247067 493272364 498717278
1178.9 498717278 504862428 511616528 518583894 525616527 532715440 539474070 545292914 550082803
1195.2 550082803 554129660 557438552 559873879 561717272 563392162 564806998 565643907 566064715 566384315
1213.5 566384315 566403389 565853715 565074921 564490676 563931286 563177228 562591374 562539220 562778592 563021958
1233.9 563021958 563530743 564560950 565764725 566793799 567847013 569027603 569891751 570144296 570150495
1252.3 570150495 570243895 570182264 569861054 569763184 570159733 570636332 570839643 570951402 570997715 570503235
1272.7 570503235 569308281 567895710 566579044 565186143 563771069 562819481 562495828 562398553 562300682
1291 562300682 562452435 562895536 563244879 563376725 563583076 563909173 564008951 563813388 563745797 564004302
1311.4 564004302 564330161 564684927 565371156 566323042 566984594 567110837 566996038 566779673 566203594 565289140
1331.8 565289140 564498663 563984275 563391864 562605321 561990201 561536849 560796022 559705853 558689296
1350.2 558689296 557875931 556934178 555842578 554983854 554365814 553602755 552784383 552331328 552149057
1368.5 552149057 551893175 551520407 551304221 551245213 550823390 549806774 548790872 548469424 548700094
1386.9 548700094 548957884 549212694 549303472 548746347 547628164 546308815 544842839 542982042 540634751
1405.3 540634751 538404763 536401391 534173310 531979501 530377448 529077470 527606070 526630878
1421.6 526630878 526551664 526964486 527495861 528247356 529561400 531238854 532971978 534844041 536907673
1439.9 536907673 538983524 540655971 541927874 543110788 544107258 544758499 545421839 546680570 548577726
1458.3 548577726 550459027 552550614 555482388 558949649 562228739 565796018 570572197 575800240
1474.6 575800240 580536067 585200787 590204120 595304787 599974930 604558051 609575391 614510894
1490.9 614510894 618456364 622062266 626092851 629834116 632747293 635243654 637965381 640990973
1507.2 640990973 643226326 645031214 646913648 648621678 650043309 651424050 653030038 654446900
1523.6 654446900 655435979 656375587 657429039 658332109 658823550 659299493 659998775 660483003 660437286 660540462
1543.9 660540462 660833538 660890937 660549998 660176098 659971297 659595788 658145487 655748904 654079795
1562.3 654079795 652062953 649110734 645192325 640194178 635122120 629071772 620369911 611625433
1578.6 611625433 603449225 594297051 584727705 575331748 566049814 557051361 548835874 541512787
1594.9 541512787 535007358 529409707 524846137 521273315 518504679 516454995 515202403 514714658
1611.3 514714658 514652729 514757991 515124679 515871286 516645968 517296314 517956495 518598378 519097328 519621134
1631.6 519621134 520361602 521254420 522123814 523024261 524169326 525508046 526949346 528589249 530298650
1650 530298650 532207072 534537017 536719501 538914382 541345954 543939352 546659052 549408197 552447617
1668.4 552447617 555807829 559014380 562525511 566475332 570157290 573653340 577620327 582654297
1684.7 582654297 587330222 591430306 595844090 600163698 604668260 609480560 614284754 619562209
1701 619562209 624069512 628000498 632122993 635961354 639399409 642596126 645738304 649007022 652072966
1719.3 652072966 654762924 657393217 660018921 662454486 664795756 667122483 669633746 672188878
1735.7 672188878 674482107 676871359 679358900 681719720 684048474 686440170 688862562 691211522
1752 691211522 693386257 695524931 697643340 699549377 701390505 703283012 705058157 706622601 708066106
1770.3 708066106 709573627 711125553 712531507 713832796 715173602 716518283 717719138 718855739
1786.7 718855739 720040262 721145570 722158372 723235011 724378347 725444078 726393819 727377057 728435934
1805 728435934 729431570 730285466 731133997 732085049 733008146 733788550 734568596 735444367 736271858 737000763
1825.4 737000763 737760723 738562465 739340782 740092933 740841627 741622984 742372870 743001878 743591487 744306266
1845.8 744306266 745032370 745652020 746271431 746922195 747512102 748029649 748586833 749199510 749767601 750234962
1866.2 750234962 750668764 751193345 751758277 752270043 752763867 753269017 753712058 754101038 754544795 755037010
1886.6 755037010 755450249 755814612 756260514 756727159 757135034 757513642 757919788 758335173 758697271 759003401
1907 759003401 759316385 759667635 759996414 760267854 760505259 760769427 761042237 761287153 761560798 761840820
1927.4 761840820 762043238 762188494 762347817 762515366 762661219 762778938 762870550 762964010 763055563 763119578
1947.8 763119578 763223290 763370931 763456345 763487816 763546586 763632834 763687372 763702333 763723969 763768554 763790190
1970.2 763790190 763788998 763821185 763873816 763912976 763962805 764061213 764158309 764191628 764193654 764207482 764223993 764240384
1994.7 764240384 764265180 764301538 764330029 764305174 764247298 764196217 764138937 764058471 763981938 763926864 763862014
2017.1 763862014 763766110 763658762 763569117 763463140 763308823 763142824 762995601 762833953 762636423 762426198
2037.5 762426198 762220740 762008309 761799634 761643291 761516035 761368573 761215687 761097908 761014462 760934293
2057.9 760934293 760845721 760768175 760694563 760580003 760453939 760369837 760306418 760227561 760142028 760065913 759982646
2080.3 759982646 759870350 759752572 759650528 759536266 759396255 759243608 759114444 759015620 758906543 758790970
2100.7 758790970 758710504 758647621 758553028 758447409 758384824 758366346 758350968 758335173 758342743 758355260 758346736 758352995
2125.2 758352995 758396089 758440495 758478820 758514464 758553863 758618295 758701921 758786917 758884072 758998454 759103298
2147.7 759103298 759213984 759378910 759570777 759731650 759895980 760114729 760345340 760531902 760724843 760988653
2168 760988653 761266291 761500299 761756003 762072444 762370110 762624562 762917936 763262153 763580978 763870001
2188.4 763870001 764210105 764599144 764931023 765191913 765488863 765852988 766200542 766503096 766840696 767226696
2208.8 767226696 767548621 767794549 768103659 768498480 768853903 769141138 769449115 769800305 770113409 770379484
2229.2 770379484 770692706 771049023 771350980 771617949 771947742 772297978 772552311 772769153 773102105 773480296
2249.6 773480296 773744226 773965478 774272203 774608493 774881601 775145531 775467932 775765002 775943100 776110709
2270 776110709 776410520 776717842 776872277 776991129 777221441 777465940 777600765 777727187 777961731 778188229
2290.4 778188229 778306842 778448820 778717458 778991342 779153764 779324770 779616117 779899418 780087769 780312717
2310.8 780312717 780626655 780885160 781056404 781319439 781717181 782016993 782128990 782291412 782644808 782926321
2331.2 782926321 782942533 782957613 783129632 783223391 783114970 782945931 782677412 782357216 782349348 782833099
2351.6 782833099 783574700 784149647 784433365 784568310 784615695 784440339 784030378 783557415 783081353 782525003
2372 782525003 781949520 781514466 781176507 780774474 780371130 780153930 780052364 779863894 779628396 779506803
2392.4 779506803 779440522 779259384 779011667 778842509 778693080 778435469 778142214 777956545 777810752 777547419
2412.8 777547419 777221978 776980877 776764035 776424706 776022375 775707543 775430441 775061309 774660826 774345696
2433.2 774345696 774037659 773607612 773139596 772794425 772504091 772096515 771638274 771276653 770916224 770424247
2453.6 770424247 769917428 769541442 769190490 768714130 768203497 767803609 767431557 766953707 766456783 766079962
2474 766079962 765708506 765194535 764675736 764286578 763888478 763362646 762845337 762450993 762030244 761474609
2494.4 761474609 760967493 760624111 760239720 759681523 759143412 758750498 758346617 757854760 757403374 757029057
2514.8 757029057 756595254 756065726 755587459 755235136 754889071 754456401 754039168 753714263 753361464 752908707
2535.2 752908707 752509356 752237260 751916170 751469672 751067460 750781655 750453591 750018895 749624193 749319136
2555.6 749319136 748962879 748525143 748146057 747837067 747433245 746921182 746487260 746148407 745717704 745163262
2576 745163262 744657576 744237185 743754387 743184984 742646337 742141902 741554916 740902781 740320206 739759088
2596.4 739759088 739051938 738242984 737524033 736903191 736199856 735388339 734612465 733858049 732994616 732057452
2616.8 732057452 731187999 730362594 729429007 728407204 727435470 726463199 725373387 724242687 723207593
2635.1 723207593 722223997 721142590 719977438 718863368 717781305 716612756 715409458 714308619
2651.4 714308619 713276267 712176800 711020947 709940732 708907604 707789779 706659377 705646276
2667.7 705646276 704676032 703642428 702607095 701669276 700758457 699757755 698746383 697848082 697005391
2686.1 697005391 696126461 695248663 694432616 693648458 692819297 691978872 691225827 690514266 689751923 688976109
2706.5 688976109 688250422 687530875 686757088 685995638 685316026 684634686 683882952 683128357 682429016 681741118
2726.9 681741118 681004882 680272877 679616690 678993404 678323984 677619755 676956534 676313460 675607622 674865067
2747.3 674865067 674166739 673494160 672771513 671992660 671200991 670376658 669491053 668609798 667786539 666966558
2767.7 666966558 666065753 665103316 664161384 663197935 662134051 661029696 659960210 658906341 657817841
2786 657817841 656685531 655548871 654409170 653217077 651987851 650776863 649523318 648161590 646763921
2804.4 646763921 645387650 643992603 642517507 640973091 639443040 637916327 636291444 634582162
2820.7 634582162 632867813 631121695 629286885 627407372 625539780 623642743 621680796 619706810
2837 619706810 617726743 615631938 613401413 611145854 608909726 606648803 604345441 602044165 599781394
2855.4 599781394 597512245 595153868 592709184 590240777 587721944 585110247 582506061 580016732
2871.7 580016732 577612996 575281799 573161185 571364284 569786072 568288684 566918314 565720320
2888 565720320 564606369 563548982 562620461 561805367 560996056 560161412 559345722 558531404 557665348 556739330
2908.4 556739330 555785358 554803908 553711236 552516699 551385105 550422370 549613297 548932970 548445880
2926.8 548445880 548191428 548074305 548096120 548446536 549250782 550460756 552019358 553954303 556241035
2945.1 556241035 558696687 561189532 563801467 566531539 569196582 571741581 574253023 576711714
2961.4 576711714 578952074 580864787 582496583 583933949 585247397 586490452 587699056 588932395
2977.8 588932395 590186000 591340065 592396617 593467236 594523847 595528424 596463025 597179353 597612739
2996.1 597612739 597821891 597825944 597656250 597327113 596839428 596268952 595649362 594856083 593774259 592473090
3016.5 592473090 591074765 589594722 588052988 586502075 584921479 583304465 581689954 580107987
3032.8 580107987 578471363 576679885 574899375 573254645 571581244 569745660 567821026 565960407
3049.1 565960407 564160109 562310576 560444117 558605671 556770027 554955363 553171813 551404178
3065.5 551404178 549592674 547686815 545767128 543961704 542333782 540780127 539086342 537234247
3081.8 537234247 535367727 533526838 531727970 529969811 528156459 526293457 524513364 522863269
3098.1 522863269 521221161 519483328 517740726 516119480 514539838 512842119 511163056 509701312
3114.4 509701312 508285820 506702304 504925847 503037453 501241386 499631524 498090774 496493906
3130.7 496493906 494847566 493265539 491802365 490398347 488908559 487281799 485648602 484120876
3147 484120876 482735872 481434822 480025738 478454590 476912469 475476533 474052012 472607255 471181482
3165.4 471181482 469794750 468425781 467081636 465795040 464505941 463152736 461808115 460516930
3181.7 460516930 459230959 457944363 456710160 455525398 454304695 453042090 451813459 450605512
3198 450605512 449377209 448181212 447056264 445959687 444829583 443676710 442566574 441493154 440410525
3216.4 440410525 439325958 438278615 437260628 436236113 435202152 434208274 433324605 432498127 431577921
3234.7 431577921 430570126 429603726 428703040 427852780 427064598 426287293 425444573 424578965 423796177
3253.1 423796177 423088789 422356188 421574891 420810819 420083106 419376135 418734193 418189228 417622954 416929513
3273.5 416929513 416172832 415427119 414693028 413979262 413331062 412739784 412164897 411617935 411063343 410433143
3293.9 410433143 409725368 408965200 408246011 407662839 407169342 406619012 405893505 405009091 404094964 403276414
3314.3 403276414 402533472 401788771 401066095 400380939 399675161 398861647 397947550 397066295 396281451 395585656
3334.7 395585656 394940853 394212753 393350542 392462879 391598105 390775740 390065283 389365554 388510197 387580454
3355.1 387580454 386741161 386003733 385291308 384593606 384002775 383473068 382782221 381872714 380954593 380206108
3375.5 380206108 379568815 378908634 378206432 377554506 376995534 376551062 376255512 375893235 375236392 374523461
3395.9 374523461 374122024 373919636 373475760 372749329 372141659 371787667 371502072 371171772 370778084 370398581
3416.3 370398581 370119125 369854271 369569838 369373232 369301885 369322240 369352400 369402319 369505286 369478405
3436.6 369478405 369199485 368877828 368759155 368841499 368967026 369039863 369133234 369292229 369492620 369783670
3457 369783670 370164096 370467216 370727420 371211141 371845007 372232974 372286588 372364014 372666091 373158604
3477.4 373158604 373711228 374083459 374391794 374881208 375381917 375791550 376284808 376906306 377579153 378214538
3497.8 378214538 378831714 379449427 379934222 380328774 380813181 381472737 382335484 383178353 383792073 384372085
3518.2 384372085 385155380 386122137 387014091 387691498 388356596 389209479 390228003 391326964 392363191
3536.6 392363191 393281758 394330710 395595431 396832883 397846878 398806870 399900407 401048124 402230293
3554.9 402230293 403521717 404935479 406378508 407704204 408954084 410429269 412179172 413889676
3571.3 413889676 415481627 417127818 418920726 420854390 422864765 424863875 426783830 428626478
3587.6 428626478 430614650 432754159 434915572 437146485 439522028 441944897 444328129 446716666
3603.9 446716666 449075133 451451957 453978986 456633002 459347188 462052673 464819908 467825323
3620.2 467825323 470819116 473598182 476248950 479052573 482262909 485521019 488680780 491772413
3636.5 491772413 494825721 497929484 501080751 504138350 507112741 510378957 513908386 517152607
3652.8 517152607 520215392 523568094 527040303 530167341 532989979 535753965 538449109 541078985
3669.2 541078985 543877244 546599865 549069226 551625311 554232001 556716383 559080303 561340153
3685.5 561340153 563523650 565408289 567051768 568801284 570592344 572273076 573773026 575176597
3701.8 575176597 576746583 578423083 579868197 580980062 582048595 583432198 584909439 586206079
3718.1 586206079 587331891 588369906 589341879 590293109 591386974 592500091 593416095 594179332 595070064
3736.5 595070064 596198857 597251773 597821474 598135173 599025071 599972010 600468636 601249516 602440298
3754.8 602440298 603441119 604128599 604867160 605688989 606336892 606924534 607559264 608243287 609033763
3773.2 609033763 609813690 610478342 611021221 611575305 612150908 612696409 613328874 614004374 614604354 615120232
3793.6 615120232 615566492 616049230 616415560 616628647 617217004 617854416 618267655 618853569 619510889 619870007
3814 619870007 619995296 620417535 620857120 621162891 621730208 622286201 622727811 623119414 623518407 624059439
3834.4 624059439 624445081 624524057 624758124 625248075 625796437 626331091 626810551 627023757 626619697 626440287
3854.8 626440287 627219439 628064036 628551841 628719509 628865123 629218578 629456103 629609823 629927397 630314887
3875.2 630314887 630727887 630908668 630987644 631266594 631464183 631676137 631953478 632075369 632291555 632685244
3895.5 632685244 632920563 632895648 632816255 632829487 633073986 633497834 633815348 633969009 634078026 634133458
3915.9 634133458 634140491 634229898 634378612 634463787 634553552 634700835 634776533 634822130 634982944 635149539 635226250
3938.4 635226250 635259807 635261714 635323465 635485232 635606349 635642767 635684371 635747612 635806620 635881603 635959148
3960.8 635959148 636040866 636161625 636276841 636335850 636371315 636405051 636429608 636471331 636531293 636644065 636811614
3983.2 636811614 636903167 636891067 636889935 636928201 636954606 637003183 637124658
3997.5 637124658
##END=$$ End of the data block
