##TITLE=DI 14-1194686-5 Fibre gum C $$ Begin of the data block
##JCAMP-DX=5.00 $$ ACD/SpecManager v 10.08
##SPECTROMETER/DATA SYSTEM=Alpha
##DATE=09 Jul 2014 10:22:58
##DATA TYPE=INFRARED SPECTRUM
##DATA CLASS=XYDATA
##ORIGIN=
##OWNER=
##NPOINTS=1765
##FIRSTX=399.75695801
##LASTX=3997.56933594
##MAXX=3997.56933594
##MINX=399.75695801
##MAXY=0.79278308
##MINY=0.39833423
##XFACTOR=1.0000000000
##YFACTOR=1.000000000000000e-9
##FIRSTY=0.55041355
##DELTAX=2.03957629
##XUNITS=1/CM
##YUNITS=ARBITRARY UNITS
##XYDATA=(X++(Y..Y))
399.8E50413549O62923J01507p64192K46466M68492j35660N12123K5749j540065m61399
$$ 550413549 551076472 551177979 550413787 550660253 551128745 550993085 551505208 551530957 549990892 549529493
420.2E49529493K62439n49734K55645K39014j187861m92990L44933q93891o66678L02553
$$ 549529493 549791932 549242198 549497843 549736857 548548996 548056006 548400939 547507048 546840370 547142923
440.5E47142923m88103o0141J025200r0778l85820P18951Q2969k97069R27329K90334
$$ 547142923 546654820 546594679 547619879 547529101 547143281 547862232 547945201 547648132 548575461 548865795
460.9E48865795m99308N03480J59979q38935J05560L84927k84613O79017R32455k81215
$$ 548865795 548366487 548869967 549029946 548191011 548296571 548681498 548396885 549075902 550008357 549727142
481.3E49727142J40190O63698m45009q3446O96897n62906o35683L79681o86049j070321
$$ 549727142 549867332 550531030 550086021 550002575 550699472 550136566 549500883 549880564 549194515 548124194
501.7E48124194K98917l29971j031041J16527l38674j277685j06990K6882j057864
$$ 548124194 548423111 548093140 547062099 547178626 546839952 545562267 545455277 545482159 544424295
520.1E44424295k93850j02461j246929l38733O04927n21779m48882M29213n02706o56664
$$ 544424295 544130445 544027984 542781055 542442322 543047249 542525470 542076588 542505801 542003095 541346431
540.5E41346431N34653J2458m65810O64651N71310M6194R83357Q54612j26541O05703
$$ 541346431 541881084 541893542 541427732 542092383 542663693 542709887 543693244 544547856 544421315 545027018
560.9E45027018Q51631j79112K90036R30488R4473J85490P78914m5836j70052O95526
$$ 545027018 545878649 545699537 545989573 546920061 547014534 547200024 547978938 547933102 547763050 548458576
581.3E48458576J27495l97027L40343m9949p68125L1531P8737o69419j848L67105m67241
$$ 548458576 548586071 548189044 548529387 548479438 547711313 547742844 547821581 547152162 547150314 547517419 547050178
603.7E47050178j25706M50015k78592j56999P10845K87056L00586J538694J533151
$$ 547050178 546924472 547374487 547095895 546938896 547649741 547936797 548237383 549776077 551309228
622.1E51309228J179576J972139J927435J230598J716494J842141J079560J412153
$$ 551309228 552488804 554460943 556388378 557618976 559335470 561177611 562257171 563669324
638.4E63669324J822352R96054R21726J491546Q75354O54638J396477J014054M98235
$$ 563669324 565491676 566487730 567409456 568901002 569776356 570430994 571827471 572841525 573339760
656.7E73339760J179517J148104N86689Q13246M29868J92344J963556K269507J219094
$$ 573339760 574519277 575667381 576254070 577067316 577497184 577689528 579653084 581922591 583141685
675.1E83141685J089215J627505J156568R01878J340449P95901J98841O49154M03702
$$ 583141685 584230900 585858405 587014973 587916851 589257300 590053201 590252042 590901196 591304898
693.5E91304898l26931L7610J62483n59688l44873J78516k32517p5639P30098O43968
$$ 591304898 590977967 591015577 591178060 590618372 590273499 590452015 590219498 590143859 590873957 591517925
713.8E91517925P16746J699805K074182K229512L164172L382922K726495K808094K760470
$$ 591517925 592234671 593934476 596008658 598238170 601402342 604785264 607511759 610319853 613080323
732.2F13080323J780390J488030J600206Q42393N44071J015425N89788N7578L97205
$$ 613080323 614860713 616348743 617948949 618791342 619335413 620350838 620940626 620998204 621395409
750.6F21395409J24276o06120m46319n58138j400769j391232j127303j635372j501561
$$ 621395409 621519685 620913565 620467246 619909108 618508339 617117107 615989804 614354432 612852871
768.9F12852871n60581j73807M11450J649321K067744K088011K781808K906203K381563
$$ 612852871 612292290 612118483 612529933 614179254 616246998 618335009 621116817 624023020 626404583
787.3F26404583K723158K996683K337277K186298K127528R87113K66731L93450n066
$$ 626404583 629127741 632124424 634461701 636647999 638775527 639762640 640029371 640422821 640417755
805.6F40417755p5937R62437J615166K002537L265739M027784L672361L590644L079176
$$ 640417755 640341818 641304255 642919421 644921958 648187697 652215481 655887842 659478486 662557662
824F62557662J256644l02493j370669k894461l528952k655387j760900n03898J702487
$$ 662557662 663814306 663511813 662141144 659246683 655717731 653062344 651301444 650797546 652500033
842.3F52500033L049970L159583L310680K797365J351595N98371K04802q40307j348018
$$ 652500033 655550003 658709586 662020266 664817631 666169226 666767597 666972399 666132092 664784074
860.7F64784074j273990j962483k552211k370775k763688l317714k876401k591431
$$ 664784074 663510084 661547601 658995390 656624615 653860927 650543213 647666812 645075381
877F45075381k741277k098799j381755j288593p52330k08020o90043j097202j003742
$$ 645075381 642334104 640235305 638853550 637564957 636812627 636604607 635914564 634817362 633813620
895.4F33813620j428962j751602j301944j176894j245022n38408K5868j7405K65718
$$ 633813620 632384658 630633056 629331112 628154218 626909196 626370788 626396656 626379251 626644969
913.7F26644969L07620n72086j301527j819312k914370l679394l725231m185021m677236
$$ 626644969 626952589 626380503 625078976 623259664 620345294 616665900 612940669 608755648 604078412
932.1F04078412m479945m654228n224049n069673m819513m998088m684150m174411
$$ 604078412 599598467 594944239 589720190 584650517 579831004 574832916 570148766 565974355
948.4E65974355m248619m231632m025340m336059m561305m217625m056454l915965
$$ 565974355 561725736 557494104 553468764 549132705 544571400 540353775 536297321 532381356
964.7E32381356l249586k809644k786517k447664k182067k387345k325117k037466
$$ 532381356 529131770 526322126 523535609 521087945 518905878 516518533 514193416 512155950
981E12155950k141833k152086j833319j841366j956165j737357j732409j939624j773089
$$ 512155950 510014117 507862031 506028712 504187346 502231181 500493824 498761415 496821791 495048702
999.4D95048702j641959j834870j772970j585662j673847j546383j128346r94831q91835
$$ 495048702 493406743 491571873 489798903 488213241 486539394 484993011 483864665 482869834 481977999
1017.7D81977999n44965m61310n86301m88639m45068n51134m17531k71112l95387m11332
$$ 481977999 481433034 480971724 480385423 479896784 479451716 478900582 478483051 478211939 477816552 477405220
1038.1D77405220l36557n28753o35892m86285n25504n99742m10199l41267m21404k58565
$$ 477405220 477068663 476539910 475904018 475417733 474892229 474292487 473882288 473541021 473119617 472861052
1058.5D72861052r5129j68831j28746J7286l5882R53K73675M03375N09351Q60632J173883
$$ 472861052 472765923 472597092 472468346 472485632 472449750 472450703 472724378 473127753 473637104 474497736 475671619
1081D75671619J340926J610130J808315J817584J980693K203822K230763K318621K485275
$$ 475671619 477012545 478622675 480430990 482248574 484229267 486433089 488663852 490982473 493467748
1099.3D93467748K396226K183944K047807J771152J372337J121164R08077O70135O38723
$$ 493467748 495863974 498047918 500095725 501866877 503239214 504360378 505268455 505938590 506577313
1117.7E06577313O98566O63340P33376Q74221Q13544P39038P15554M14073k4199k56121
$$ 506577313 507275879 507939219 508672595 509546816 510360360 511099398 511814952 512229025 512204826 511948705
1138.1E11948705l89278m58598k38896J23024M07040P69377J200676J470983J699150
$$ 511948705 511559427 511100829 510861933 510984957 511391997 512161374 513362050 514833033 516532183
1156.4E16532183K034664K262354K384901K641320K873600K959370L170490L470838
$$ 516532183 518566847 520829201 523214102 525855422 528729022 531688392 534858882 538329720
1172.7E38329720L626347L840208M210651M475832M719496N038976N138517N029917
$$ 538329720 541956067 545796275 550006926 554482758 559202254 564241230 569379747 574409664
1189.1E74409664M889190M526675L947436L452778K935052K258957J741171J430928
$$ 574409664 579298854 583825529 587772965 591225743 594160795 596419752 598160923 599591851
1205.4E99591851J045585P23302O25909M65452K62797K58506K23636P2599Q0943J03116
$$ 599591851 600637436 601360738 601986647 602452099 602714896 602973402 603197038 603269637 603350580 603453696
1225.8F03453696n6684j22607j03533k60830l54052k52306k87295l43144j56939n5909
$$ 603453696 603397012 603274405 603170872 602910042 602555990 602303684 602016389 601673245 601516306 601460397
1246.2F01460397j23739j2636J09196M2200J13189K96473L60966N72026R27925J005769
$$ 601460397 601336658 601324022 601433218 601475418 601588607 601885080 602246046 602818072 603745997 604751766
1266.6F04751766R57310J079976J043320P83086O56247M99666J87516N8115j1146l02315
$$ 604751766 605709076 606789052 607832372 608615458 609271705 609771371 609958887 610017002 610005856 609703541
1287F09703541m71950m27186n53429o43671m19021k54392k15769l4034K7299j31011
$$ 609703541 609231591 608804405 608250976 607607305 607188284 606933892 606718123 606684089 606711388 606580377
1307.4F06580377j03295j6570j22965p6353J22905J30057J32680K16365L1650k49803
$$ 606580377 606477082 606460512 606337547 606261194 606384099 606514156 606646836 606863201 606894851 606645048
1327.8F06645048k70665l78013p25507q93832r18507q48413m14312j03354k37823k64167
$$ 606645048 606374383 605996370 605270863 604377031 603458524 602610111 602195799 602092445 601854622 601590455
1348.1F01590455m0830p2002k51651k02358l57925r17376j115679p40767p00772q72135
$$ 601590455 601549625 601477623 601225972 601023614 600665689 599748313 598632634 597891867 597191095 596318960
1368.5E96318960q03947r51767q40068j20401P8499j80245q5473K30790N37276Q81851
$$ 596318960 595515013 594563246 593723178 593602777 593681276 593501031 593415558 593646348 594183624 595065475
1388.9E95065475O48438l13103r06288p35760p61449p78854q77560j304805j318455
$$ 595065475 595713913 595400810 594494522 593758762 592997313 592218459 591340899 590036094 588717639
1407.3E88717639j143872j297772j396001j265704j463056j490772m98890O4671J8715
$$ 588717639 587573767 586275995 584879994 583614290 582151234 580660462 580161572 580226243 580244958
1425.7E80244958N9247K29001N17011N92828N56230J092196J588821J538575J174390
$$ 580244958 580304205 580533206 581050217 581643045 582199275 583291471 584880292 586418867 587593257
1444E87593257O64533O15537R72509Q28922L49581M3333J048863K474844K462447K078175
$$ 587593257 588257790 588873327 589845836 590674758 591024339 591067672 592116535 594591379 597053826 599132001
1464.4E99132001K354920K738595K458632K530158L655791M372120M130066L888070
$$ 599132001 601486921 604225516 606684148 609214306 612870097 617242217 621372283 625260353
1480.7F25260353L940702L510713K933145L154337L955782L827273L125251K871930
$$ 625260353 629201055 632711768 635644913 638799250 642755032 646582305 649707556 652579486
1497F52579486L104389L186822K458990R61005R05931K947510K997636K072692J411021
$$ 652579486 655683875 658870697 661329687 662290692 663196623 666144133 669141769 671214461 672625482
1515.4F72625482J235664J114428J238763J766861J712501J630783J493454N93603
$$ 672625482 673861146 674975574 676214337 677981198 679693699 681324482 682817936 683411539
1531.7F83411539J73568P17223r3758j705289o91593O98567M97281q1479q39293j346648
$$ 683411539 683585107 684302330 684208572 682503283 681811690 682510257 683007538 682926059 682086766 680740118
1552.1F80740118j544535j981020l563523k704144k06590j093328k464890l454864
$$ 680740118 679195583 677214563 673651040 670946896 670740306 669646978 667182088 663727224
1568.4F63727224m109085l566563m404008o558717n863785m995942n894185o667137
$$ 663727224 659618139 656051576 651647568 645088851 639225066 634229124 628334939 621667802
1584.7F21667802o769001o590068o521881o291688n799830n301773m845739m339098
$$ 621667802 614898801 608308733 601786852 595495164 589695334 584393561 579547822 575208724
1601.1E75208724l897608l520787l060221k625644k268374k002240k285063k249956
$$ 575208724 571311116 567790329 564730108 562104464 559836090 557833850 555548787 553298831
1617.4E53298831p05600p9214l85523j71125K05636M68612P47859Q10623J330495K610266
$$ 553298831 552593231 552514017 552128494 551957369 552163005 552631617 553379476 554190099 555520594 558130860
1637.8E58130860L111184K986371K450467K275288L431082L549039K765775M086136
$$ 558130860 561242044 564228415 566678882 568954170 572385252 575934291 578700066 582786202
1654.1E82786202M936040M023909L487528L561675L776491L394008L001988L318429
$$ 582786202 587722242 591746151 595233679 598795354 602571845 605965853 608967841 612286270
1670.4F12286270L604352L689528L873646L603220L096044K579391L219187M399717
$$ 612286270 615890622 619580150 623453796 627057016 630153060 632732451 635951638 640351355
1686.7F40351355M070759L461361K823651K237260J977324K054871K845406K940416
$$ 640351355 644422114 647883475 650707126 652944386 654921710 656976581 659821987 662762403
1703F62762403K119363K080142K053678J300395O47724J60694J05083J481235K236187
$$ 662762403 664881766 666961908 669015586 670315981 670963705 671124399 671229482 672710717 674946904
1721.4F74946904J641572J365006J547992J388132R94802J266062K478838K551019
$$ 674946904 676588476 677953482 679501474 680889606 681884408 683150470 685629308 688180327
1737.7F88180327K221346K374769K298653K194106K268076K385855L003597L256262
$$ 688180327 690401673 692776442 695075095 697269201 699537277 701923132 704926729 708182991
1754G08182991K612531K167642K160489K143264K117455J925767J451611Q33690J031280
$$ 708182991 710795522 712963164 715123653 717266917 719384372 721310139 722761750 723595440 724626720
1772.4G24626720K043724J994967J444400J393199J302063J112581J343727J132309
$$ 724626720 726670444 728665411 730109811 731503010 732805073 733917654 735261381 736393690
1788.7G36393690L32415O41227J523375J246870Q46922R95636J123488J156807J100362
$$ 736393690 736726105 737367332 738890707 740137577 740984499 741980135 743103623 744260430 745360792
1807G45360792O60896N58436J088262J043260O22153P94768Q05259K66194L22044O30498
$$ 745360792 746021688 746580124 747668386 748711646 749333799 750128567 750933826 751200020 751522064 752152562
1827.4G52152562L52144P19190J236081P24971L91186O75499L33548k34962M89891
$$ 752152562 752504706 753223896 754459977 755184948 755576134 756251633 756585181 756350219 756840110
1845.8G56840110J079142P14123O42359O90699M02689L74377N87702M16517K14517
$$ 756840110 757919252 758633375 759275734 759966433 760369122 760743499 761331201 761747718 761962235
1864.2G61962235J24872n4121M14014J093685Q32081K89381L95298N31792K54750K71857
$$ 761962235 762087107 762032986 762447000 763540685 764372766 764662147 765057445 765589237 765843987 766115844
1884.6G66115844L91484N5015J49011N93841L59059J81436M71294L96371J14977K61486
$$ 766115844 766507328 766562343 766711354 767305195 767664254 767845690 768316984 768713355 768828332 769089818
1904.9G69089818L12150O3538K47598M83513J00612j44660K36094K67148J13070M23372
$$ 769089818 769401968 769465506 769713104 770196617 770297229 770152569 770388663 770655811 770768881 771192253
1925.3G71192253M03523Q8990J67906K15113K5988J06215J20521k12669p6116L47615
$$ 771192253 771595776 771684766 771852672 772067785 772093773 772199988 772320509 772107840 772031724 772379339
1945.7G72379339K27809P4148K05815J11162m1902J00792J15096m3273J1683K0087
$$ 772379339 772607148 772681296 772887111 772998273 772956371 773057163 773172259 773128986 773140669 773160756
1966.1G73160756q0645Q1837K12669R775o4254J10567N0962o7353O5267N2273j34766
$$ 773160756 773080111 773161948 773374617 773384392 773320138 773430705 773481667 773414314 773479581 773531854 773397088
1988.6G73397088j04070L2127O0022J03116J26243k5332r6262o318q7023j61767j9311
$$ 773397088 773293018 773325145 773385167 773488283 773614526 773589194 773492932 773486614 773399591 773237824 773218513
2011G73218513k8491k12133j54198j3470q7619r4891m0233j49846j78277o7830j18077
$$ 773218513 773190022 772977889 772823691 772810221 772722602 772627711 772587478 772437632 772259355 772191525 772073448
2033.4G72073448j83106q5056r9003j78516p6651l9459j48475q3148J8119o0975n9962
$$ 772073448 771890342 771805286 771706283 771527767 771451116 771411657 771263182 771180034 771198153 771137178 771077216
2055.9G71077216K8908k4080o9082M470K2948J6332Q0168P8857O854M1843R5546N5611
$$ 771077216 771106124 771082044 771012962 771017432 771040380 771056712 771136880 771215737 771222591 771264434 771359980 771415591
2080.3G71415591P1705J26361P4685L6597J08064J13785N9247P9989P6831J0490L0041
$$ 771415591 771487296 771613657 771688342 771724939 771833003 771946788 772006035 772086024 772162855 772173345 772203386
2102.8G72203386Q1003K3186O675P4149O2287M4763Q7797N6088O676O2525R4354M5359
$$ 772203386 772284389 772307575 772314250 772388399 772450686 772495449 772583246 772639334 772646010 772708535 772802889 772848248
2127.3G72848248N5850Q7976O6221Q7083J04904O3360P3254J35541J36733J17957J55986
$$ 772848248 772904098 772992074 773058295 773145378 773250282 773313642 773386896 773522437 773659170 773777127 773933113
2149.7G73933113J55568J31488J93297K44976K00092J95206K47478K26617J99973K58625
$$ 773933113 774088681 774220169 774413466 774658442 774858534 775053740 775301218 775527835 775727808 775986433
2170.1G75986433K99335K76923K80618K84136K63512K91765L17752K81334K60293K82765
$$ 775986433 776285768 776562691 776843309 777127445 777390957 777682722 778000474 778281808 778542101 778824866
2190.5G78824866K88009K89739L21984L09408K63214K84910L02434K56836K48492K94149
$$ 778824866 779112875 779402614 779724598 780034006 780297220 780582130 780884564 781141400 781389892 781684041
2210.9G81684041L09885L03924L10242K81334K53796K83242L11851L17693L33488L15428
$$ 781684041 781993926 782297850 782608092 782889426 783143222 783426464 783738315 784056008 784389496 784704924
2231.3G84704924K58326K60294K98142K74897K37286K52127K49684K25842K59698K79128
$$ 784704924 784963250 785223544 785521686 785796583 786033869 786285996 786535680 786761522 787021220 787300348
2251.7G87300348K27571J98126K05338K02536K17438K19762J70470J54614K14517K37763
$$ 787300348 787527919 787726045 787931383 788133919 788351357 788571119 788741589 788896203 789110720 789348483
2272.1G89348483K04980K19048K43306K25663K19405J84893O9380M411L1888K4498
$$ 789348483 789553463 789772511 790015817 790241480 790460885 790645778 790715158 790719569 790751457 790775955
2292.5G90775955o974k325j8954o7830q2374j31189k51830k88308k39372k35081k57194
$$ 790775955 790768981 790766656 790747702 790679872 790597498 790466309 790214479 789926171 789686799 789451718 789194524
2314.9G89194524l60906n79178o68943n08309l51548m01258m37141k96294j78874j88053
$$ 789194524 788833618 788254440 787585497 787077188 786725640 786324382 785887241 785590947 785412073 785224020
2335.3G85224020k31623k85864k28047J07169Q03172J239539N86032p45535j716971
$$ 785224020 784992397 784706533 784478486 784585655 785388827 786628366 787214398 786468863 784751892
2353.6G84751892j648605j048565m87566M1068M66049O80565R41515J215756J246095
$$ 784751892 783103287 782054722 781567156 781608224 782074273 782754838 783696353 784912109 786158204
2372G86158204J195312J205384J141668J038611R25421O57678L18170J33156R478j57357
$$ 786158204 787353516 788558900 789700568 790739179 791664600 792322278 792640448 792773604 792783082 792625725
2392.4G92625725j67250p5281j39892j83702r6202j52885k53976j71065j38283k35915
$$ 792625725 792458475 792383194 792243302 792059600 791963398 791810513 791556537 791385472 791247189 791011274
2412.8G91011274k28584j96040k80738k95817k22743k52426k86161k36333k83956l55483
$$ 791011274 790782690 790586650 790305912 790010095 789787352 789534926 789248765 789012432 788728476 788372993
2433.2G88372993k86757k83719l71515l20614k89380m01259l95715l07024l58998l95000
$$ 788372993 788086236 787802517 787431002 787110388 786821008 786419749 786024034 785717010 785358012 784963012
2453.6G84963012l10660l33011m11153l56197l71397m64081l89934l41356m45604m24862
$$ 784963012 784652352 784319341 783908188 783551991 783180594 782716513 782326579 781985223 781539619 781114757
2474G81114757l49760m16577m21345l44277m12464m66823l56972l52502m25458l57151
$$ 781114757 780764997 780348420 779927075 779582798 779170334 778703511 778346539 777994037 777568579 777211428
2494.4G77211428l57151m69804m16398l19720l86714m04239l28839l74496m06980l15011
$$ 777211428 776854277 776384473 775968075 775648355 775261641 774857402 774528563 774154067 773747087 773432076
2514.8G73432076l48449m19080l24249l21448m29928l75748l01838l66867l47137k79486
$$ 773432076 773083627 772664547 772340298 772018850 771588922 771213174 770911336 770544469 770197332 769917846
2535.2G69917846l67999l92914k90275l31819l75748k56896k78413m18663l57687k77818
$$ 769917846 769549847 769156933 768866658 768534839 768159091 767902195 767623782 767205119 766847432 766569614
2555.6G66569614l62932l39926k55763l60131l88742k72810l34144m21166l45111l76702
$$ 766569614 766206682 765866756 765610993 765250862 764862120 764589310 764255166 763834000 763488889 763112187
2576G63112187m70996l78191l32594m48823m40299l91126n11646n38707m24028m76360
$$ 763112187 762641191 762263000 761930406 761481583 761041284 760650158 760138512 759599805 759175777 758699417
2596.4G58699417n58972m83513n15700o18159n37277n02884o12974n98848n68211o91116
$$ 758699417 758140445 757656932 757141232 756523073 755985796 755482912 754869938 754271090 753702879 753011763
2616.8G53011763p19547o41644o99699p35641o50167p15911q29757p55727p50005q54731
$$ 753011763 752292216 751650572 750950873 750215232 749565065 748849154 748019397 747263670 746513665 745658934
2637.1G45658934p97748p62046r04023r19343q20040q64387q88288q07047q63731r34541
$$ 745658934 744861186 744099140 743195117 742275774 741455734 740591347 739703059 738896012 738032281 737097740
2657.5G37097740q03411p44760q21769p56204p02143p95543p68602o97076p80821p62284
$$ 737097740 736294329 735549569 734727800 733971596 733269453 732473910 731705308 731008232 730227411 729465127
2677.9G29465127o24478o66261p38442o49690o17683o50287n62489n38468o46889o09458
$$ 729465127 728840649 728174388 727435946 726786256 726168573 725518286 724955797 724417329 723770440 723160982
2698.3G23160982n11944n71311n90026n12719n58079o08325n13076m96447n64397n05566
$$ 723160982 722649038 722077727 721487701 720974982 720416903 719808578 719295502 718799055 718234658 717729092
2718.7G17729092m79043n73873n43297m59671n15461n17785m47512n01513n27263m32968
$$ 717729092 717250049 716676176 716132879 715673208 715157747 714639962 714192450 713690937 713163674 712730706
2739.1G12730706m34518n01335m45723m26531n51641n74708n06163n42223n58675n12540
$$ 712730706 712296188 711794853 711349130 710922599 710370958 709796250 709290087 708747864 708189189 707676649
2759.5G07676649n77569o50644n99861n95212o62208o49035o62267p87258q27968p86245
$$ 707676649 707099080 706448436 705848575 705253363 704591155 703942120 703279853 702492595 701664627 700878382
2779.9G00878382q11518q06868p63535q27968r04560q93176r31799r89497r54688r88543
$$ 700878382 700066864 699259996 698496461 697668493 696763933 695870757 694938958 693949461 692994773 692006230
2800.3F92006230j102149j101613j080036j159788j199960j197577j312136j403571
$$ 692006230 690904081 689802468 688722432 687562644 686362684 685165107 683852971 682449400
2816.6F82449400j343786j371980j505733j540005j575947j688778j701236j651048
$$ 682449400 681105614 679733634 678227901 676687896 675111949 673423171 671721935 670070887
2832.9F70070887j682043j693488j686036j767457j781702j689195j722813j819909
$$ 670070887 668388844 666695356 665009320 663241863 661460161 659770966 658048153 656228244
2849.3F56228244j787245j743734j788020j795232j788497j896620j985669j965583
$$ 656228244 654440999 652697265 650909245 649114013 647325516 645428896 643443227 641477644
2865.6F41477644j981973j961291j798153j711965j708388j530528j322389j260221
$$ 641477644 639495671 637534380 635736227 634024262 632315874 630785346 629462957 628202736
2881.9F28202736j133442r83297r73404r13501p73847p42018p69138p55251p40647
$$ 628202736 627069294 626085997 625112593 624199092 623425245 622683227 621914089 621158838 620418191
2900.2F20418191p27654o94632p29442q10802p69853p17402q57174r85325r31918q54075
$$ 620418191 619690537 618995905 618266463 617455661 616685808 615968406 615111232 614125907 613193989 612339914
2920.6F12339914p27892m82738k74778j32143K3425J95384M01497O84976J004100J300752
$$ 612339914 611612022 611129284 610854506 610722363 610745788 610941172 611342669 612027645 613031745 614332497
2941F14332497J595676J800537J825333J895964K143025K245546K182662K268315K363026
$$ 614332497 615928173 617728710 619554043 621450007 623593032 625838578 628021240 630289555 632652581
2959.4F32652581K306580K276838K240837K055704J904011J904249J824737J666009
$$ 632652581 634959161 637235999 639476836 641532540 643436551 645340800 647165537 648831546
2975.7F48831546J670957J643419J420140J291514J238465J129627J150191J109064
$$ 648831546 650502503 652145922 653566062 654857576 656096041 657225668 658375859 659484923
2992F59484923P91907N80132M87626K25961M3094M1604m1306j39952j21951k63035
$$ 659484923 660276830 660856962 661344588 661570549 661613643 661655247 661613941 661473989 661352038 661089003
3012.4F61089003o11007p85291q18253r31024r49085r19521j059949j104534r64165
$$ 661089003 660477996 659692705 658874452 657943428 656994343 656074822 655014873 653910339 652946174
3030.8F52946174r56714j110554j192331j156926j138389j148999j241803j395583
$$ 652946174 651989460 650878906 649686575 648529649 647391260 646242261 645000458 643604875
3047.1F43604875j343668j249432j365841j405239j346827j395285j369297j224101
$$ 643604875 642261207 641011775 639645934 638240695 636893868 635498583 634129286 632905185
3063.4F32905185j197278j323343j415431j429856j392066j206398j084924j295746
$$ 632905185 631707907 630384564 628969133 627539277 626147211 624940813 623855889 622560143
3079.7F22560143j469492j379848j378477j425206j354099j446962j592100j433789
$$ 622560143 621090651 619710803 618332326 616907120 615553021 614106059 612513959 611080170
3096F11080170j231850j285016j389742j385033j314581j223266j254320j317739j188338
$$ 611080170 609848320 608563304 607173562 605788529 604473948 603250682 601996362 600678623 599490285
3114.4E99490285j089156j265228j534938j615584j500607j345753j232028j280308
$$ 599490285 598401129 597135901 595600963 593985379 592484772 591139019 589906991 588626683
3130.7E88626683j426578j350820j139045j153886j339674j430154j419961j325131
$$ 588626683 587200105 585849285 584710240 583556354 582216680 580786526 579366565 578041434
3147E78041434j121640j051783j245857j439512j465320j410365j319766j255334j285135
$$ 578041434 576919794 575868011 574622154 573182642 571717322 570306957 568987191 567731857 566446722
3165.4E66446722j298845j268387j288891j298666j268208j302421j320303j269459
$$ 566446722 565147877 563879490 562590599 561291933 560023725 558721304 557401001 556131542
3181.7E56131542j306594j366436j282692j230180j322449j347839j322687j377881
$$ 556131542 554824948 553458512 552175820 550945640 549623191 548275352 546952665 545574784
3198E45574784j358032j244187j229167j256824j255512j291573j291752j212239j171649
$$ 545574784 544216752 542972565 541743398 540486574 539231062 537939489 536647737 535435498 534263849
3216.4E34263849j216650j230180j224339j284540j266181j150370j071572j025617
$$ 534263849 533047199 531817019 530592680 529308140 528041959 526891589 525820017 524794400
3232.7E24794400j106262j272798j267016j140714j081705j043916r91523j036644
$$ 524794400 523688138 522415340 521148324 520007610 518925905 517881989 516890466 515853822
3249E15853822j074672r50574q33631q72970r14275q69930q72552q71540p43269o36340
$$ 515853822 514779150 513828576 512994945 512121975 511207700 510337770 509465218 508593678 507850409 507214069
3269.4E07214069p34269q99613r65834r69887q91924q22663q66175q81016q36402q30650
$$ 507214069 506479800 505580187 504614353 503644466 502752542 501929879 501063704 500182688 499346286 498515636
3289.8D98515636q81076r70513j080394j167148j133412r94861r06676j025319j337767
$$ 498515636 497634560 496664047 495583653 494416505 493283093 492288232 491381556 490356237 489018470
3308.2D89018470j565158j543433j444787j447767j459837j437187j461506j477003
$$ 489018470 487453312 485909879 484465092 483017325 481557488 480120301 478658795 477181792
3324.5D77181792j561880j749068j847178j814664j703083j599520j684130j907438
$$ 477181792 475619912 473870844 472023666 470209002 468505919 466906399 465222269 463314831
3340.8D63314831k031415k049119k004862j914769j990199k231419k339840k221435
$$ 463314831 461283416 459234297 457229435 455314666 453324467 451093048 448753208 446531773
3357.1D46531773k072692k089978k145528k008289j875282k041161k322972k327293
$$ 446531773 444459081 442369103 440223575 438215286 436340004 434298843 431975871 429648578
3373.4D29648578k086371j893312j794278j776100j753926j594275j319647j063406
$$ 429648578 427562207 425668895 423874617 422098517 420344591 418750316 417430669 416367263
3389.7D16367263j109779j402736j432687j080602q43674j086682j387567j267731
$$ 416367263 415257484 413854748 412422061 411341459 410497785 409411103 408023536 406755805
3406.1D06755805j017004r25839r00805r31680r51767q22604o85394o15328m73053
$$ 406755805 405738801 404812962 403912157 402980477 402028710 401206106 400520712 399905384 399432331
3424.4C99432331k75761j44332j47373r0509N3107l4362k50369k08497P4655K90632
$$ 399432331 399156570 399012238 398864865 398774356 398827463 398793101 398542732 398334235 398408890 398699522
3444.8C98699522L37899L68833M72129N80877O87152Q20964R06766Q05855P59870J019835
$$ 398699522 399037421 399406254 399878383 400459260 401146412 401967376 402874142 403679997 404439867 405459702
3465.2D05459702J209945R80764O17147N93274Q35509J076072J082808Q50409Q76308
$$ 405459702 406669647 407650411 408267558 408860832 409696341 410772413 411855221 412705630 413581938
3483.6D13581938J126468J098484R83983J105070J246303J276016J235933J193225
$$ 413581938 414708406 415806890 416790873 417895943 419142246 420418262 421654195 422847420
3499.9D22847420J126647J029879J072705J208603J357794J547158J512169J273573
$$ 422847420 423974067 425003946 426076651 427285254 428643048 430190206 431702375 432975948
3516.2D32975948J269251J491874J653225J556813J353920J399606J671493J873702
$$ 432975948 434245199 435737073 437390298 438947111 440301031 441700637 443372130 445245832
3532.5D45245832J937419J869142J755864J844525J952231J827449J669794J795352
$$ 445245832 447183251 449052393 450808257 452652782 454605013 456432462 458102256 459897608
3548.8D59897608J969724J999528K039402K099097K174765K199769K008438J719177
$$ 459897608 461867332 463866860 465906262 468005359 470180124 472379893 474388331 476107508
3565.1D76107508K010822K840102L092855K816320K685457K787411K953917L062278
$$ 476107508 478118330 480958432 484051287 486867607 489553064 492340475 495294392 498356670
3581.5D98356670K977580K659798K555549L188133L519714L239751L243685L562152
$$ 498356670 501334250 503994048 506549597 509737730 513257444 516497195 519740880 523303032
3597.8E23303032L598928L545523L549278L241837L009260L292620L591597L674805
$$ 523303032 526901960 530447483 533996761 537238598 540247858 543540478 547132075 550806880
3614.1E50806880L573775L359855L651082M028201L702223K849341K381146L511905
$$ 550806880 554380655 557740510 561391592 565419793 569122016 571971357 574352503 577864408
3630.4E77864408M322708L990233L635228L446579L311932L177464K775431K065956
$$ 577864408 582187116 586177349 589812577 593259156 596571088 599748552 602523983 604589939
3646.7F04589939K041996L456950M171431L531515L208399L447593L150105K664805
$$ 604589939 606631935 610088885 614260316 617791831 621000230 624447823 627597928 630262733
3663F30262733K481281K001345J361192J787424K000630J357376K204418L189028K939820
$$ 630262733 632744014 634745359 636106551 637893975 639894605 641251981 643456399 646645427 649585247
3681.4F49585247K515852J984597J180649R03487J832664K499342K263725J706719
$$ 649585247 652101099 654085696 655266345 656169832 658002496 660501838 662765563 664472282
3697.7F64472282J107991Q71300J372159J602888R66132K02834M86851J751721J992106
$$ 664472282 665580273 666451573 667823732 669426620 670392752 670595586 671082437 672834158 674826264
3716.1F74826264J206756N62131M57347N79417Q22246J200914Q88884n8234l36706
$$ 674826264 676033020 676595151 677052498 677631915 678454161 679655075 680543959 680485725 680149019
3734.4F80149019P05004J789331J602232J72735p26819N99563Q29279l0041R60052
$$ 680149019 680854023 682643354 684245586 684418321 683691502 684291065 685120344 685090303 686050355
3752.8F86050355J920999J343548O35564Q31902R84311N25534K93732L18587O56545
$$ 686050355 687971354 689314902 689950466 690782368 691766679 692292213 692585945 692904532 693561077
3771.1F93561077J125932R39071L18706P331L79503N72086M60922O59108P48039N50389
$$ 693561077 694687009 695626080 695944786 695952117 696331620 696903706 697364628 698023736 698771775 699322164
3791.5F99322164K14875j30952n3584k17200l70442O16431P70211N29885J114548J013279
$$ 699322164 699537039 699406087 699352503 699135303 698764861 699381292 700151503 700681388 701795936 702809215
3811.9G02809215k9326o82413j61350j37925J03652J122892J033008N91159L05712
$$ 702809215 702779889 702097476 701936126 701798201 701901853 703024745 704057753 704648912 704954624
3830.3G04954624P2479Q9407l36468o44326K53081J008749J118303J023292N37157
$$ 704954624 705027103 705116510 704780042 704135716 704388797 705397546 706515849 707539141 708076298
3848.6G08076298o32226k028048o51956J768053J599371M69327l16620j34885L04758
$$ 708076298 707444072 705416024 704764068 706532121 708131492 708600819 708284199 708149314 708454072
3867G08454072j35660j83463N66721R21488P54178j4365k15054K44618J34825L32952
$$ 708454072 708318412 708134949 708701670 709623158 710377336 710362971 710147917 710392535 710527360 710860312
3887.4G10860312L54767j04487L15726O83129j6034p31886o55233j05322P25746J173795
$$ 710860312 711215079 711110592 711426318 712109447 712093413 711361527 710706294 710600972 711326718 712500513
3907.8G12500513Q16524L12268l9279l42131k57671J44005J78397k8730J31608K80678
$$ 712500513 713317037 713629305 713590026 713247895 712990224 713134229 713312626 713283896 713415504 713696182
3928.2G13696182k1041r8824L05831M18783J38044j25706k03193L2425J67549J4126
$$ 713696182 713675141 713576317 713882148 714300931 714438975 714313269 714110076 714142501 714310050 714324176
3948.6G14324176M4048J82510J82688J34766R7334M1426M5239J19806R4473K3842L9339
$$ 714324176 714368224 714550734 714733422 714868188 714965522 715006948 715052187 715171993 715266466 715290308 715329647
3971G15329647Q2016P2837O0499P6770J08481J37150P8380k7835m9234J9491Q1301
$$ 715329647 715411663 715484500 715544999 715621769 715730250 715867400 715945780 715917945 715868711 715888202 715969503
3993.4G15969503R6023Q9526
$$ 715969503 716065526 716155052
3997.5G16155052
$$ 716155052
##END=$$ End of the data block
