##TITLE=DI 14-1141526-6 Instant gum BB $$ Begin of the data block
##JCAMP-DX=5.00 $$ ACD/SpecManager v 10.08
##SPECTROMETER/DATA SYSTEM=Alpha
##DATE=09 Jul 2014 10:22:58
##DATA TYPE=INFRARED SPECTRUM
##DATA CLASS=XYDATA
##ORIGIN=
##OWNER=
##NPOINTS=1765
##FIRSTX=399.75695801
##LASTX=3997.56933594
##MAXX=3997.56933594
##MINX=399.75695801
##MAXY=0.80149919
##MINY=0.34442702
##XFACTOR=1.0000000000
##YFACTOR=1.000000000000000e-9
##FIRSTY=0.53210270
##DELTAX=2.03957629
##XUNITS=1/CM
##YUNITS=ARBITRARY UNITS
##XYDATA=(X++(Y..Y))
399.8 532102704 530273378 529988408 529865205 528626382 528112352 528276086 527566195 527139664 527474999
418.1 527474999 526456356 524999917 524610162 523833394 522630453 522458136 522289574 521298349 521072388
436.5 521072388 521288157 520644009 520422995 520844400 520166159 519365251 519809783 520025074 519820094 520542204
456.9 520542204 520861566 520220816 520506561 521104038 520582259 520285070 520833552 520607054 520182014 520747304
477.3 520747304 520914972 520522356 521001935 521364868 520723581 520677626 521124780 520459354 519529343 519338369
497.7 519338369 518717051 517651439 517388284 517021239 515773177 515064359 514860690 513897955 512964249
516 512964249 512635469 511678576 510390997 509835362 509064376 507841647 507524729 507423282 506397843 505689442
536.4 505689442 505776107 505290568 504576862 504631519 504507720 503989279 504328966 505017400 505109072 505593121
556.8 505593121 506612659 506920457 507025480 507810295 508173585 507993460 508543074 509190857 509076238 509250879
577.2 509250879 509841263 509661973 509375095 509770393 509681225 509009004 508851528 508594930 507676125 507240832
597.6 507240832 507232368 506622791 506163776 506411970 506167531 505531013 505663931 505928040 505770445 506430745
618 506430745 508023441 509440601 511182189 513638079 515597224 517106056 519273341 521362603 522735476
636.3 522735476 524549484 526755691 528188109 529446959 531236112 532511711 533251166 534595788 535935342
654.7 535935342 536595523 537705839 539201915 539900422 540312111 541400433 542933822 544464767 546527028
673.1 546527028 548528075 549837112 551482797 553482711 554678500 555586338 556898534 557594895 557517469
691.4 557517469 557706654 557701647 556856811 556258440 556136787 555454433 554722846 554780424 554808795 554721773 555666208
713.8 555666208 557293773 558894932 561524332 565464735 569329202 573141932 577513695 581372678
730.2 581372678 584207535 587014258 589518964 590881944 592048049 593511045 594227910 594447613 595114470
748.5 595114470 595426619 594888389 594490588 594028890 592555404 590780616 589237630 587002814 584412098
766.9 584412098 582755744 581724167 581049681 581860125 584041536 586369336 589227557 593048930 596621156
785.2 596621156 599766374 603516400 607250929 610150039 612996638 615630507 616814792 617061079 617353141
803.6 617353141 617170453 616807520 617725432 619796872 622380137 626335382 631579995 636474311 640791833
821.9 640791833 644721746 646674752 645978630 643909514 640593946 635919333 631838202 629739463 629229426
840.3 629229426 630730510 634682238 639312863 643133104 646516442 648959517 649517477 649231076 648808420
858.7 648808420 647297323 644966245 642826557 640149951 636480212 632928550 629478335 625395000
875 625395000 621580839 618687630 615890980 613408744 612195313 611517012 610506296 609710097 608914316
893.3 608914316 607201099 605152190 603497028 601653218 599701345 598583639 598013103 597489774 597721636
911.7 597721636 598602474 598859489 598367572 597387433 595039666 591193974 586847961 581950605 576130509
930 576130509 570173979 564342260 557866633 550912380 544132292 537226260 530164063 523706675 517747581
948.4 517747581 511628807 505578399 499756277 493533850 486926645 480639279 474645823 468815088
964.7 468815088 463700265 459341615 455182105 451287955 447819054 444292814 440641522 437351972
981 437351972 434277982 431059092 428001493 425201297 422243893 419252843 416558951 413827479 410873383
999.4 410873383 408094436 405460536 402639836 399896622 397509396 395238817 393154770 391617864
1015.7 391617864 390398234 389174581 388201207 387457967 386522144 385566831 384928644 384309411 383557260
1034.1 383557260 383001924 382521182 381767869 380953491 380241245 379365772 378418595 377715111 377041161 376246661
1054.5 376246661 375678837 375361055 374972939 374675751 374662459 374640703 374609619 374906182 375439823 376076460
1074.8 376076460 377137542 378673226 380389094 382407129 384911478 387575924 390285850 393373370
1091.2 393373370 396727085 400032580 403514683 407255977 410808682 414083183 417237371 419938833
1107.5 419938833 421954453 423621237 425048798 426057756 426956087 428067923 429170012 430249393
1123.8 430249393 431579798 432928354 433978379 434841990 435381293 435229897 434634209 434075803 433547050
1142.2 433547050 433151305 433370680 434259862 435566127 437443316 439976096 442826957 445970803 449623495
1160.5 449623495 453550011 457558364 461936831 466700971 471564680 476704001 482349932 488242477
1176.8 488242477 494373024 501103759 508270681 515491784 522864223 530252099 537053585 543162644
1193.1 543162644 548721731 553370059 556951642 559870720 562155128 563628197 564681947 565583766
1209.5 565583766 566086948 566285372 566526711 566644788 566481829 566387236 566399038 566181839 565870106 565665781
1229.9 565665781 565287054 564686775 564182639 563699961 563083231 562629342 562428594 562200844 562007248 562048018
1250.3 562048018 562114418 562102675 562317491 562801778 563385546 564260542 565533578 566898346 568266213
1268.6 568266213 569734156 571060240 572039127 572833121 573458791 573690951 573624134 573479831 573109269
1287 573109269 572427332 571679175 570907533 570030749 569296241 568879545 568582296 568336070 568242252 568139851
1307.4 568139851 567895174 567708433 567650437 567578554 567567825 567701459 567778349 567690909 567542911 567270756
1327.8 567270756 566693366 565920949 565127492 564231873 563207746 562191725 561260700 560490966 560058415
1346.1 560058415 559929371 559804380 559610784 559412897 559024215 558378339 557628751 556568444 555076182
1364.5 555076182 553604841 552332938 551190555 550260484 549628675 549256921 549045444 548947692 549070477
1382.8 549070477 549635828 550638974 551534355 551886797 551744521 551194072 550212979 548657298 546916902
1401.2 546916902 545317471 543403447 541236818 539291024 537437320 535633445 534287989 533254743
1417.5 533254743 531914949 530791044 530363977 530255139 530442894 531132936 532171130 533383012 534988761
1435.9 534988761 536834657 538405955 540012062 541857481 543638229 545036852 546279728 547710955
1452.2 547710955 549407959 551594913 553916931 555776119 557976365 561220229 564899445 568425059
1468.5 568425059 572628558 578088045 583392262 588084638 592944086 598013520 603113413 608284056
1484.8 608284056 613716781 619136274 624064386 628313601 632463098 636869669 640919268 644262552
1501.1 644262552 647319734 651005805 655016422 657292902 659018338 661289930 663763583 666079044
1517.4 666079044 668269634 670318782 671766222 672998846 674237549 675246358 676273227 677213550
1533.7 677213550 677882075 678680956 679383516 678747356 677260935 675848246 674725592 673434377 671947777
1552.1 671947777 670738339 669835031 667681098 663220584 659739614 656715930 653371453 649410069
1568.4 649410069 644080281 638748944 633169830 625105083 616475284 608651400 600351095 591504157
1584.7 591504157 582548499 573826075 565416813 557408512 549947500 543197870 537199438 531939685
1601.1 531939685 527468562 523746908 520653486 518133759 516187370 514799237 513748944 512827814
1617.4 512827814 512513280 512905836 513662815 514374018 514961958 515745461 517154336 519430757 522462964
1635.7 522462964 525245547 527665198 530401409 533714831 537866652 542133033 545631289 549872160
1652 549872160 555074334 558699012 562079608 566168606 570722044 575233877 579443455 583949804 588766515
1670.4 588766515 593130887 597461939 601906061 606169462 610548854 615299225 620459139 624708116
1686.7 624708116 628235281 631928265 635705709 639749289 643645704 647000790 650084436 652380168
1703 652380168 654290736 656109989 657523155 658784509 660287976 661846399 662823856 663346350 664166033
1721.4 664166033 665240347 666601241 668496966 670799851 673183084 675743997 678114772 680138648
1737.7 680138648 682514846 685231984 687898695 690681934 693817377 696960986 699726164 702452242
1754 702452242 705436826 708322525 710956097 713571370 715821147 717822552 720072448 722371817 724137306
1772.4 724137306 725496411 726938486 728408575 729839563 731333017 732726276 733948231 735376775
1788.7 735376775 736962855 738161206 739118755 740322828 741549850 742565215 743565679 744554162 745461524
1807 745461524 746491551 747575164 748370886 749094188 750017464 750918448 751709342 752638102 753620744 754418612
1827.4 754418612 755120635 755738020 756229103 756748557 757460415 758232296 758953273 759678066 760254920 760596812
1847.8 760596812 760994375 761607409 762160420 762600362 763182044 763805091 764294326 764943182 765812695 766390383
1868.2 766390383 766616046 766975105 767412186 767747223 768215418 768770754 769141793 769524992 770109534 770568550
1888.6 770568550 770799279 771159828 771556437 771781206 772081792 772498906 772779107 773068726 773552775 773930967
1909 773930967 774088740 774360478 774770141 775030494 775242686 775563180 775746047 775821328 776052952 776279986
1929.4 776279986 776378632 776579499 776849508 776988626 777162254 777449548 777540803 777499199 777641058 777830720
1949.8 777830720 777872384 777949154 778112173 778146923 778163195 778346360 778511345 778536618 778596282 778682292 778651416
1972.3 778651416 778661311 778803408 778851926 778824627 778959513 779101312 779077291 779136777 779320061 779319227 779231369
1994.7 779231369 779290855 779304028 779225349 779270649 779321432 779203475 779130638 779164910 779076576 778944075 778951466
2017.1 778951466 778888166 778658092 778540671 778506458 778314471 778121889 778082311 777985036 777826071 777799189
2037.5 777799189 777762532 777581155 777476966 777472436 777334392 777187884 777204156 777186036 777083457 777105451 777181208
2060 777181208 777154744 777180135 777285576 777269542 777219534 777328014 777424932 777427137 777557433 777752280 777787089
2082.4 777787089 777817905 777977347 778054953 778070271 778227270 778376698 778368711 778408289 778546631 778587639 778587580
2104.8 778587580 778692245 778766930 778750598 778833270 778966725 778985023 779020905 779140174 779159725 779132903 779250562
2127.3 779250562 779378772 779406548 779510081 779685318 779737413 779769242 779929101 780062377 780145288 780341208
2147.7 780341208 780548930 780643106 780805469 781090260 781297624 781462491 781747937 782024682 782208741 782469392
2168 782469392 782799542 783057272 783328176 783702016 784020662 784263790 784600139 784949601 785186172 785483122
2188.4 785483122 785881877 786174476 786426246 786798179 787157059 787420809 787749112 788116038 788370430 788663030
2208.8 788663030 789095223 789452076 789709449 790047228 790377915 790609360 790930152 791348279 791657507 791931808
2229.2 791931808 792317092 792656302 792896211 793223321 793600976 793866873 794126630 794463694 794729590 794959903
2249.6 794959903 795304239 795609951 795764267 795988739 796308279 796506226 796668291 796958208 797224939 797403157
2270 797403157 797655165 797936738 798111379 798311174 798616707 798853576 799020886 799245298 799423635 799489498
2290.4 799489498 799623013 799836934 799941897 800004601 800165653 800283730 800283313 800368190 800525784 800534248 800513089
2312.9 800513089 800610662 800605357 800446510 800391436 800431132 800415814 800423563 800447762 800361454 800290048 800342798 800318003
2337.3 800318003 800167441 800101697 800106227 800191820 800489366 800723732 800597668 800234020 800002277 799894214
2357.7 799894214 799761534 799758136 799868345 799937427 800131321 800463676 800623238 800686002 800898254 801107109
2378.1 801107109 801202834 801347554 801499188 801457882 801340580 801312983 801218808 801019967 800926685 800848722 800591469
2400.6 800591469 800355136 800245821 800035357 799765885 799629927 799458981 799160719 798951745 798792601 798467338
2421 798467338 798087716 797808111 797492862 797147274 796936870 796700716 796281934 795897424 795606256 795200527
2441.3 795200527 794761539 794454813 794102907 793638766 793285489 792987466 792524993 792037725 791673839 791254520
2461.7 791254520 790769160 790404499 790036261 789525568 789074481 788717091 788241863 787744343 787384152 786975980
2482.1 786975980 786448121 786009550 785640597 785159051 784682989 784318030 783886790 783405900 783042312 782657862
2502.5 782657862 782141447 781689584 781332493 780892789 780450642 780132592 779753029 779265285 778882146 778540909
2522.9 778540909 778079271 777659714 777364612 776987970 776546955 776202679 775818467 775327981 774963319 774705231
2543.3 774705231 774322689 773915231 773606360 773208618 772739828 772429824 772151649 771737933 771349907 771015108
2563.7 771015108 770572364 770118058 769802272 769450903 768966258 768537760 768149614 767641246 767137170 766729891
2584.1 766729891 766221523 765607178 765093088 764599085 763994217 763433933 762934923 762298048 761618674 761070967
2604.5 761070967 760469437 759740055 759086430 758453846 757676423 756893635 756184697 755360723 754472554 753720999
2624.9 753720999 752949059 752007425 751080096 750214696 749256372 748282254 747393191 746428192 745383263
2643.3 745383263 744438171 743487000 742393494 741346002 740410447 739393115 738326192 737370431 736432374
2661.6 736432374 735442579 734526575 733634949 732644022 731698751 730887771 730046690 729150951 728325129 727514684
2682 727514684 726671576 725921512 725232303 724455833 723684549 723028362 722326636 721518695 720800638 720166028
2702.4 720166028 719463229 718768656 718157351 717503905 716793299 716156065 715552807 714882314 714230657 713629782
2722.8 713629782 712950528 712235570 711620510 711029649 710402310 709830821 709282398 708665967 708063245 707518339
2743.2 707518339 706928849 706303537 705736518 705158651 704491019 703817427 703146815 702397346 701625645 700900614
2763.6 700900614 700147867 699330628 698514640 697669387 696735740 695802391 694891274 693899393 692869306
2782 692869306 691880524 690840304 689711630 688603103 687504947 686302483 685028374 683765292 682455838
2800.3 682455838 681061506 679669797 678275049 676766157 675181985 673584998 671899974 670123696
2816.6 670123696 668323874 666454196 664471507 662446141 660354733 658112884 655813932 653555632
2832.9 653555632 651257515 648898959 646594703 644336462 642029762 639719188 637449205 635119855
2849.3 635119855 632712543 630329728 627923369 625396848 622812212 620165169 617369115 614527285
2865.6 614527285 611764848 609027505 606315792 603780091 601444840 599240065 597280025 595591068
2881.9 595591068 593971968 592429519 591095328 589869976 588661432 587558985 586522639 585434973
2898.2 585434973 584405422 583479643 582475841 581380367 580332279 579271913 578090131 576878071
2914.5 576878071 575710654 574542522 573462844 572617888 571959138 571492672 571342349 571407020 571594715
2932.9 571594715 572127581 573139846 574505985 576240838 578454137 581003010 583697259 586621344
2949.2 586621344 589836538 593153536 596512020 599984050 603468835 606859207 610150695 613258064
2965.5 613258064 616098523 618788183 621432245 623929501 626269877 628591418 630813241 632786214
2981.8 632786214 634624124 636421859 638091922 639661014 641118765 642252088 643090904 643814027 644339085
3000.2 644339085 644599676 644716859 644713640 644533575 644254327 643867254 643184364 642235875 641223013 640130758
3020.6 640130758 638920069 637702405 636458278 635104418 633726358 632386506 630920291 629282475
3036.9 629282475 627724767 626259208 624648571 622901440 621146560 619397521 617653608 615920246
3053.2 615920246 614136755 612285495 610454321 608645976 606825411 605078936 603349864 601426542
3069.5 601426542 599399924 597531676 595823824 594124615 592336535 590454519 588511169 586552739
3085.8 586552739 584658504 582765102 580759883 578760326 576871216 575042009 573214352 571314692
3102.2 571314692 569360912 567525387 565826952 564030766 562168777 560490549 558864236 557038546
3118.5 557038546 555037022 552996635 551015258 549140513 547354937 545530617 543621778 541805565
3134.8 541805565 540149629 538457572 536611080 534712493 532849550 531061053 529421389 527844131
3151.1 527844131 526100397 524202287 522343695 520538628 518779993 517103732 515412569 513653100
3167.4 513653100 511898637 510196090 508503318 506817400 505176544 503519714 501813531 500126958
3183.7 500126958 498453408 496759772 495117158 493532896 491911799 490251631 488616794 486979187
3200.1 486979187 485327512 483751744 482241750 480714053 479198396 477709562 476190209 474678397
3216.4 474678397 473235905 471799016 470304906 468818128 467381954 465968847 464611679 463327110
3232.7 463327110 461994082 460568875 459182024 457868308 456578225 455354303 454191446 452998102
3249 452998102 451792270 450646102 449542224 448447704 447394073 446397156 445410997 444437325 443538189
3267.4 443538189 442693025 441788524 440808743 439807713 438780278 437753320 436754256 435758829 434788674
3285.7 434788674 433880687 433010489 432090878 431058228 429926127 428725421 427571774 426565111 425601542
3304.1 425601542 424511403 423221201 421762317 420263708 418863058 417532772 416168481 414778769
3320.4 414778769 413413912 412020624 410491139 408868104 407273769 405708194 404164970 402656913
3336.7 402656913 401065469 399341077 397577047 395758420 393945873 392267793 390541434 388581008
3353 388581008 386552334 384646177 382835418 381026179 379216909 377477080 375785917 373988122 372001112
3371.4 372001112 370008647 368239880 366650403 365091532 363535553 362077773 360786706 359693766
3387.7 359693766 358799040 357849687 356636047 355426103 354558021 353848130 352862448 351651996 350619078
3406.1 350619078 349813610 349070668 348340869 347586542 346857280 346260369 345723778 345185220 344789356 344616264
3426.5 344616264 344566286 344507098 344483882 344574660 344610751 344487309 344427019 344623953 345016986 345437467 345788211
3448.9 345788211 346182585 346709371 347324312 348049760 348895043 349691421 350438923 351401597 352537572
3467.2 352537572 353445470 354003310 354571521 355396450 356448352 357534677 358448446 359325379 360364527
3485.6 360364527 361418009 362371504 363404393 364607751 365873665 367072701 368289858 369588643
3501.9 369588643 370745122 371766180 372952491 374383926 375945568 377431661 378723651 380040199
3518.2 380040199 381634086 383467376 385183990 386655271 388142288 389771253 391550332 393517464
3534.5 393517464 395510525 397404045 399449646 401703447 403854668 405735552 407620311 409732074
3550.9 409732074 411949724 414162099 416443318 418869615 421368212 423886359 426504761 429321855
3567.2 429321855 432171404 434891909 437619150 440541327 443668157 446954042 450381756 453879833
3583.5 453879833 457348257 460741758 464172304 467679411 471296966 475064784 478954285 482871711
3599.8 482871711 486772537 490674675 494573951 498579621 502678752 506769419 510861039 514893591
3616.1 514893591 518979251 523221374 527248919 531051934 534853637 538865924 543083608 547062397
3632.4 547062397 550908327 554720163 558468938 562239051 566062808 569951773 573959470 577995181
3648.8 577995181 581684649 584970832 588174403 591632009 595149755 598375618 601396382 604459584
3665.1 604459584 607532620 610485077 613443911 616209805 618558228 620753765 622967541 625255466
3681.4 625255466 627736330 630378842 633005619 635178089 636883914 638592660 640391707 642213285
3697.7 642213285 643971801 645549715 647071600 648727536 650408626 651793778 652822971 654003203
3714 654003203 655394495 656778574 658076882 659225821 660178363 661049247 662190795 663628697 665067196
3732.4 665067196 666124225 666812599 667646825 668703675 669507623 670029759 670985341 671953321 672356665
3750.7 672356665 672766328 673608601 674512029 675185978 675809681 676543891 677279115 677938819 678451777 678944588
3771.1 678944588 679607034 680407465 681226671 681844652 682318926 682835340 683364093 683901250 684461832 685082376
3791.5 685082376 685763359 686459720 687210858 687758923 688008189 688479543 688916266 689085662 689504802 690268755
3811.9 690268755 690967083 691452801 692030787 692359447 692415357 692770720 693237007 693690836 694205999 694802761
3832.3 694802761 695493639 695980132 696110547 696229696 696414948 696664214 697125018 697821915 698411584 698224604
3852.7 698224604 697870672 698330641 699001729 699546635 699890554 700150371 700502634 700751543 700937510 701133549
3873.1 701133549 701324105 701699018 702070057 702368677 702697456 702838004 702955544 703136325 703167856 703320265
3893.5 703320265 703799248 704333127 704637229 704623282 704404533 704313636 704469562 704692662 704961538 705260634
3913.9 705260634 705433488 705499768 705633879 705789447 705871344 705988288 706184626 706327200 706382990 706443667
3934.3 706443667 706509650 706615448 706795514 706931651 707028508 707134843 707183540 707216382 707293391 707394600
3954.7 707394600 707508147 707614243 707693100 707743287 707778335 707872868 708063900 708233953 708306253 708361924 708464265
3977.1 708464265 708576560 708696604 708810747 708837569 708812773 708844662 708945513 709075153 709213197 709328890
3997.5 709328890
##END=$$ End of the data block
