##TITLE=DI 14-1141526-6 Fibre gum B $$ Begin of the data block
##JCAMP-DX=5.00 $$ ACD/SpecManager v 10.08
##SPECTROMETER/DATA SYSTEM=Alpha
##DATE=09 Jul 2014 10:22:58
##DATA TYPE=INFRARED SPECTRUM
##DATA CLASS=XYDATA
##ORIGIN=
##OWNER=
##NPOINTS=1765
##FIRSTX=399.75695801
##LASTX=3997.56933594
##MAXX=3997.56933594
##MINX=399.75695801
##MAXY=0.78570431
##MINY=0.31237984
##XFACTOR=1.0000000000
##YFACTOR=1.000000000000000e-9
##FIRSTY=0.49700445
##DELTAX=2.03957629
##XUNITS=1/CM
##YUNITS=ARBITRARY UNITS
##XYDATA=(X++(Y..Y))
399.8D97004449m33057o92904n49615l25799k20954m10169k52337j13487r10371r62943
$$ 497004449 496571392 495878488 495328873 495003074 494782120 494371951 494119614 494006127 493095756 492132813
420.2D92132813k3961O1631j97381o30349p79599m96924n38081m01675j35869n41121
$$ 492132813 492108852 492170483 491973102 491342753 490563154 490066230 489528149 489126474 488990605 488449484
440.5D88449484o05762j44929j54793k5838J96456J81377K77222N6356L4094M40299
$$ 488449484 487843722 487698793 487544000 487518162 487714618 487895995 488173217 488229573 488263667 488703966
460.9D88703966J70857p1049J06931j50114k87146n5522J8627K87801L85553J63078
$$ 488703966 488874823 488803774 488910705 488760591 488473445 488417923 488436550 488724351 489109904 489272982
481.3D89272982K44886R9182j69635l4660k35170m00484k60860n92887o55890m38004
$$ 489272982 489517868 489617050 489447415 489412755 489177585 488777101 488516241 487923354 487267464 486829460
501.7D86829460p75576p43568m60565o75023p02589p67351j005917q01057p74324q75831
$$ 486829460 486053884 485310316 484849751 484174728 483472139 482704788 481698871 480897814 480123490 479247659
522.1D79247659o29186p12604p53551m06534m33624m09036k29121m70578m20958j99050
$$ 479247659 478618473 477905869 477152318 476745784 476312160 475903124 475674003 475203425 474782467 474583417
542.5D74583417l46750q2016K20359J28090M11510N88656M85778O62058N62489M35502
$$ 474583417 474236667 474154651 474375010 474503100 474914610 475503266 475989044 476651102 477213591 477649093
562.9D77649093O14851L77268K98262M68582J68830J76310M05222J79530J37090Q7530
$$ 477649093 478263944 478641212 478939474 479408056 479576886 479753196 480158418 480337948 480475038 480562568
583.3D80562568k56896k00451k65181n91695m44859m65900o32197l67105l09348l64601
$$ 480562568 480305672 480105221 479840040 479248345 478803486 478337586 477705389 477338284 477028936 476664335
603.7D76664335j81824k66523k70664o9470n4866K81305Q37713J135469J581221J910836
$$ 476664335 476482511 476215988 475945324 475875854 475820988 476102293 476940006 478075475 479656696 481567532
624.1D81567532J878232K072066K116173J865864J844585J756012J658678J799047
$$ 481567532 483445764 485517830 487634003 489499867 491344452 493100464 494759142 496558189
640.4D96558189J610399J376360J478881J359880J197755J127661R06407R53556J136302
$$ 496558189 498168588 499544948 501023829 502383709 503581464 504709125 505615532 506569088 507705390
658.8E07705390J020611J068473J116216Q83341J241326J649857J569211J756311J837790
$$ 507705390 508726001 509794474 510910690 511794031 513035357 514685214 516254425 518010736 519848526
677.1E19848526J672387J621127J414418J160860J066387O62744K67803J54973k11418
$$ 519848526 521520913 523142040 524556458 525717318 526783705 527446449 527714252 527869225 527657807
695.5E27657807n31018n38170o93441o53088l66092k91585m7446L96669P63476J401424
$$ 527657807 527126789 526588619 525895178 525242090 524875998 524584413 524536967 524933636 525697112 527098536
715.9E27098536K125502K702415L485859M080891M228831M246830L875733L221631
$$ 527098536 529224038 531926453 535412312 539493203 543722034 547968864 551844597 555066228
732.2E55066228K756715K228439J710593J453519J080096P69198O76453L91126R7692
$$ 555066228 557822943 560051382 561761975 563215494 564295590 565064788 565741241 566132367 566230059
750.6E66230059j05739n12958q48472j157641j644552j894772k080500k298594j958668
$$ 566230059 566124320 565611362 564762890 563605249 561960697 560065925 557985425 555686831 553728163
768.9E53728163j177549k54631Q97050J886248K609611L274739L553092L633678L789783
$$ 553728163 552550614 552295983 553193033 555079281 557688892 560963631 564516723 568150401 571940184
787.3E71940184L660977L471016L387928K969325K328455J540125N51462o2108j65462
$$ 571940184 575601161 579072177 582460105 585429430 587757885 589298010 589849472 589787364 589621902
805.6E89621902Q1539Q76784J961350L064633M244089N034327N180300M843831L694832
$$ 589621902 589703441 590580225 592541575 595606208 599850297 604884624 610064924 614908755 618603587
824F18603587J822472j77026k213597l831625m414320m041612k615512l43799J923322
$$ 618603587 620426059 620249033 618035436 614203811 609789491 605747879 603132367 602788568 604711890
842.3F04711890L730834M685282M484833L582120K367735J013159o0618q24868j472891
$$ 604711890 608442724 613128006 617612839 621194959 623562694 624575853 624515235 623690367 622217476
860.7F22217476j965761k452493k989947l405989l764092m008234m003942l877223
$$ 622217476 620251715 617799222 614809275 611403286 607639194 603630960 599627018 595749795
877E95749795l564179k950847k233088j481235q14497o08146p89583j130700j648486
$$ 595749795 592185616 589234769 587001681 585520446 584705949 584097803 583308220 582177520 580529034
895.4E80529034k033710k029181j883089j660467j261293p57278j33633M09841N41449
$$ 580529034 578495324 576466143 574583054 572922587 571661294 570904016 570770383 571180224 571721673
913.7E71721673L16560k97904j382887k578676l667772m601895n203724n601108n945802
$$ 571721673 572038233 571740329 570357442 567778766 564110994 559509099 554305375 548704267 542758465
932.1E42758465o212413o552279o923795p106543p146358o996036o605923o254941
$$ 542758465 536546052 529993773 523069978 515963435 508817077 501821041 495215118 488960177
948.4D88960177o045908n955845o081253o286592o399661o374717o076455n545437
$$ 488960177 482914269 476958424 470877171 464590579 458190918 451816201 445739746 440194309
964.7D40194309m979998m398823l894061l628462l497929l389924l330023l259837
$$ 440194309 435214311 430815488 426921427 423292965 419795036 416405112 413075089 409815252
981D09815252l148288l012985k850353k760709k738982k685636k680183k684683k601563
$$ 409815252 406666964 403653979 400803626 398042917 395303935 392618299 389938116 387253433 384651870
999.4C84651870k588094k625406k573370k511919k429366k228350j928836j572102
$$ 384651870 382063776 379438370 376865000 374353081 371923715 369695365 367766529 366194427
1015.7C66194427j238495j027286q74490p69794p67141p43449o66529o04182n33313
$$ 366194427 364955932 363928646 363054156 362284362 361517221 360773772 360107243 359503061 358969748
1034.1C58969748n09828o06805p18803q03351q85993r05156q72940q25584o98328n40227
$$ 358969748 358459920 357853115 357134312 356330961 355444968 354539812 353666872 352841288 352142960 351602733
1054.5C51602733m32640l04282j94341j27196l5048L2753Q4728K28047M05103O07580
$$ 351602733 351170093 350865811 350671470 350544274 350509226 350541979 350626707 350854754 351259857 351867437
1074.8C51867437R45300J308263J657426K030194K312302K541691K810568L001243
$$ 351867437 352812737 354121000 355778426 357808620 360120922 362662613 365473181 368474424
1091.2C68474424L142536L344148L484249L515184L451079L227592K888083K477646
$$ 368474424 371616960 374961108 378445357 381960541 385411620 388639212 391527295 394004941
1107.5C94004941J963496J510471J213938R77516Q62211Q84861R84252J144856J232117
$$ 394004941 395968437 397478908 398692846 399670362 400532573 401417434 402401686 403546542 404778659
1125.8D04778659J221598J188010R26256M34011l1084m48078o83456n81027k91913
$$ 404778659 406000257 407188267 408114523 408548534 408517450 408069372 407385916 406804889 406512976
1144.2D06512976J29044O94662J253814J801431K308011K668798L026962L411949L704339
$$ 406512976 406642020 407336682 408590496 410391927 412699938 415368736 418395698 421807647 425511986
1162.6D25511986L976822M232168M446626M756212N079627N369425N762726O138921
$$ 425511986 429488808 433720976 438167602 442923814 448003441 453372866 459135592 465274513
1178.9D65274513O482869O909818P197409P268698P214188O844819O206989N504072
$$ 465274513 471757382 478667200 485864609 493133307 500347495 507192314 513399303 518903375
1195.2E18903375M667401L792167L005147K254963J669943J267195Q95142O23346M55618
$$ 518903375 523570776 527362943 530368090 532623053 534292996 535560191 536455333 537078679 537534297
1213.5E37534297K83956J64509P9393j0490k9445p1466j76251k32041l20494m63247
$$ 537534297 537818253 537982762 538062155 538051665 538022220 537950754 537774503 537542462 537221968 536758721
1233.9E36758721n15044n06759m88400l94106k81334j81079o5565j8000P629J02460
$$ 536758721 536243677 535736918 535248518 534854412 534573078 534391999 534326434 534308434 534316063 534418523
1254.3E34418523K01404L43621O23524R38416J215875J455188J546860J497089J382828
$$ 534418523 534619927 534963548 535587072 536525488 537741363 539196551 540743411 542240500 543623328
1272.7E43623328J150370Q48412N64993K77161L8982j51754m00364o06060p07626q18849
$$ 543623328 544773698 545622110 546187103 546464264 546503246 546351492 545951128 545345068 544637442 543818593
1293.1E43818593q45671p14183n47647l71754k25842k09272k47836k73705k98202k36690
$$ 543818593 542972922 542258739 541711092 541339338 541113496 540904224 540656388 540382683 540084481 539847791
1313.5E39847791j52707j17719K4617J49130N2810r1374k57551n13971p10130q83937
$$ 539847791 539695084 539577365 539601982 539751112 539803922 539712548 539454997 538941026 538230896 537346959
1333.9E37346959j076162j159191j075745p68423m45008l22461k35677j02162j14977
$$ 537346959 536270797 535111606 534035861 533267438 532822430 532499969 532264292 532162130 532047153
1352.2E32047153k43366l83377o47009j004994j304984j344263j252652j298904j275420
$$ 532047153 531803787 531420410 530773401 529768407 528463423 527119160 525866508 524567604 523292184
1370.6E23292184j094341p73549k85507R5189J30474R5785M74930R56893R38296N17071
$$ 523292184 522197843 521424294 521138787 521233976 521364450 521460235 521935165 522892058 523830354 524347425
1391E24347425j91272r04798j115740j276970j395106j517534j912534j972616j828194
$$ 524347425 524156153 523251355 522135615 520858645 519463539 517946005 516033471 514060855 512232661
1409.3E12232661j907408j815796j533329j614869j564384p60793k96116n1498K99572
$$ 512232661 510325253 508509457 506976128 505361259 503796875 503036082 502739966 502688468 502988040
1427.7E02988040N06402R12487J255631J336933J729488J987577J875758J712620J469314
$$ 502988040 503494442 504406929 505662560 506999493 508728981 510716558 512592316 514304936 515774250
1446E15774250J228035J281380J307309J122296J144588J976251K731324K842724L069520
$$ 515774250 517002285 518283665 519590974 520713270 521857858 523834109 526565433 529408157 532477677
1464.4E32477677L547311L773629L830374M557132N342305N379081N291164N310535
$$ 532477677 536024988 539798617 543628991 548186123 553528428 558907509 564198673 569509208
1480.7E69509208N301416N059660M871785M994273N338610M872441M192054M166901
$$ 569509208 574810624 579870284 584742069 589736342 595074952 599947393 604139447 608306348
1497F08306348M197717L821850L223836K592445K646863L197074K991617K545595K169907
$$ 608306348 612504065 616325915 619549751 622142196 624789059 627986133 630977750 633523345 635693252
1515.4F35693252K047062J914561J877010J964152J844465J705051J471936R85504
$$ 635693252 637740314 639654875 641531885 643496037 645340502 647045553 648517489 649502993
1531.7F49502993O42240P34508K72333q35657q21352p9751j14500n94914j176596j443624
$$ 649502993 650145233 650879741 651152074 650316417 649495065 649415314 649300814 648705900 647529304 646085680
1552.1F46085680j649619k010643l538907l956198j810253k102613l207028m345179
$$ 646085680 644436061 642425418 638886511 634930313 633120060 631017447 627810419 623465240
1568.4F23465240n428135m947722n778134q584023q275449p358253q330703q985817
$$ 623465240 618037105 613089383 607311249 598727226 590451777 583093524 574762821 565777004
1584.7E65777004r022057q903206q628606q121431p570327o821453n953133n263687
$$ 565777004 556754947 547851741 539223135 531101704 523531377 516709924 510756791 505493104
1601.1E05493104m586160l817707l193438k673388k041429j551628j600474j402676
$$ 505493104 500906944 497089237 493895799 491222411 489180982 487629354 486028880 484626204
1617.4D84626204j89066L35008K78085M53919O37234Q61287J207858J439512J928925
$$ 484626204 484437138 484772146 485050231 485504150 486141384 487002671 488210529 489650041 491578966
1635.7D91578966K684057K906263K919763K831579L104627L840804L570974L420233
$$ 491578966 494263023 497169286 500089049 502920628 506025255 509866059 513437033 516857266
1652E16857266M747093M742682M103005M006445M247845M525304M167079M041195M583180
$$ 516857266 521604359 526347041 530450046 534456491 538704336 543229640 547396719 551437914 556021094
1670.4E56021094M567623M513026M848480M628658M176557M074216M974008N198538
$$ 556021094 560588717 565101743 569950223 574578881 578755438 582829654 587803662 593002200
1686.7E93002200M562259M406392L947974L560066L464162L242612L503144L329754
$$ 593002200 597564459 601970851 605918825 609478891 612943053 616185665 619688809 623018563
1703F23018563K664983K391636K124489J725852J297951P63118O13869J374900J833200
$$ 623018563 625683546 628075182 630199671 631925523 633223474 633986592 634600461 635975361 637808561
1721.4F37808561J700044J728952J861870J997888J985789K055108K734423K846122
$$ 637808561 639508605 641237557 643099427 645097315 647083104 649138212 651872635 654718757
1737.7F54718757K629518K721846K853751K867759K868831L044844L462970L460288
$$ 654718757 657348275 660070121 662923872 665791631 668660462 671705306 675168276 678628564
1754F78628564L120124K929867K703428K573550K581179K335787J945734J638412J611114
$$ 678628564 681748688 684678555 687381983 689955533 692536712 694872499 696818233 698456645 700067759
1772.4G00067759J984357K100706J811743J545131J503230J494825J501560J431048
$$ 700067759 702052116 704152822 705964565 707509696 709012926 710507751 712009311 713440359
1788.7G13440359J062631J004458J454591J506269J186729J099050J261711J278818
$$ 713440359 714502990 715507448 716962039 718468308 719655037 720754087 722015798 723294616
1805G23294616J162350R95576R39668J051247J042902R49144R85981R23097O91414
$$ 723294616 724456966 725452542 726392210 727443457 728486359 729435503 730421484 731344581 732035995
1823.4G32035995O46948O84023O12676Q42512J027465Q24630O99639P25449N64694
$$ 732035995 732682943 733366966 733979642 734822154 735849619 736674249 737373888 738099337 738664031
1841.7G38664031K89798N30481R17673Q56102O85394O23881N92530N64456O29962O41882
$$ 738664031 738953829 739484310 740401983 741258085 741943479 742567360 743159890 743724346 744354308 744996190
1862.1G44996190N61059M01318K39491N09739Q53360P36236N27382N08547M79698M40419
$$ 744996190 745557249 745958567 746198058 746707797 747561157 748297393 748824775 749333322 749813020 750253439
1882.5G50253439M69148M17173K75910L47376M92513M26114L78191L76403L76523L82304
$$ 750253439 750722587 751139760 751415670 751763046 752255559 752681673 753059864 753436267 753812790 754195094
1902.9G54195094L54707L18408K79367L12269L99113L25680J29103J90973L03388K69532
$$ 754195094 754549801 754868209 755147576 755459845 755858958 756184638 756313741 756504714 756808102 757077634
1923.3G57077634L49939L49224K26736K03550K01225J81496K01643J38282O259M3929
$$ 757077634 757427573 757776797 758003533 758207083 758408308 758589804 758791447 758929729 758935988 758979917
1943.7G58979917J76549K07424J98841J67370J31428J18911Q2731Q6546J24038Q1420
$$ 758979917 759156466 759363890 759562731 759730101 759861529 759980440 760063171 760149717 760273755 760355175
1964.1G60355175P152L1591R3042J13666R9183N3644N7637P9275O0618N1915L9816
$$ 760355175 760362327 760393918 760486960 760600626 760699809 760753453 760811090 760890365 760950983 761002898 761042714
1986.5G61042714L874l4868k2173P7188J16586M7207M650m888m8220q0824n7340n2035
$$ 761042714 761046588 761011720 760989547 761066735 761183321 761230528 761235178 761230290 761182070 761101246 761043906 760991871
2011G60991871p0274j02102j46210j21654q7320j16885j36256j26541j40369j37627
$$ 760991871 760921597 760819495 760673285 760551631 760464311 760347426 760211170 760084629 759944260 759806633
2031.4G59806633j26302j37568j18553j07825j34886j12175p9036j03355r1552n4837
$$ 759806633 759680331 759542763 759424210 759316385 759181499 759069324 758990288 758886933 758795381 758740544
2051.8G58740544m8637k7061j0550k0384n067k324j1087M1723O2228M2557O9321Q6009
$$ 758740544 758691907 758664846 758654296 758633912 758628845 758626521 758615434 758657157 758719385 758761942 758831263 758917272
2076.3G58917272R1791J30058J23262Q5235Q8691Q4460Q1182P7724M6194N9426Q8810
$$ 758917272 759009063 759139121 759262383 759347618 759436309 759520769 759601951 759679675 759725869 759785295 759874105
2098.7G59874105N6446N2869Q0467N4955M6790N3644L4451M9413N6147L3975P4804
$$ 759874105 759930551 759983420 760063887 760118842 760165632 760219276 760253727 760303140 760359287 760393262 760468066
2121.1G60468066J03771P9275Q7678O9618L9399P4923R2328R6798J44183J31488J00732
$$ 760468066 760571837 760651112 760738790 760808408 760847807 760922730 761015058 761111856 761256039 761387527 761488259
2143.6G61488259J48475J68443J68204K03311J97232K01226K40743K38180K68459L01182
$$ 761488259 761636734 761805177 761973381 762176692 762373924 762575150 762815893 763054073 763322532 763623714
2164G63623714K42353K46644L29137L47733L51131L50893L22938L44097L51370L21567
$$ 763623714 763866067 764112711 764441848 764789581 765140712 765491605 765814543 766158640 766510010 766831577
2184.4G66831577L49045L55601L26335L45290L46243L46780L84689L46064L15547L72589
$$ 766831577 767180622 767536223 767862558 768207848 768554091 768900871 769285560 769631624 769947171 770319760
2204.8G70319760L70383L43859L69788L61204L51488L72172L47078L37481L62277L62098
$$ 770319760 770690143 771034002 771403790 771764994 772116482 772488654 772835732 773173213 773535490 773897588
2225.2G73897588L77536L89278L62039L62634L69072L42548L50416L57508L24548L10600
$$ 773897588 774275124 774664402 775026441 775389075 775758147 776100695 776451111 776808619 777133167 777443767
2245.6G77443767L05235K95699L06427L02672K88606L00467K83480K57134K75135K71321
$$ 777443767 777749002 778044701 778351128 778653800 778942406 779242873 779526353 779783487 780058622 780329943
2265.9G80329943K56777K86161K89500K53678K27570K02954K34067K91109K67208K16842
$$ 780329943 780586720 780872881 781162381 781416059 781643629 781846583 782080650 782371759 782638967 782855809
2286.3G82855809J85191J46568J67430K06828J59979J32322J45852J19925J08600R8526
$$ 782855809 783041000 783187568 783354998 783561826 783721805 783854127 783999979 784119904 784228504 784327030
2306.7G84327030L8564J3650L2246M1604K9147o6102j52528q7500l040k0623o0797
$$ 784327030 784365594 784379244 784411490 784453094 784482241 784416139 784263611 784176111 784173071 784152448 784091651
2329.2G84091651r3042r4474p0631p2539o2764n7161j14917O0021N21422N48541O4195
$$ 784091651 783998609 783904135 783833504 783760965 783698201 783641040 783526123 783586144 784107566 784656107 784720302
2351.6G84720302l71218m35233l41952k51889j62244J371J56998K06292TK22325K71916
$$ 784720302 784349084 783913851 783571899 783320010 783157766 783159137 783316135 783522427 783728719 783951044 784222960
2374G84222960L05713K88129K84910K96831K26498P9274l8743j09852j33931j00911
$$ 784222960 784528673 784816802 785101712 785398543 785625041 785704315 785665572 785555720 785421789 785320878
2394.4G85320878j15156j68264j65463j63912j97828k21372k40087k28703j93239k25365
$$ 785320878 785205722 785037458 784871995 784708083 784510255 784288883 784048796 783820093 783626854 783401489
2414.8G83401489k80618k80321k84791k95341k96295l25203l23057l18885l69727l75331
$$ 783401489 783120871 782840550 782555759 782260418 781964123 781638920 781315863 780996978 780627251 780251920
2435.2G80251920l51906l70264l75628l79384m07278m11511m23729m57049m55796m30644
$$ 780251920 779900014 779529750 779154122 778774738 778367460 777955949 777532220 777075171 776619375 776188731
2455.6G76188731m23431m34280m52160m63486m67897m85122m91142m69864m50193m49896
$$ 776188731 775765300 775331020 774878860 774415374 773947477 773462355 772971213 772501349 772051156 771601260
2476G71601260m73917m96328m76420m60684m87983m89831m69864m70399m67241m63665
$$ 771601260 771127343 770631015 770154595 769693911 769205928 768716097 768246233 767775834 767308593 766844928
2496.4G66844928m60624m38929m38988m62532m67778m70519m62591m36425m29869m33266
$$ 766844928 766384304 765945375 765506387 765043855 764576077 764105558 763642967 763206542 762776673 762343407
2516.8G62343407m26829m32849m30584m12047m23014m40240m28557m04358l93272m01437
$$ 762343407 761916578 761483729 761053145 760641098 760218084 759777844 759349287 758944929 758551657 758150220
2537.2G58150220m05252l92556l88623m10139m25279m23610m11213l87251l78549l85881
$$ 758150220 757744968 757352412 756963789 756553650 756128371 755704761 755293548 754906297 754527748 754141867
2557.6G54141867m02689m18722l99828l85583m06444m15087m22358m67241n18084n24699
$$ 754141867 753739178 753320456 752920628 752535045 752128601 751713514 751291156 750823915 750305831 749781132
2578G49781132n04613m93467n03480n40197n71192n62012n40018n74052o52850o73473
$$ 749781132 749276519 748783052 748279572 747739375 747168183 746606171 746066153 745492101 744839251 744165778
2598.4G44165778o47127o42777o47366o69122p12812p42435p69198p97212q01444q18908
$$ 744165778 743518651 742875874 742228508 741559386 740846574 740104139 739334941 738537729 737736285 736917377
2618.8G36917377q71420q99315q85606q88825r31501r63628r76920j011610j046420
$$ 736917377 736045957 735146642 734261036 733372211 732440710 731477082 730500162 729488552 728442132
2637.1G28442132j047253j050949j064539j078904j115322j118124j079201j079500
$$ 728442132 727394879 726343930 725279391 724200487 723085165 721967041 720887840 719808340
2653.5G19808340j107693j095116j057386j044810j030385j017452j019418j000285
$$ 719808340 718700647 717605531 716548145 715503335 714472950 713455498 712436080 711435795
2669.8G11435795r87053r88305r65595r30905r00924q95620r00447q47459p87675p96438
$$ 711435795 710448742 709460437 708494842 707563937 706663013 705767393 704866946 704019487 703231812 702435374
2690.2G02435374q04722p87735p87973p71106p38859p37250p36952p29322p35223p41124
$$ 702435374 701630652 700842917 700054944 699283838 698544979 697807729 697070777 696341455 695606232 694865108
2710.6F94865108p37548p32184p18355o91831o76751o75678o76513o86526p02858p02560
$$ 694865108 694127560 693395376 692677021 691985190 691308439 690632761 689956248 689269722 688566864 687864304
2731F87864304o78778o41763o11365o14107o25610o23882o28054o36816o41823o59347
$$ 687864304 687185526 686543763 685932398 685318291 684692681 684068799 683440745 682803929 682162106 681502759
2751.4F81502759p01546p40469p53879p79510q13842q14437q31903q88347r03070q94725
$$ 681502759 680801213 680060744 679306865 678527355 677713513 676899076 676067173 675178826 674275756 673381031
2771.8F73381031r39131r96530j040638j085818j093149j079380j096309j113235j158953
$$ 673381031 672441900 671445370 670404732 669318914 668225765 667146385 666050076 664936841 663777888
2790.1F63777888j249612j295566j314700j362324j411318j457393j499713j533329
$$ 663777888 662528276 661232710 659918010 658555686 657144368 655686975 654187262 652653933
2806.4F52653933j600028j674950j728832j785875j830458j894057j999378k078116
$$ 652653933 651053905 649378955 647650123 645864248 644033790 642139733 640140355 638062239
2822.7F38062239k148331k257347k344608k391934k436996k452850k411008k367497
$$ 638062239 635913908 633656561 631311953 628920019 626483023 624030173 621619165 619251668
2839.1F19251668k369821k365946k345384k370119k443730k484262k471984k501368
$$ 619251668 616881847 614515901 612170517 609800398 607356668 604872406 602400422 599899054
2855.4E99899054k582550k672434k782941k875090k911687k920627k882600k749920
$$ 599899054 597316504 594644070 591861129 588986039 586074352 583153725 580271125 577521205
2871.7E77521205k575159k426922k252102k023518j824558j678109j548589j418233
$$ 577521205 574946046 572519124 570267022 568243504 566418946 564740837 563192248 561774015
2888E61774015j298904j205444j106501j045465j043559j005649r71496j005471j043379
$$ 561774015 560475111 559269667 558163166 557117701 556074142 555068493 554096997 553091526 552048147
2906.4E52048147j056373j059711j084745j169980j235008j165331j019477q65400
$$ 552048147 550991774 549932063 548847318 547677338 546442330 545276999 544257522 543392122
2922.7E43392122o76513m62890k54333n1558J98543N31018R10104J309752J731634
$$ 543392122 542715609 542252719 541998386 541946828 542145371 542676389 543586493 544896245 546627879
2941E46627879K151907K509594K760648K955318L178239L367424L431320L444373L455222
$$ 546627879 548779786 551289380 554050028 557005346 560183585 563551009 566982329 570426702 573881924
2959.4E73881924L377378L206432L025055K845585K673090K563059K493143K397955
$$ 573881924 577259302 580465734 583490789 586336374 589009464 591572523 594065666 596463621
2975.7E96463621K338171K329290K238631K070129J917541J766026J639724J487016
$$ 596463621 598801792 601131082 603369713 605439842 607357383 609123409 610763133 612250149
2992F12250149J206815R50456P42197M73380K36035O4850p2003j71959k80917m65095
$$ 612250149 613456964 614407420 615149617 615622997 615859032 615923882 615851879 615679920 615399003 614933908
3012.4F14933908p11322r51588j130223j222313j254439j308978j421570j474858j429260
$$ 614933908 614222586 613270998 612140775 610918462 609664023 608355045 606933475 605458617 604029357
3030.8F04029357j405775j522243j675844j644731j582205j682818j819730j881778
$$ 604029357 602623582 601101339 599425495 597780764 596198559 594515741 592696011 590814233
3047.1E90814233j853109j831114j883089j908899j927256j959801j926959j859069
$$ 590814233 588961124 587130010 585246921 583338022 581410766 579450965 577524006 575664937
3063.4E75664937j803159j845360j999497k051413j947403j823187j760364j837611
$$ 575664937 573861778 572016418 570016921 567965508 566018105 564194918 562434554 560596943
3079.7E60596943j981378k029478k038896k027572j972198k009809k076089k002120
$$ 560596943 558615565 556586087 554547191 552519619 550547421 548537612 546461523 544459403
3096E44459403j867950j854897j970231k009690j877249j780808j874387j887560j717686
$$ 544459403 542591453 540736556 538766325 536756635 534879386 533098578 531224191 529336631 527618945
3114.4E27618945j700461j851738k004862k126455k086937j925052j833736j854003
$$ 527618945 525918484 524066746 522061884 519935429 517848492 515923440 514089704 512235701
3130.7E12235701j899838j845539j717567j712621j866638j945854j893252j834452
$$ 512235701 510335863 508490324 506772757 505060136 503193498 501247644 499354392 497519940
3147D97519940j724690j627266j713902j886130j913458j812905j742273j739771j756340
$$ 497519940 495795250 494167984 492454082 490567952 488654494 486841589 485099316 483359545 481603205
3165.4D81603205j746803j737565j734048j700253j679450j698494j689136j674682
$$ 481603205 479856402 478118837 476384789 474684536 473005086 471306592 469617456 467942774
3181.7D67942774j700163j697659j665801j663595j664698j640827j625001j640886
$$ 467942774 466242611 464544952 462879151 461215556 459550858 457910031 456285030 454644144
3198D54644144j656890j607895j544357j540899j549393j530558j517623j503706j472920
$$ 454644144 452987254 451379359 449835002 448294103 446744710 445214152 443696529 442192823 440719903
3216.4D40719903j469642j472503j454026j440316j420141j389533j351595j318395
$$ 440719903 439250261 437777758 436323732 434883416 433463275 432073742 430722147 429403752
3232.7D29403752j350522j403481j373082j301080j246870j202047j190096j211404
$$ 429403752 428053230 426649749 425276667 423975587 422728717 421526670 420336574 419125170
3249D19125170j181037j079410j016527j063019j130432j094014r99480r63241r05842
$$ 419125170 417944133 416864723 415848196 414785177 413654745 412560731 411561251 410598010 409692168
3267.4D09692168p89433q15303r65774j050830j051068r93878r46134r59128r71705
$$ 409692168 408902735 408087432 407121658 406070828 405019760 404025882 403079748 402120620 401148915
3285.7D01148915r57578r22948r30578j012534j078248j156091j198739j072318r33796
$$ 401148915 400191337 399268389 398337811 397325277 396247029 395090938 393892199 392819881 391886085
3304.1C91886085j020670j278191j455546j462608j392693j347869j356245j382052
$$ 391886085 390865415 389587224 388131678 386669070 385276377 383928508 382572263 381190211
3320.4C81190211j370699j364439j484484j621574j623303j581996j529873j441836
$$ 381190211 379819512 378455073 376970589 375349015 373725712 372143716 370613843 369172007
3336.7C69172007j494646j698703j807868j816303j764506j632869j667619j903146
$$ 369172007 367677361 365978658 364170790 362354487 360589981 358957112 357289493 355386347
3353C55386347k000273j860410j711487j726389j784176j698464j573950j660854j918822
$$ 355386347 353386074 351525664 349814177 348087788 346303612 344605148 343031198 341370344 339451522
3371.4C39451522j962543j717329j521110j474709j470268j403510j259565j063109
$$ 339451522 337488979 335771650 334250540 332775831 331305563 329902053 328642488 327579379
3387.7C27579379q69751r17345j155257j160652q50558o65784r27717j224309j068055
$$ 327579379 326709628 325792283 324637026 323476374 322625816 321960032 321032315 319808006 318739951
3406.1C18739951p70450o94662p22766p58469p57158o66738n83619n05477l41654j57088
$$ 318739951 317969501 317274839 316552073 315793604 315036446 314369708 313786089 313280612 312938958 312781870
3426.5C12781870n5641r6201n5999J14113N2601j80900j80006Q0019K85626L17096
$$ 312781870 312726229 312630028 312574029 312688142 312740743 312559843 312379837 312459856 312745482 313062578
3446.8C13062578L34710M27336N08487N68450O77883P87467P14779O73175R41068J120090
$$ 313062578 313397288 313824624 314333111 314901561 315579444 316366911 317081690 317754865 318695933 319816023
3467.2C19816023Q58188M97252N02586P53999R83238J015186Q31813Q18878J013220
$$ 319816023 320674211 321171463 321674049 322428048 323411286 324426472 325258285 326077163 327090383
3485.6C27090383J008391R12309J009851J139939J209557J198352J153975J129985
$$ 327090383 328098774 329011083 330020934 331160873 332370430 333568782 334722757 335852742
3501.9C35852742J038879J003296J131355J338065J542658J501917J270652J246423
$$ 335852742 336891621 337894917 339026272 340364337 341906995 343408912 344679564 345925987
3518.2C45925987J440555J660794J634985J399606J371354J631856J881242J949996
$$ 345925987 347366542 349027336 350662321 352061927 353433281 355065137 356946379 358896375
3534.5C58896375J847624J749188J896501K060324J997292J835942J882702K046019
$$ 358896375 360743999 362493187 364389688 366450012 368447304 370283246 372165948 374211967
3550.9C74211967K090573K142549K270341K383083K393842K265900K135754K428889
$$ 374211967 376302540 378445089 380715430 383098513 385492355 387758255 389894009 392322898
3567.2C92322898K973765L055990K875149K888382L028452L175199L320575L330230
$$ 392322898 395296663 398352653 401227802 404116184 407144636 410319835 413640410 416970640
3583.5D16970640L127188L042638L449142L672660L551602L593355L828705L931045
$$ 416970640 420097828 423140466 426589608 430262268 433813870 437407225 441235930 445166975
3599.8D45166975L941238L909141L696978L656983L906191M069686M148453M072398
$$ 445166975 449108213 453017354 456714332 460371315 464277506 468347192 472495645 476568043
3616.1D76568043L970534M303306M468203M088431L515095L409624M240692M554867
$$ 476568043 480538577 484841883 489310086 493398517 496913612 500323236 504563928 509118795
3632.4E09118795M324735M146874L999769L968060L975272L720701L231943L285706
$$ 509118795 513443530 517590404 521590173 525558233 529533505 533254206 536486149 539771855
3648.8E39771855M162311M345835L811180L750921L977477L683746L271818L122926
$$ 539771855 543934166 548280001 552091181 555842102 559819579 563503325 566775143 569898069
3665.1E69898069K799511K430618K745747K717674K144396K587498L175914L083408
$$ 569898069 572697580 575128198 577873945 580591619 582736015 585323513 588499427 591582835
3681.4E91582835K876639K557218K017439J622736K014875K487243K396404J999796
$$ 591582835 594459474 597016692 599034131 600656867 602671742 605158985 607555389 609555185
3697.7F09555185J548469J378477J711726J856625J413286Q38160R08375J738012J960694
$$ 609555185 611103654 612482131 614193857 616050482 617463768 618301928 619210303 620948315 622909009
3716.1F22909009J461030J020431R15825R70841J122057J364589J176596O12497L71635
$$ 622909009 624370039 625390470 626306295 627277136 628399193 629763782 630940378 631552875 631924510
3734.4F31924510R08256J639604J528680L98994k82347Q60929J047313K59936R41336
$$ 631924510 632832766 634472370 636001050 636400044 636117697 636978626 638025939 638285875 639227211
3752.8F39227211J757980J336992P01844Q38697J074374Q02934O00875N20229O53088
$$ 639227211 640985191 642322183 643024027 643862724 644937098 645740032 646340907 646861136 647514224
3771.1F47514224J023650J034141O80506L97682N46873O49273N69463O99639P68066
$$ 647514224 648537874 649572015 650252521 650650203 651197076 651846349 652415812 653115451 653883517
3789.5F53883517O74665N17547L30746L91126J53422j28031O55234Q06451M91381R53138
$$ 653883517 654558182 655075729 655406475 655797601 655951023 655822992 656478226 657284677 657776058 658729196
3809.9F58729196J054883L43263j86980J79589P5698J38461R77755R53734O09874M23015
$$ 658729196 659784079 660127342 659940362 660119951 660195649 660334110 661311865 662265599 662875473 663298488
3830.3F63298488L10838L88443O2406k64167L04401P86423Q59738R32216P68245q3149
$$ 663298488 663609326 663997769 664060175 663796008 664100409 664886832 665746570 666678786 667447031 667363882
3850.7F67363882j459241o26385J490533J506150O12736l8386O0142L79204N543r0837
$$ 667363882 665904641 665278256 666768789 668274939 668887675 668849289 668909431 669288635 669294178 669203341
3871.1F69203341M73917P94708P35939J39057k8431L57151J89185L17693M23431Q047
$$ 669203341 669677258 670471966 671207905 671346962 671318531 671675682 671864867 672182560 672605991 672614038
3891.5F72614038K54214O32047K16008l07501l44693r4116M37498Q42452O76453L54171
$$ 672614038 672868252 673500299 673716307 673408806 673064113 672969997 673407495 674249947 674926400 675280571
3911.9F75280571J23978j21355j06752J88410K25723M5657J18911K32697K8610n0604
$$ 675280571 675404549 675283194 675176442 675364852 675590575 675636232 675755143 675987840 676016450 675965846
3932.3F75965846K57492L94046K06232J1981l1889J34111J66833N305O9082J95443
$$ 675965846 676223338 676617384 676823616 676835597 676803708 676937819 677104652 677109957 677179039 677374482
3952.7F77374482J63496J11520J03056J06633J27316J50263J07765O9022R2328R5367
$$ 677374482 677537978 677649498 677752554 677859187 677986503 678136766 678244531 678313553 678405881 678501248
3973.1F78501248Q6189R6738N8413O8128J44779J06991P689l58M4644P2837J05679
$$ 678501248 678587437 678684175 678742588 678810716 678955495 679062486 679070175 679069817 679114461 679187298 679292977
3995.5F79292977J12414
$$ 679292977 679405391
3997.5F79405391
$$ 679405391
##END=$$ End of the data block
