##TITLE=DI 14-11415226-6 Fibre gum C $$ Begin of the data block
##JCAMP-DX=5.00 $$ ACD/SpecManager v 10.08
##SPECTROMETER/DATA SYSTEM=Alpha
##DATE=10 Jul 2014 09:05:02
##DATA TYPE=INFRARED SPECTRUM
##DATA CLASS=XYDATA
##ORIGIN=
##OWNER=
##NPOINTS=1765
##FIRSTX=399.75695801
##LASTX=3997.56933594
##MAXX=3997.56933594
##MINX=399.75695801
##MAXY=0.75986844
##MINY=0.37692538
##XFACTOR=1.0000000000
##YFACTOR=1.000000000000000e-9
##FIRSTY=0.55398631
##DELTAX=2.03957629
##XUNITS=1/CM
##YUNITS=ARBITRARY UNITS
##XYDATA=(X++(Y..Y))
399.8E53986311J73092q5354o48141o71565m41194m91083n50866n84483j018107r52005
$$ 553986311 554159403 554074049 553425908 552754343 552313149 551822066 551271200 550686717 549668610 548716605
420.2E48716605j09315p153n95152r17971n00500l32833r35256j037479l01540m3749
$$ 548716605 548607290 548600137 548004985 547087014 546586514 546253681 545318425 544280946 543979406 543935657
440.5E43935657n75304n47350K96652L46601l79622j92165N62429J68324o09994P4327
$$ 543935657 543360353 542813003 543109655 543456256 543076634 542884469 543446898 543615222 543005228 543079555
460.9E43079555Q62956m1604j176834n25236M43697n4777n63145L35992J056611O8307
$$ 543079555 543942511 543900907 542724073 542198837 542642534 542587757 542024612 542360604 543417215 543485522
481.3E43485522q57055N007O22094m24743r24409J60695L47971j045823j360118m7386
$$ 543485522 542628467 542633474 543255568 542830825 541906416 542067111 542415082 541369259 540009141 539961755
501.7E39961755J10030j302361j316011Q3983r0957j449883j153290J37627l90589
$$ 539961755 540071785 538769424 537453413 537537396 537446439 535996556 534843266 534980893 534590304
520.1E34590304j728058j201212J72317k69115j468361q09610L89040l54409j299262
$$ 534590304 532862246 531661034 531833351 531564236 530095875 529286265 529675305 529320896 528021634
538.4E28021634k33293P13825m17411j210988J49310J025617j47045o69419P76052
$$ 528021634 527788341 528502166 528084755 526873767 527023077 528048694 527901649 527232230 528008282
556.8E28008282J424015Q3923m59134Q27789J108408l78132o07908Q61943R96470n06818
$$ 528008282 529432297 529516220 529057086 529884875 530993283 530615151 530007243 530869186 531865656 531358838
577.2E31358838p32481N85854O32286p50780p70152L28958j03652j411796j014590
$$ 531358838 530626357 531212211 531844497 531093717 530323565 530652523 530548871 529137075 528122485
595.6E28122485K51352j68859j392365r27448L13043o5624j151264o17027N26785J56999
$$ 528122485 528373837 528204978 526812613 525885165 526198208 526132584 524981320 524364293 524891078 525048077
616E25048077m72307O16968J968085J653731R26376J599907K309323J469910O67453
$$ 525048077 524575770 525192738 527160823 528814554 529740930 531340837 533650160 535120070 535787523
634.3E35787523J401007K060413J265645N46456J145303J596332P55846J58906Q75473
$$ 535787523 537188530 539248943 540514588 541061044 542206347 543802679 544558525 544717431 545592904
652.7E45592904J332283O15180K66492R48310J220584N50985J5915R00209J695275
$$ 545592904 546925187 547540367 547806859 548755169 549975753 550526738 550542653 551442862 553138137
671E53138137J213968J052022J551747J697242J159311R00089J148224R38893J72317
$$ 553138137 554352105 555404127 556955874 558653116 559812427 560712516 561860740 562799633 562971950
689.4E62971950j46330J12236O2346n02765q04782n31912k92420m29213m26352L278
$$ 562971950 562825620 562937856 563000202 562497437 561692655 561160743 560868323 560439110 560012758 560016036
709.8E60016036M18246O32644J018047J709103K435148K980471L351927L639459L652156
$$ 560016036 560434282 561066926 562084973 563794076 566229224 569209695 572561622 576201081 579853237
728.1E79853237L191769K590120K282500K098322J628160J063347Q54433Q73983O45995
$$ 579853237 583045006 585635126 587917626 590015948 591644108 592707455 593561888 594435871 595081866
746.5E95081866K39014P3314O9857k47121p77781r86278j060188j533508k093315k032638
$$ 595081866 595320880 595394194 595464051 595216930 594439149 593452871 592392683 590859175 588765860 586733222
766.9E86733222j445055r60827n04851N32985J771748K338945K500654K997040L534317
$$ 586733222 585288167 584327340 583822489 584355474 586127222 588466167 590966821 593963861 597498178
785.2E97498178L418744L041625L129244L239036K616643J732529J280307Q25584m7445
$$ 597498178 600916922 603958547 607087791 610326827 612943470 614675999 615956306 616781890 616734445
803.6F16734445n51879K742R61959J656294K493858L784657M706502M597663M043282
$$ 616734445 616182566 616185308 617147267 618803561 621297419 625082076 629788578 634386241 638429523
821.9F38429523L447651K162099K4081j920283k981961l545225l633857k521038l08513
$$ 638429523 641877174 644039273 644063354 642143071 639161110 635615885 631982028 629460990 629152477
840.3F29152477J842677L229618M101277M404783L619731K142667J047731M60326k93672
$$ 629152477 630995154 634224772 638326049 642730832 646350563 648493230 649540961 650001287 649707615
858.7F49707615j136183j500905j660228k242326k912820l070891l053426l278256
$$ 649707615 648571432 647070527 645410299 643167973 640255153 637184262 634130836 630852580
875F30852580l356755k904653k322734j992881j544476p81476l57628o64234j116931
$$ 630852580 627495825 624591172 622268438 620275557 618731081 617949605 617591977 616927743 615810812
893.3F15810812j291335j527310j890599j834929j313806r63449p92980j86325O25313
$$ 615810812 614519477 612992167 611101568 609266639 607952833 606989384 606196404 606010079 606635392
911.7F06635392P97748L63350j17123q03292k050221l337562m002332m369259m996539
$$ 606635392 607433140 607796490 607679367 606876075 604825854 601488292 597485960 593116701 588120162
930E88120162n583882n676687n704045o199658o680071o531418o137311o023586n881965
$$ 588120162 582536280 576859593 571155548 564955890 558275819 551744401 545607090 539583504 533701539
948.4E33701539n422592n215049n642056o103635o070078n897760n943179n732894
$$ 533701539 528278947 523063898 517421842 511318207 505248129 499350369 493407190 487674296
964.7D87674296m934669m159748l852546l629178l235132l012120l134340l156484
$$ 487674296 482739627 478579879 474727333 471098155 467863023 464850903 461716563 458560079
981D58560079k827137k595455k682268k663494k371966k242804k454877k563298k376020
$$ 458560079 455732942 453137487 450455219 447791725 445419759 443176955 440722078 438158780 435782760
999.4D35782760k322554k565474k680838k493381k353192k377599k187729j662642
$$ 435782760 433460206 430894732 428213894 425720513 423367321 420989722 418801993 417139351
1015.7D17139351j216024j075148r33707o51121n15044n66483m87178k17438o3568
$$ 417139351 415923327 414848179 413914472 413263351 412748307 412181824 411694646 411477208 411413640
1034.1D11413640j48058k45512k50339l86626p03752r11146q92550q79973r67711r23097
$$ 411413640 411265582 411020070 410769731 410383105 409679353 408768207 407875657 406995684 406027973 405104876
1054.5D05104876o69837m37290l62337k83271j12563j4931n6803j4961K55704N66810
$$ 405104876 404435039 403997749 403635412 403352141 403239578 403224647 403167844 403152883 403408587 403975397
1074.8D03975397Q14587J150578J634181K039820K199560K313257K575010K821713
$$ 403975397 404789984 405940562 407574743 409614563 411814123 414127380 416702390 419524103
1091.2D19524103K896727K965092L173530L317535L184378K908618K653718K320855
$$ 419524103 422420830 425385922 428559452 431876987 435061365 437969983 440623701 442944556
1107.5D42944556J786858J260281R88513Q43197O40989N68837Q03053J050085J025259
$$ 442944556 444731414 445991695 446980208 447823405 448464394 449033231 449836284 450886369 451911628
1125.8D51911628R28104J008719R40562L96639k30015n36292o54132o96748m70579
$$ 451911628 452839732 453848451 454789013 455185652 454955637 454419345 453765213 453068465 452597886
1144.2D52597886J06514P56800J226872J678884K237797K665073K861052L075660L429681
$$ 452597886 452704400 453461200 454688072 456366956 458604753 461269826 464130878 467206538 470636219
1162.6D70636219L694594L786653L929764M222900M516273M730702N023867N503475
$$ 470636219 474330813 478117466 482047230 486270130 490786403 495517105 500540972 506044447
1178.9E06044447N952895O190240O379903O592870O542861O089211N533397N021035
$$ 506044447 511997342 518187582 524567485 531160355 537703216 543792427 549325824 554346859
1195.2E54346859M298091L368676K595306K054274J528918J020730P30276O25610M53353
$$ 554346859 558644950 562013626 564608932 566663206 568192124 569212854 569943130 570568740 571022093
1213.5E71022093J98305P5102Q9705L8683j05619j61708j22487k11835m27842n26309
$$ 571022093 571220398 571295500 571385205 571423888 571318269 571156561 571034074 570822239 570394397 569868088
1233.9E69868088n01633n21600n45204m34875k77520k31623k21372j19805L993M7624
$$ 569868088 569366455 568844855 568299651 567864776 567587256 567355633 567134261 567014456 567018449 567066073
1254.3E67066073P9811K46286N41866Q10623J028181J279711J426220J339972J179457
$$ 567066073 567145884 567392170 567934036 568744659 569772840 571052551 572478771 573818743 574998200
1272.7E74998200J027882P87675M59731J61588k7418j83999m04120n98311o89447p56800
$$ 574998200 576026082 576813757 577273488 577435076 577407658 577223659 576819539 576221228 575531781 574774981
1293.1E74774981q02815p28965n39482l63588k81394k75731l02076l36170l74258l35455
$$ 574774981 573972166 573243201 572703719 572340131 572058737 571783006 571480930 571144760 570770502 570435047
1313.5E70435047k25305j33872J3411J49667J03116o0499k65062m72664o16670p59244
$$ 570435047 570209742 570075870 570089281 570238948 570342064 570281565 570016503 569543839 568927169 568167925
1333.9E68167925r85265j166284r81867n35965l48151l61323k96772j94311j79112
$$ 568167925 567182660 566016376 565034509 564498544 564150393 563789070 563492298 563297987 563118875
1352.2E63118875k75910m17113o59526j073896j304090j041651r36628j130759j148224
$$ 563118875 562842965 562425852 561766326 560692430 559388340 558346689 557410061 556279302 555131078
1370.6E55131078j111984p87497j21355J52230P1526R6500L58224P70807J012027O10530
$$ 555131078 554019094 553231597 553110242 553262472 553333998 553430498 553788722 554559529 555571556 556182086
1391E56182086k95877r66430j049339j034737j050353j413286j856387j766026j748323
$$ 556182086 555886209 554919779 553870440 552835703 551785350 550372064 548515677 546749651 545001328
1409.3E45001328j928747j865685j793682k018690j717210o45518j24276Q7380K07365
$$ 545001328 543072581 541206896 539413214 537394524 535677314 535031796 534907520 534994900 535202265
1427.7E35202265L49819Q48890R97543R52363J692891K155423J878977J453758J068055
$$ 535202265 535552084 536400974 537398517 538350880 540043771 542199194 544078171 545531929 546599984
1446E46599984J001597J146197R53853M46498L04103J829207K960742K530813K512813
$$ 546599984 547601581 548747778 549701631 550148129 550452232 552281439 555242181 557772994 560285807
1464.4E60285807L218710L243983K824485L512442M759014N066574M854261M647077
$$ 560285807 563504517 566748500 569572985 573085427 577844441 582911015 587765276 592412353
1480.7E92412353M569351M159391L668428L885686M765868M472196L458798L329695
$$ 592412353 596981704 601141095 604809523 608695209 613461077 617933273 621392071 624721766
1497F24721766L786563L551126K415955J083076J712203L527701L208399K257108J505793
$$ 624721766 628508329 632059455 634475410 635558486 637270689 640798390 644006789 646263897 647769690
1515.4F47769690J421451J391471J471579K002418J886427J669526J437545O94692
$$ 647769690 649191141 650582612 652054191 654056609 655943036 657612562 659050107 659744799
1531.7F59744799M07815O31988l73125j624107n10991O55472N12600k20716j074016
$$ 659744799 660152614 660784602 660411477 658787370 658276379 658931851 659444451 659223735 658149719
1550.1F58149719j475930j796663k481878l906607k664209m37677j447200k848983
$$ 658149719 656673789 654877126 652395248 648488641 645824432 645386755 643939555 641090572
1566.4F41090572m071534m672468m074335n311787p645070o713808n952597p015585
$$ 641090572 637019038 632346570 628272235 622960448 615315378 608601570 602648973 595633388
1582.7E95633388p633329p579327p331848p039606o600142n941808n076647m370808
$$ 595633388 588000059 580420732 573088884 566049278 559449136 553507328 548430681 544059873
1599E44059873l870964l182292k391637j873612j432717q02159m99964q09372n12301
$$ 544059873 540188909 537006617 534614980 532741368 531308651 530506492 530006528 529197156 528684855
1617.4E28684855N26487M82798K30432M93884O40690Q25584Q19206K97964N08010J982570
$$ 528684855 529211342 529694140 529924572 530418456 531059146 531884730 532703936 533001900 533509910 535492480
1637.8E35492480K275049J740933J152635R93192K005100K122521J346469K806008
$$ 535492480 537767529 539508462 540661097 541654289 543659389 545781910 547128379 549934387
1654.1E49934387L922820L040016K481282K686739L214001K819598K469361L333390
$$ 549934387 553857207 556897223 559378505 562065244 565279245 568098843 570568204 573901594
1670.4E73901594L657698L492415M007161L930509L066361K538383M077971N176544
$$ 573901594 577559292 581051707 585058868 588989377 592055738 594594121 598672092 603848636
1686.7F03848636M225016L782987L186524K649665K652645K539873L355623L475666
$$ 603848636 608073652 611856639 615043163 617692828 620345473 622885346 626240969 629716635
1703F29716635K499580K327860K310991J750588Q50857N1558N56767K109825K178252
$$ 629716635 632216215 634544075 636855066 638605654 639456511 639508069 640064836 642174661 644352913
1721.4F44352913J551270J583755J652062J396954J047969J503527K937139K704083
$$ 644352913 645904183 647487938 649140000 650536954 651584923 653088450 656025589 658729672
1737.7F58729672K075017K374113K614021K318978K021492K512276L441334L164708
$$ 658729672 660804689 663178802 665792823 668111801 670133293 672645569 676086903 679251611
1754F79251611K447903K420903K278387K119184K216100J893044J405895R59158J153409
$$ 679251611 681699514 684120417 686398804 688517988 690734088 692627132 694033027 694992185 696145594
1772.4F96145594K148628K213836J474500J144469J371085J452863J285553Q84235
$$ 696145594 698294222 700508058 701982558 703127027 704498112 705950975 707236528 708120763
1788.7G08120763M70937R03070J503110J260995R35018J032293J243949J211167J039981
$$ 708120763 708591700 709494770 710997880 712258875 713193893 714226186 715470135 716681302 717721283
1807G17721283Q10206P06196R01818J042963R17255P33555N81205M41551M78446M14908
$$ 717721283 718531489 719237685 720139503 721182466 722099721 722833276 723414481 723856032 724334478 724749386
1827.4G24749386L71993J014054J242161O83069M96149O55770K73585j88052M52161
$$ 724749386 725121379 726135433 727377594 728060663 728556812 729212582 729486167 729298115 729750276
1845.8G29750276J132249R72212O08146M75466N65470N29944L84391M03642M44591
$$ 729750276 730882525 731854737 732462883 732938349 733503819 734033763 734418154 734821796 735266387
1864.2G35266387J07944j07049N85019J142979Q27789L75927L05831M50373M55558
$$ 735266387 735374331 735267282 735852301 736995280 737823069 738198996 738504827 738955200 739410758
1882.5G39410758L08037J91986J82987L68356L98696K84314M47333N03659K90930K11776
$$ 739410758 739718795 739910781 740093768 740462124 740860820 741145134 741592467 742096126 742387056 742598832
1902.9G42598832L06070K53438J31786K93017M83215K35915j11580R8526L62814L19719
$$ 742598832 742904902 743158340 743290126 743583143 744066358 744302273 744190693 744289219 744652033 744971752
1923.3G44971752L29495L10838K65956K09689R6142J11342K25365P2777k10047j1980
$$ 744971752 745301247 745612085 745878041 746087730 746183872 746295214 746520579 746593356 746383309 746371329
1943.7G46371329L79443L44694J10030M9054J39177J40310K3722J4246J17123O8128
$$ 746371329 746750772 747095466 747205496 747254550 747393727 747534037 747557759 747572005 747689128 747757256
1964.1G47757256r9122J2218K52426J80662l3975n4419Q2493J02937j3411l9875M7922
$$ 747757256 747658134 747670352 747922778 748103440 748069465 748015046 748097539 748200476 748187065 748147190 748195112
1986.5G48195112K0802j57535r7394J87874J81675m1187p9692M0770M9710j12891j80245
$$ 748195112 748215914 748058379 747960985 748148859 748330534 748289347 748209655 748250425 748300135 748187244 748006999
2009G48006999n2452k6524k13802k47120l1233J1742j71661k35498r8288m0770j63257
$$ 748006999 747954547 747928023 747714221 747467101 747435868 747447610 747275949 747040451 746942163 746901393 746738136
2031.4G46738136k21372j13547p5161k14875k45809o6340j073j62244k30312p2063
$$ 746738136 746516764 746403217 746328056 746113181 745867372 745801032 745799959 745637715 745407403 745335340
2051.8G45335340J9730j09792j87755n1737J8657j07885j20640O2645J13428m3631
$$ 745335340 745355070 745245278 745057523 745005786 745024443 744916558 744795918 744858563 744971991 744928360
2072.2G44928360j19030K8491J20162k5391j16289K6703J14858m3273j50323m470R4116
$$ 744928360 744809330 744837821 744957983 744932592 744816303 744843006 744957864 744914591 744764268 744759798 744853914
2094.6G44853914n9426j48296K4736J20997n0247j72555k8134Q4877o0260j53243K8014
$$ 744853914 744794488 744646192 744670928 744791925 744741678 744569123 744540989 744625866 744565606 744412363 744440377
2117.1G44440377J40965l7253j62840K027J23500l8325j43290K1696J25587j2159p0632
$$ 744440377 744581342 744544089 744381249 744383276 744506776 744468451 744325161 744346857 744472444 744460285 744389653
2139.5G44389653J01745J76311N603p4566J09494K19762P2360J192J81079K76924J23560
$$ 744389653 744491398 744667709 744673312 744598746 744708240 744928002 745000362 745001554 745182633 745459557 745583117
2161.9G45583117N8174K28763K97069J32323Q9526K87890L58522J70052Q4877K64228
$$ 745583117 745641291 745870054 746167123 746299446 746388972 746676862 747035384 747205436 747290313 747554541
2182.3G47554541L62277J99675J24932L08096L72648J68264Q8275K99096L94880J92345
$$ 747554541 747916818 748116493 748241425 748549521 748922169 749090433 749178708 749477804 749872684 750065029
2202.7G50065029J13010L16918L77059J86562J47224L41177L84033J70171J00076L05653
$$ 750065029 750178039 750494957 750872016 751058578 751205802 751546979 751931012 752101183 752201259 752506912
2223.1G52506912L98099K32399J62840L20017L62694J77801J19448L07202L55363J75178
$$ 752506912 752905011 753137410 753300250 753620267 753982961 754160762 754280210 754587412 754942775 755117953
2243.5G55117953J37746L11971L47435J51694R5785K64466K79605R9540R7692K83479
$$ 755117953 755255699 755567670 755915105 756066799 756162584 756427050 756706655 756806195 756903887 757187366
2263.9G57187366K82467Q4400P1228K57492K81512J36137J31667K73705K63989P2181
$$ 757187366 757469833 757554233 757625461 757882953 758164465 758300602 758432269 758705974 758969963 759042144
2284.3G59042144j311J24633J60992L0339j431R9063Q9049n1617o8188L3498M768j41203
$$ 759042144 759040833 759165466 759326458 759356797 759355366 759454429 759543478 759491861 759423673 759457171 759461939 759320736
2308.8G59320736j68622n1021l1233k01762l41236k96414k06411j78814j75536j62720
$$ 759320736 759152114 759101093 759069860 758868098 758526862 758230448 758024037 757845223 757669687 757506967
2329.2G57506967j21713j03533j38939j28031j28150k31742j31905M35888P79987K64823
$$ 757506967 757385254 757281721 757142782 757014751 756886601 756654859 756522954 756958842 757738829 758003652
2349.6G58003652n53667q89838o80328m60326k45929K5749J56343K11001L62634N27740
$$ 758003652 757449985 756560147 755879819 755419493 755173564 755199313 755355656 755566657 755929291 756457031
2370G56457031N66244M89056M56274N52475N80788M12881K26975J14142J2577q1360
$$ 756457031 757023275 757512331 757968605 758521080 759101868 759514749 759741724 759855866 759868443 759787083
2390.4G59787083j20521j16169j44184j93775j97828j70588j76787k07842k05993j90676
$$ 759787083 759666562 759550393 759406209 759212434 759014606 758844018 758667231 758459389 758253396 758062720
2410.8G58062720k26140k75314k57909k19047k52902l13044l09169k67566k70783l34621
$$ 758062720 757836580 757561266 757303357 757084310 756831408 756518364 756209195 755941629 755670846 755336225
2431.2G55336225l70443l36289l14236l38077l41416l34263l78787m33088m23193l64542
$$ 755336225 754965782 754629493 754315257 753977180 753635764 753301501 752922714 752489626 752066433 751701891
2451.5G51701891l61561m12464m24624m01020l98934m16815m10080l95477m16160m50432
$$ 751701891 751340330 750927866 750503242 750102222 749703288 749286473 748876393 748480916 748064756 747614324
2471.9G47614324m53532m29392m19437m46141m62949m38750m29273m53412m60864m35829
$$ 747614324 747160792 746731400 746311963 745865822 745402873 744964123 744534850 744081438 743620574 743184745
2492.3G43184745m33027m51625m44352m20571m01079m07994m40419m51207m27365m00603
$$ 743184745 742751718 742300093 741855741 741435170 741034091 740626097 740185678 739734471 739307106 738906503
2512.7G38906503l95119m05372m06026l96550l95000m07577m17113m07636l91543l69191
$$ 738906503 738511384 738106012 737699986 737303436 736908436 736500859 736083746 735676110 735284567 734915376
2533.1G34915376l56794l69489l81827l91722m15504m08888l62217l45171l64363l78311
$$ 734915376 734558582 734189093 733807266 733415544 733000040 732591152 732228935 731883764 731519401 731141090
2553.5G31141090l75628l66807l72052l95954l96430l61264l45707l59118m04060m66526
$$ 731141090 730765462 730398655 730026603 729630649 729234219 728872955 728527248 728168130 727764070 727297544
2573.9G27297544m80532m67479m69864m51982m41909m93705n34058n21421n08249n19693
$$ 727297544 726817012 726349533 725879669 725427687 724985778 724492073 723958015 723436594 722928345 722408652
2594.3G22408652n47647n56648n54562n83171o13571o14583o28471o61850o74367o82056
$$ 722408652 721861005 721304357 720749795 720166624 719553053 718938470 718309999 717648149 716973782 716291726
2614.7G16291726p18773p60019p71761p72476p82788q20815q77917q74221q32439q58485
$$ 716291726 715572953 714812934 714041173 713268697 712485909 711665094 710787177 709912956 709080517 708222032
2635.1G08222032r19462r24229r15528r49084r68993r53853r49025r62854r75370r74179
$$ 708222032 707302570 706378341 705462813 704513729 703544736 702590883 701641858 700679004 699703634 698729455
2655.5F98729455r58800r51290r69470r67979r22084q99851r01759q74877q58426q55863
$$ 698729455 697770655 696819365 695849895 694881916 693959832 693059981 692158222 691283345 690424919 689569056
2675.9F89569056q24273p99715q07405q16822p91430p43032p26282p28369p12991o99222
$$ 689569056 688744783 687945068 687137663 686320841 685529411 684786379 684060097 683331728 682618737 681919515
2696.3F81919515o97255o90162o79493o59108o36936o54876o83129o68346o45280o47128
$$ 681919515 681222260 680532098 679852605 679193497 678556561 677901685 677218556 676550210 675904930 675257802
2716.7F75257802o47545o27875o02484o10769o50108o51478o01590n62131n63026n73516
$$ 675257802 674610257 673982382 673379898 672769129 672119021 671467543 670865953 670303822 669740796 669167280
2737.1F69167280n71012n69165n75423n89013n93543n91994o20842o62923o75261o65962
$$ 669167280 668596268 668027103 667451680 666862667 666269124 665677130 665056288 664393365 663718104 663052142
2757.5F63052142o70374o96480p28607p53284p80761q15690q28564q26895q39055q79406
$$ 663052142 662381768 661685288 660956681 660203397 659422636 658606946 657778382 656951487 656112432 655233026
2777.9F55233026r38237r66668r74655r87947r92537j009464j063705j126587j138330
$$ 655233026 654294789 653328121 652353466 651365519 650372982 649363518 648299813 647173226 646034896
2796.2F46034896j136899j193404j261115j299202j336754j378298j418411j466036
$$ 646034896 644897997 643704593 642443478 641144276 639807522 638429224 637010813 635544777
2812.5F35544777j494050j516223j585603j664936j703978j766264j883984j955390
$$ 635544777 634050727 632534504 630948901 629283965 627579987 625813723 623929739 621974349
2828.9F21974349j975119k015829k041400k003669j961351j985252k009272j969099
$$ 621974349 619999230 617983401 615942001 613938332 611976981 609991729 607982457 606013358
2845.2F06013358j946390j988769k022564k024174k037823k081215k173722k276957
$$ 606013358 604066968 602078199 600055635 598031461 595993638 593912423 591738701 589461744
2861.5E89461744k327502k353549k381086k345801k222418k109945k047122j929223
$$ 589461744 587134242 584780693 582399607 580053806 577831388 575721443 573674321 571745098
2877.8E71745098j714647j491606j358748j290321j194537j100719j040578r55641
$$ 571745098 570030451 568538845 567180097 565889776 564695239 563594520 562553942 561598301
2894.1E61598301q65161q48353q71241q70526q77261r28045r80794r72033r50038j018167
$$ 561598301 560733140 559884787 559013546 558143020 557265759 556337714 555356920 554384887 553434849 552416682
2914.5E52416682j110375j078486r58800q30055o68049m63783k56479j24574n96K73049
$$ 552416682 551306307 550227821 549269021 548438966 547770917 547307134 547050655 546926081 546925485 547198534
2934.9E47198534O34611R81271J343608J709819J994252K179384K352476K540708K662003
$$ 547198534 547833145 548814416 550158024 551867843 553862095 556041479 558393955 560934663 563596666
2953.3E63596666K714038K753973K785086K773047K665579K482474K323866K202153
$$ 563596666 566310704 569064677 571849763 574622810 577288389 579770863 582094729 584296882
2969.6E84296882K089679J962722J784742J662552J618803J467943J240015J128077
$$ 584296882 586386561 588349283 590134025 591796577 593415380 594883323 596123338 597251415
2985.9E97251415J098454J047910R09507O84023N15401L50833J25349k0683j34647
$$ 597251415 598349869 599397779 600307286 600991309 601506710 601857543 601982892 601962209 601827562
3004.3F01827562k95818l68834l85284n57363q36074j013875j073778j130044j203001
$$ 601827562 601531744 601162910 600777626 600220263 599384189 598370314 597296536 596166492 594963491
3022.6E94963491j269221j333237j349986j312255j290381j392007j526833j483858
$$ 594963491 593694270 592361033 591011047 589698792 588408411 587016404 585489571 584005713
3038.9E84005713j403272j491546j651526j720249j647711j583696j634657j677513
$$ 584005713 582602441 581110895 579459369 577739120 576091409 574507713 572873056 571195543
3055.3E71195543j711011j753211j695633j584709j541257j616954j754344j800537
$$ 571195543 569484532 567731321 566035688 564450979 562909722 561292768 559538424 557737887
3071.6E57737887j705885j552463j474857j592278j757443j786828j764775j712501
$$ 557737887 556032002 554479539 553004682 551412404 549654961 547868133 546103358 544390857
3087.9E44390857j670062j758755j811385j668989j538039j601874j721502j695633
$$ 544390857 542720795 540962040 539150655 537481666 535943627 534341753 532620251 530924618
3104.2E30924618j556873j522899j637459j628100j440525j377762j529455j753867
$$ 530924618 529367745 527844846 526207387 524579287 523138762 521761000 520231545 518477678
3120.5E18477678j875639j785516j598597j489282j536905j610518j528025j390516
$$ 518477678 516602039 514816523 513217926 511728644 510191739 508581221 507053196 505662680
3136.8E05662680j425743j610697j664757j558811j476854j372904j272678j379520
$$ 505662680 504236937 502626240 500961483 499402672 497925818 496552914 495280236 493900716
3153.2D93900716j571804j579702j468599j411706j431286j446426j412958j386434
$$ 493900716 492328912 490749210 489280611 487868905 486437619 484991193 483578235 482191801
3169.5D82191801j382321j366079j345724j331746j318127j319617j310259j286418
$$ 482191801 480809480 479443401 478097677 476765931 475447804 474128187 472817928 471531510
3185.8D71531510j275062j267731j255721j245529j269310j275540j223326j182556
$$ 471531510 470256448 468988717 467732996 466487467 465218157 463942617 462719291 461536735
3202.1D61536735j177102j184970j177132j151890j156390j147866j091212j071870
$$ 461536735 460359633 459174663 457997531 456845641 455689251 454541385 453450173 452378303
3218.4D52378303j087696j083910j060218j015752r66966r14246q82089r73225j095712
$$ 452378303 451290607 450206697 449146479 448130727 447163761 446249515 445367426 444394201 443298489
3236.8D43298489j046389r13948q41976q18967q50767q99434q67188p80106p43687
$$ 443298489 442252100 441338152 440496176 439677209 438826442 437927008 437059820 436279714 435536027
3255.1D35536027p72268p89165p80463p71940p14749n81145m99815o24895p90954p99388
$$ 435536027 434763759 433974594 433194131 432422191 431707442 431126297 430626482 430001587 429210633 428411245
3275.5D28411245p53730p29680p02352o76363o74755o65933n88059n42939o35147p62105
$$ 428411245 427657515 426927835 426225483 425549120 424874365 424208432 423620373 423077434 422442287 421680182
3295.9D21680182q08269p61240o28561m84973n58973q26031r77993r61512q89510q29637
$$ 421680182 420871913 420110673 419482112 418997139 418438166 417612135 416634142 415672630 414783120 413953483
3316.3D13953483p90000p43270p12305p52151q61198q97020q44151q37058q14825p41511
$$ 413953483 413163483 412420213 411707908 410955757 410094559 409197539 408353388 407516330 406701505 405959994
3336.7D05959994p76261q84802r16481r21547q85964p94768q62479j046091j050353
$$ 405959994 405183733 404298931 403382450 402460903 401574939 400780171 399917692 398871601 397821248
3355.1C97821248q85308p59870p79092q19832p04647o04391p55131j006335j021624
$$ 397821248 396935940 396176070 395396978 394577146 393872499 393268108 392512977 391506642 390485018
3373.4C90485018q31097p27922p26401p64579p80314o71745m69535l13074m11868o90311
$$ 390485018 389653921 388925999 388199598 387435019 386654705 385982960 385513425 385200351 384788483 384098172
3393.8C84098172p21186l99947k11537m94778p91282o37174l63677l13074l83377m52220
$$ 384098172 383376986 382977039 382765502 382270724 381479442 380842268 380478591 380165517 379782140 379329920
3414.2C79329920m48823l70801l23057k73049j65999r0479o2705n2094L8087J09554
$$ 379329920 378881097 378510296 378187239 377914190 377748191 377657712 377595007 377542913 377581000 377690554
3434.6C77690554p7963l16084k82585q8543L1799P9721J14113J28329J51187K26736
$$ 377690554 377612591 377296507 377013922 376925379 376957178 377036899 377151012 377279341 377430528 377657264
3455C77657264L21955L42935K60473L13133N54263O19590L56168O3717P9334L09080
$$ 377657264 377979219 378322154 378582627 378895760 379450023 380069613 380425781 380489498 380568832 380877912
3475.4C80877912N30988N26190L22014L29822N22912N61595N10066N20617N66662O58124
$$ 380877912 381408900 381935090 382257104 382586926 383109838 383671433 384181499 384702116 385268778 385926902
3495.8C85926902O59645N52773N28843N60760N53519N62816P17372R40055Q84294O33806
$$ 385926902 386586547 387139320 387668163 388228923 388782442 389345258 390062630 391002685 391886979 392520785
3516.2C92520785O11216P97600R33736Q52496O97970P69556R89318J103013J142413
$$ 392520785 393132001 393929601 394863337 395715833 396413803 397183359 398172677 399275690 400418103
3534.5D00418103J143157J064837J069278J146018J124233J066566J091391J131951
$$ 400418103 401561260 402626097 403695375 404841393 405965626 407032192 408123583 409255534
3550.9D09255534J248628J370341J342535J346469J386612J134694Q76814J517177
$$ 409255534 410504162 411874503 413217038 414563507 415950119 417084813 417961627 419478804
3567.2D19478804K353668K125800J666933J668125J828462J981944K060294J845986
$$ 419478804 421832472 423958272 425625205 427293330 429121792 431103736 433164030 435010016
3583.5D35010016J550019J850337K416402K247780K013058K247601K485872K549827
$$ 435010016 436560035 438410372 440826774 443074554 445087612 447335213 449821085 452370912
3599.8D52370912K593219K348811J938909K136439K590030K633334K658963K511978
$$ 452370912 454964131 457312942 459251851 461388290 463978320 466611654 469270617 471782595
3616.1D71782595K625376L374219L270119K310336J602024K456695M077792L689080
$$ 471782595 474407971 477782190 481052309 483362645 484964669 487421364 491499156 495188236
3632.4D95188236L073901K982527K856910K854288K668440J970470J604617K951741
$$ 495188236 498262137 501244664 504101574 506955862 509624302 511594772 513199389 516151130
3648.8E16151130M535973L641486K676130L310144L542602K826214K406656K063036
$$ 516151130 520687103 524328589 527004719 530314863 533857465 536683679 539090335 541153371
3665.1E41153371J511872J808882K588391J917660K127409L354609K927244K317727
$$ 541153371 542665243 544474125 547062516 548980176 551107585 554462194 557389438 559707165
3681.4E59707165J882016J215697J088559J884938K404153K087355J626908J219273
$$ 559707165 561589181 562804878 563893437 565778375 568182528 570269883 571896791 573116064
3697.7E73116064R70662J299500J612008J012146L13580M86255J698136K229274J400709
$$ 573116064 574086726 575386226 576998234 578010380 578323960 578810215 580508351 582737625 584138334
3716.1E84138334O86943N52655O95049Q62658J112640R77755K49624j20103N77509
$$ 584138334 584825277 585377932 586072981 586935639 588048279 589026034 589275658 589155555 589733064
3734.4E89733064J740575J658976K63810n90205M83155J136780J79529P03633J924098
$$ 589733064 591473639 593132615 593396425 592806220 593289375 594426155 594605684 595309317 597233415
3752.8E97233415J350701M75466O19650J111686P89702L87430L72708N74529J044512
$$ 597233415 598584116 599059582 599679232 600790918 601580620 601968050 602340758 602915287 603959799
3771.1F03959799R81390M30584J75298M67479P35998N28455N17487O60718N70178L51309
$$ 603959799 604941189 605371773 605547071 606014550 606750548 607279003 607796490 608457208 609027386 609378695
3791.5F09378695R716m1664K3485j92643M77612R56655N04076R27210J009703Q3447
$$ 609378695 609388411 609346747 609370232 609177589 609655201 610611856 611115932 612043142 613052845 613136292
3811.9F13136292n57304j60098J05798k7537J008689J180172M59671K72811R2208J2875
$$ 613136292 612578988 612418890 612524688 612497151 613505840 614686012 615145683 615418494 615510702 615523577
3832.3F15523577n6863k02596K48849P99894Q88825Q96275M91261m95195j501024p51793
$$ 615523577 615466714 615264118 615512967 616312861 617201686 618097961 618589222 618094027 616593003 615841210
3852.7F15841210J896739J788556L28422l20017k22981K85804Q3208j81973M84824
$$ 615841210 617737949 619526505 619854927 619534910 619311929 619597733 619680941 619498968 619983792
3871.1F19983792P75397O53386J51098k98083J60515K82646L56078N20885l9220O8128
$$ 619983792 620759189 621412575 621563673 621265590 621426105 621708751 622064829 622585714 622546494 622614622
3891.5F22614622N97954J08063n79715n77390r8646N65112J052976P98046L19302O4493
$$ 622614622 623212576 623320639 622740924 622163534 622064888 622630000 623682976 624481022 624800324 624864817
3911.9F24864817k31207l40819L7014L10064J05560K1755J74761K0742j37865J59144
$$ 624864817 624633610 624292791 624329805 624639869 624745429 624767184 624941945 624962687 624824822 624983966
3932.3F24983966L87907J92285q5473k28465n9664J76311P6711L2067J85847J97351
$$ 624983966 625371873 625564158 625478685 625250220 625190556 625366867 625443578 625475645 625661492 625858843
3952.7F25858843P8023J9848M0770O8605P5459J7584j0372M0531N4598K8551M1962
$$ 625858843 625936866 625956714 625997484 626066089 626141548 626159132 626148760 626189291 626243889 626272440 626314402
3975.1F26314402P5400M1007O736M4584L7551m2617n3943K2352Q2374R2149M2915
$$ 626314402 626389802 626430809 626437545 626482129 626519680 626477063 626423120 626445472 626527846 626619995 626662910
3997.5F26662910
$$ 626662910
##END=$$ End of the data block
