##TITLE=DI 14-11415226-6 Fibre gum BIO L $$ Begin of the data block
##JCAMP-DX=5.00 $$ ACD/SpecManager v 10.08
##SPECTROMETER/DATA SYSTEM=Alpha
##DATE=10 Jul 2014 09:05:02
##DATA TYPE=INFRARED SPECTRUM
##DATA CLASS=XYDATA
##ORIGIN=
##OWNER=
##NPOINTS=1765
##FIRSTX=399.75695801
##LASTX=3997.56933594
##MAXX=3997.56933594
##MINX=399.75695801
##MAXY=0.78667873
##MINY=0.36988962
##XFACTOR=1.0000000000
##YFACTOR=1.000000000000000e-9
##FIRSTY=0.56437147
##DELTAX=2.03957629
##XUNITS=1/CM
##YUNITS=ARBITRARY UNITS
##XYDATA=(X++(Y..Y))
399.8E64371467q91567j502454p31885J97231k23636o55890q1002O4313j009107j365900
$$ 564371467 563479900 561977446 561245561 561442792 561219156 560563266 560482264 560546577 559537470 558171570
420.2E58171570j84953m65214j525939p61985J78575q63910j385629P7784L52562j147449
$$ 558171570 557986617 557521403 555995464 555233479 555412054 554548144 553162515 553240299 553592861 552445412
440.5E52445412j103461L38197m2141r77933K06291J222253p510p23898M32491L93212
$$ 552445412 551341951 551680148 551638007 550660074 550866365 552088618 552081108 551357210 551789701 552182913
460.9E52182913j002610o36458P11679K3663j008093J29640Q88944m38929q02338P78556
$$ 552182913 551180303 550543845 551255524 551279187 550271094 550400734 551289678 550850749 550048411 550826967
481.3E50826967Q60214q89719o52790Q90613J45733j371145n07474M94480o87301j403272
$$ 550826967 551687181 550797462 550144672 551035285 551181018 549809873 549302399 549796879 549109578 547706306
501.7E47706306j16885M3214j476229j329481J14739l11494j537919p98285P9214j063168
$$ 547706306 547589421 547632635 546156406 544826925 544941664 544630170 543092251 542293966 542373180 541310012
522.1E41310012j642644l42608K0981j229584j144409K94268L1114j280725o73831
$$ 541310012 539667368 539324760 539345741 538116157 536971748 537266016 537297130 536016405 535342574
540.5E35342574O31631j7524r22740J35064R37343r2387l98994R52423J194060o5029
$$ 535342574 535974205 535956681 535033941 535169005 536106348 536013961 535614967 536567390 537761450 537696421
560.9E37696421j371J281739R22322m87030p7069J042247L47376n63443L07858R05574
$$ 537696421 537695050 538976789 539899111 539412081 539335012 540377259 540724635 540161192 540469050 541374624
581.3E41374624k61963r11593J48356M36067q78214j202941j52052j35541j051306
$$ 541374624 541112661 540201068 540349424 540785491 539907277 538704336 538552284 538416743 537365437
599.6E37365437o36578M41194q5354j062513m40716K81035m51386p66515O67095J590729
$$ 537365437 536728859 537170053 537084699 536022186 535581470 535862505 535411119 534644604 535311699 536902428
620E36902428Q15987P73192K086281K188564J006007J183927K242386J670540N67853
$$ 536902428 537718415 538491607 540577888 542766452 543772459 544956386 547198772 548869312 549437165
638.4E49437165J298368K200842J094282J34408J190305J725614M06206J6331J296878
$$ 549437165 550735533 552936375 554030657 554165065 555355370 557080984 557487190 557503521 558800399
656.7E58800399J415968J28865K77579J268626N96702j84834J677036K559185J385927
$$ 558800399 560216367 560345232 560622811 561891437 562488139 562303305 563980341 566539526 567925453
675.1E67925453M63546J523494K125204P86364J77264J201153J042545n51224o69181
$$ 567925453 568388999 569912493 572037697 572824061 573001325 574202478 575245023 574693799 574024618
693.5E74024618L65376k03669j462698q92579J56044n23984j190126K325R52899K89560
$$ 574024618 574389994 574186325 572723627 571831048 571987092 571463108 570272982 570275307 571228206 571517766
713.8E71517766M41253K316832L357113K927124L419042M781425M442453K934933K874553
$$ 571517766 571959019 574275851 577632964 580560088 583979130 588760555 593203008 596137941 599012494
732.2E99012494L411293K237499Q06749J349866J932025O96540j50085P15375Q95381
$$ 599012494 602423787 604661286 605468035 606817901 608749926 609446466 609296381 610011756 610907137
750.6F10907137m63903r40024j59085n57482k029241k112865j305878j791835k566516
$$ 610907137 610443234 609503210 609344125 608786643 606757402 604644537 603338659 601546824 598980308
768.9E98980308j447022L00467O04450Q85308K604902L778815L175676K929151L935814
$$ 598980308 597533286 597833753 598438203 599323511 601928413 605707228 608882904 611812055 615747869
787.3F15747869M074037K938986K783000L520489K746880R34005N53846J042962L68178
$$ 615747869 619821906 622760892 625543892 629064381 631811261 632745266 633299112 634342074 634710252
805.6F34710252l19540R67145K677023K881348L246308M974425N709052M277646K954543
$$ 634710252 634390712 635357857 638034880 640916228 644162536 649136961 654846013 659123659 662078202
824F62078202K486050P48157k151072l498494l132165l128588k890885n68747K338111
$$ 662078202 664564252 665312409 663161337 659662843 656530678 653402090 650511205 649942458 652280569
842.3F52280569L355324L397704M008591L778159J792550K72990K96533j72913j709521
$$ 652280569 655635893 659033597 663042188 666820347 668612897 668885887 669182420 669009507 667299986
860.7F67299986k271474j769185k310752l660799l766894l090262l433049l949344
$$ 667299986 665028512 663259327 660948575 657287776 653520882 650430620 646997571 643048227
877F43048227l028155j828610j751781j583576m14670J47522p30515j366496j029253
$$ 643048227 640020072 638191462 636439681 634856105 634441435 634588957 633858442 632491946 631462693
895.4F31462693j179695j990795j877666r72092q32021j128912m17292O72042N89907
$$ 631462693 630282998 628292203 626414537 625442445 624610424 623481512 623064220 623736262 624326169
913.7F24326169p9393k08437o49572k169490l549754l944934m398405n421221n971432
$$ 624326169 624246776 624038339 623388767 621219277 617669523 613724589 609326184 603904963 597933531
932.1E97933531n865455o196380p009625p189333o741405o667614o786585o273269
$$ 597933531 592068076 585871696 578862071 571672738 564931333 558263719 551477134 545203865
948.4E45203865n645335n838454o313980o207943o030797o343365o398201n656690
$$ 545203865 539558530 533720076 527406096 521198153 515167356 508823991 502425790 496769100
964.7D96769100m898071m653901m319995l650278l374160l638893l604472l104210
$$ 496769100 491871029 487217128 482897133 479246855 475872695 472233802 468629330 465525120
981D65525120k926230l136367k993077k604603k708853l043383k914459k697706k934932
$$ 465525120 462598890 459462523 456469446 453864843 451155990 448112607 445198148 442500442 439565510
999.4D39565510l180117k987295k841085l107548l166199k647489k188087k131641
$$ 439565510 436385393 433398098 430557013 427449465 424283266 421635777 419447690 417316049
1015.7D17316049j879125j298249j051963j188397j073271o87003o13570p48903n34028
$$ 417316049 415436924 414138675 413086712 411898315 410825044 410138041 409524471 408775568 408241540
1034.1D08241540k13206l68565o70940n92768n06908p87377r55075o85125n03779o55502
$$ 408241540 408028334 407659769 406988829 406396061 405889153 405101776 404146701 403461576 402957797 402302295
1054.5D02302295o02841k26468j05739k88278k54541k2352o7264k30581M3571N35846
$$ 402302295 401699454 401472986 401367247 401078969 400824428 400802076 400734812 400504231 400547802 401083648
1074.8D01083648P73102J034916J679867K263397K398759K541125L015578L366113
$$ 401083648 401856750 402891666 404571533 406834930 409233689 411774814 414790392 418156505
1091.2D18156505L387987L563494L948718M013717L695548L470480L332585K826810
$$ 418156505 421544492 425107986 429056704 433070421 436765969 440236449 443569034 446395844
1107.5D46395844K070397J599759J375050J012325P16209Q63970J147419J152485J121581
$$ 446395844 448466241 450066000 451441050 452453375 453169584 454033554 455180973 456333458 457455039
1125.8D57455039J294732J371414J052290N27113R6500l33368p37846p08670k51978
$$ 457455039 458749771 460121185 461173475 461700588 461797088 461463720 460725874 460017204 459765226
1144.2D59765226J86145N78672J208394J930595K373099K641171L048778L450245L619045
$$ 459765226 459951371 460530043 461738437 463669032 466042131 468683302 471732080 475182325 478801370
1162.6D78801370L773302M103392M410535M565597M784196N249918N735218O024420
$$ 478801370 482574672 486678064 491088599 495654196 500438392 505688310 511423528 517447948
1178.9E17447948O372095O912946P259250P210732P049500O832660O233930N273223
$$ 517447948 523820043 530732989 537992239 545202971 552252471 559085131 565319061 570592284
1195.2E70592284M406393L700673K837479J914144J375616J141190P26581K38836J03235
$$ 570592284 574998677 578699350 581536829 583450973 584826589 585967779 586694360 586933196 587036431
1213.5E87036431J00136j95086n01454m50313m00842o69658q60989p40886p48813j022279
$$ 587036431 587136567 586941481 586440027 585989714 585588872 584919214 584058225 583317339 582568526 581546247
1233.9E81546247j074493q44955q16644r61005q27313n06103m45902n15938k87235
$$ 581546247 580471754 579626799 578810155 577849150 577021837 576515734 576069832 575553894 575266659
1252.3E75266659L3736Q5533J84059O66380J135111J231372J333237J668871J759767
$$ 575266659 575300395 575385928 575569987 576236367 577371478 578602850 579936087 581604958 583364725
1270.6E83364725J419962J171886J137972Q35717L23534J55807J99198r1731n33462
$$ 583364725 584784687 585956573 587094545 587930262 588253796 588409603 588608801 588517070 587983608
1289E87983608o02007m92870o04630o38783k92838k980j05440j89364j5140K1219j71661
$$ 587983608 587381601 586888731 586284101 585645318 585352480 585349500 585244060 585054696 585039556 585060775 584889114
1311.4E84889114j33395J99973L26813J82032K15709L27349P8678l06010m17292m62115
$$ 584889114 584755719 584955692 585282505 585464537 585680246 586007595 586086273 585780263 585362971 584900856
1331.8E84900856p19547q96871q12650q24094r40084p64013l51727j49786k85328l57329
$$ 584900856 584181309 583284438 582471788 581647694 580707610 579943597 579591870 579442084 579156756 578799427
1352.2E78799427l01958n08368q69989j056254j341283j769424j875043j679360j329422
$$ 578799427 578497469 577989101 577119112 576062858 574721575 572952151 571077108 569397748 568068326
1370.6E68068326j096726r83596n25713Q762J26064K91586J028001J652956J312673
$$ 568068326 566971600 565988004 565462291 565471053 565597117 565888703 566916704 568569660 569882333
1388.9E69882333P34389M65274n0783p77126j275181j386464j467645j906395k070427
$$ 569882333 570616722 571081996 571031213 570254087 568978906 567592442 566124797 564218402 562147975
1407.3E62147975j893580j957715j941680j481832j232802j603663j401365o67274
$$ 562147975 560254395 558296680 556355000 554873168 553640366 552036703 550635338 549968064
1423.6E49968064k16127R9063M19975Q59439J330137J613975J627922J626611J756966
$$ 549968064 549751937 549851000 550270975 551130414 552460551 554074526 555702448 557329059 559086025
1442E59086025J719951J681388J599669J302600J214445J598775K147675J957476J617014
$$ 559086025 560805976 562487364 564087033 565389633 566604078 568202853 570350528 572308004 573925018
1460.3E73925018K238870L100336L254056L261864M069209N132258M908323M390895
$$ 573925018 576163888 579264224 582518280 585780144 589849353 594981611 599889934 604280829
1476.6F04280829M510999M687786M718364M766702N101323N172789M537225L849447
$$ 604280829 608791828 613479614 618197978 622964680 628066003 633238792 637776017 641625464
1493F41625464M006147M238248L575981L068209L100991L606021L729701K257049J627803
$$ 641625464 645631611 649869859 653445840 656514049 659615040 663221061 666950762 669207811 670835614
1511.3F70835614J876950K283454K519310K239585J910269J540363J357675J174747
$$ 670835614 672712564 674996018 677515328 679754913 681665182 683205545 684563220 685737967
1527.6F85737967J033545J368940J378715R43005J200855J599312M20153n44727m75347
$$ 685737967 686771512 688140452 689519167 690462172 691663027 693262339 693682492 693137765 692662418
1546F92662418j89662k36631m45544l25144m0888r41158l370821l077924k722323l240347
$$ 692662418 692472756 692236125 691790581 691465437 691424549 690483391 687112570 684034646 681312323 678071976
1566.4F78071976m201353n653977n701900o173372q823693r233415q362710q807838
$$ 678071976 673870623 668216646 662514746 656341374 647517681 638284266 629921556 621113718
1582.7F21113718r009123q780182q468210p990718p291138o638885n912781n002260
$$ 621113718 612104595 603324413 594856203 586865485 579574347 572935462 567022681 562020421
1599E62020421m186749l528953k830386k142370j663506j243174o98328l79980n20825
$$ 562020421 557833672 554304719 551474333 549331963 547668457 546425283 545726955 545346975 544826150
1617.4E44826150j93954L48509L91245K00748J59383K81632P86781J503110J815498
$$ 544826150 544632196 544980705 545371950 545572698 545732081 546013713 546800494 548303604 550119102
1635.7E50119102J412928J313686J729489K256512K792359K727985K319336K959550
$$ 550119102 551532030 552845716 554575205 556831717 559624076 562352061 564671397 567630947
1652E67630947L403902K309680K363622L069639L557921L531634L402591L956378M280865
$$ 567630947 571034849 573344529 575708151 578777790 582335711 585867345 589269936 593226314 597507179
1670.4E97507179L737449L943384M240692L900349M017532M743457N311727M147768
$$ 597507179 601244628 605188012 609428704 613329053 617346585 622090042 627401769 631549537
1686.7F31549537L585994L893257L754615M090548M228175L529310K980113K080858
$$ 631549537 635135531 639028788 642783403 646873951 651102126 654631436 657611549 659692407
1703F59692407J596868J157224N43773M14550M40181J64330n41449r91106o37352k18988
$$ 659692407 661289275 662446499 662990272 663404822 663845003 664009333 663467884 662476778 661839426 661620438
1723.4F61620438K61009R33111J532077J911760K430916K391040J972496K256871K564788
$$ 661620438 661881447 662814558 664346635 666258395 668689311 671080351 673052847 675309718 677874506
1741.8F77874506K682507K892851L232479L674865L682912L310203L472030L661335
$$ 677874506 680557013 683449864 686682343 690357208 694040120 697350323 700822353 704483688
1758.1G04483688L329456L050744K648771K478182K521217K400816K226114J717865
$$ 704483688 707813144 710863888 713512659 715990841 718512058 720912874 723138988 724856853
1774.4G24856853J290501J377403J589597J494050J258850J195490J355827J522303
$$ 724856853 726147354 727524757 729114354 730608404 731867254 733062744 734418571 735940874
1790.7G35940874J314878R20534R58562J100004J013994Q90315Q74340R18031R61959
$$ 735940874 737255752 738176286 739134848 740234852 741248846 742139161 743013501 743931532 744893491
1809.1G44893491R49204P94232O88911P47144Q52585Q69095Q41260Q26895Q20041P62403
$$ 744893491 745842695 746636927 747325838 748072982 748925567 749794662 750635922 751462817 752282858 753045261
1829.5G53045261M85420L99649N86570O23285N66602P12991Q48889N69582L00646L71873
$$ 753045261 753530681 753930330 754516900 755140185 755706787 756419778 757268667 757838249 758138895 758510768
1849.9G58510768M86315M89473M91679N29766N22971M79996N32985O76989O73533L73185
$$ 758510768 758997083 759486556 759978235 760508001 761030972 761510968 762043953 762720942 763394475 763767660
1870.3G63767660J81198L11255M36247M29928M00186M07815M02271L91722M25518L73423
$$ 763767660 763948858 764260113 764696360 765126288 765526474 765934289 766336560 766728282 767153800 767527223
1890.7G67527223K67207K54452K73467K73704K74599K78234L22759L51310K82645K06828
$$ 767527223 767794430 768048882 768322349 768596053 768870652 769148886 769471645 769822955 770105600 770312428
1911.1G70312428K38598L21865L24309K32637J93476J66238O2644J01805K12133J68025
$$ 770312428 770551026 770872891 771197200 771429837 771623313 771789551 771852195 771954000 772166133 772334158
1931.5G72334158R6262J40548K05993J85073J54912J24872P0095R775J2279J10924
$$ 772334158 772430420 772570968 772776961 772962034 773116946 773241818 773311913 773321688 773333967 773444891
1951.9G73444891J29700K8014J0133J04129R5010K4438O4313R3043j8239p3493K9147
$$ 773444891 773574591 773602605 773612738 773716867 773811877 773836315 773900628 773993671 773975432 773901939 773931086
1974.3G73931086Q4817Q345k1577P1287R4474Q344K444R0718M2439r0778m1008N4002
$$ 773931086 774015903 774024248 774002671 774073958 774168432 774176776 774179220 774269938 774312377 774221599 774180591 774234593
1998.8G74234593j7822j02818l6061Q881q6486j39594o1810j6511r7811j67966j38342
$$ 774234593 774216771 774113953 774077892 774086773 774000287 773860693 773798883 773782372 773684561 773516595 773378253
2021.2G73378253j28329j77324j62601j15156j39773j80900j48773j04547j34766j63555
$$ 773378253 773249924 773072600 772909999 772794843 772655070 772474170 772325397 772220850 772086084 771922529
2041.6G71922529j08063o6758j29342j47640p4506o8844j20699q3625j4127k6166m7326
$$ 771922529 771814466 771747708 771618366 771470726 771396220 771327376 771206677 771123052 771108925 771082759 771035433
2064G71035433j4007Q523l4809m4107K7537L7134n0426n0008N6684Q0585J1325k2530
$$ 771035433 771021426 771029949 770995140 770951033 770978570 771015704 770965278 770915270 770971954 771052539 771063864 771041334
2088.5G71041334l934j8597n5373m2140R894P510l6120k7060j0729l1293k8729K0444
$$ 771041334 771037400 771018803 770963430 770921290 770931184 770938694 770902574 770875514 770864785 770833492 770804763 770825207
2113G70825207K2054m4465o0320m530J1623k3842j2994L4869L3140J3948N0604P0751
$$ 770825207 770847261 770802796 770742476 770737946 770749569 770725727 770712733 770747602 770780742 770794690 770845294 770916045
2137.5G70916045K9266M470L8981P8917P9513P2538R2805J18077J23322J36315J60456
$$ 770916045 770945311 770949781 770988762 771067679 771147192 771219730 771312535 771430612 771553934 771690249 771850705
2159.9G71850705J73450J77323J83762K04026K29419K27570K13206K31147K45034K42055
$$ 771850705 772024155 772201478 772385240 772589266 772818685 773046255 773259461 773490608 773735642 773977697
2180.3G73977697K57492K50518K08974K14935K60829K59638K37644K59221K72035K38121
$$ 773977697 774235189 774485707 774694681 774909616 775170445 775430083 775667727 775926948 776198983 776437104
2200.7G76437104K29358K58863K72990K53379K32637K46525K59459K40683K33054K56300
$$ 776437104 776666462 776925325 777198315 777451694 777684331 777930856 778190315 778430998 778664052 778920352
2221.1G78920352K66195K66313K72811K65002K47181K40922K61127K77520K53141K13086
$$ 778920352 779186547 779452860 779725671 779990673 780237854 780478776 780739903 781017423 781270564 781483650
2241.5G81483650K13146K23756J96934J88053K13921K19345J92106J67489J76906J91510
$$ 781483650 781696796 781920552 782117486 782305539 782519460 782738805 782930911 783098400 783275306 783466816
2261.9G83466816J67787J60635J92582K00570J75237J70589J83642J78933J82152J77085
$$ 783466816 783634603 783795238 783987820 784188390 784363627 784534216 784717858 784896791 785078943 785256028
2282.3G85256028J43469J03175P2062O0916N3764L6478J8239R298m292l5703q2791
$$ 785256028 785399497 785502672 785574734 785635650 785689414 785725892 785744131 785753429 785749137 785713434 785630643
2304.7G85630643j42872j82927j59084j12474j25707k21252l52383l76701k22147j13606
$$ 785630643 785487771 785304844 785145760 785033286 784907579 784686327 784333944 783957243 783735096 783621490
2325.1G83621490j82331k35855j86265j14381q2910j07646j26362m4584K77221P05957
$$ 783621490 783439159 783203304 783017039 782902658 782819748 782712102 782585740 782541156 782818377 783524334
2345.5G83524334M48525l60190q77977q98898o79612l71098m8220J65879L12090N06938
$$ 783524334 783972859 783612669 782734692 781835794 781156182 780785084 780736864 780902743 781214833 781721771
2365.9G81721771O57677O62387O37591O57081O35684N46634M62592L78072K42352P6890
$$ 781721771 782379448 783041835 783679426 784336507 784972191 785518825 785981417 786359489 786601841 786678731
2386.3G86678731l0815o3420r6082j41800j33216j17064j77085k11120j59323j48475
$$ 786678731 786647916 786584496 786488414 786346614 786213398 786096334 785919249 785708129 785548806 785400331
2406.7G85400331k10345k26259j79052j75000k25246k38359k38358k73467k86221k67029
$$ 785400331 785189986 784963727 784784675 784609675 784384429 784146070 783907712 783634245 783348024 783080995
2427.1G83080995k66433k96235l03983k76566k98798l56853l25620k67029l27230m08530
$$ 783080995 782814562 782518327 782214344 781937778 781638980 781282127 780956507 780689478 780362248 779953718
2447.5G79953718l79920l25620l45886l89635l88384l72291l77238l60667l26574l48032
$$ 779953718 779573798 779248178 778902292 778512657 778124273 777751982 777374744 777014077 776687503 776339471
2467.9G76339471l96371l90827l76523m27067m53532l90589l39866l73125m20391m04060
$$ 776339471 775943100 775552273 775175750 774748683 774295151 773904562 773564696 773191571 772771180 772367120
2488.3G72367120m00067m51743m37439l56853l50952l98934l93092l88265m22359m18961
$$ 772367120 771967053 771515310 771077871 770721018 770370066 769971132 769578040 769189775 768767416 768348455
2508.7G68348455l79502l61204l77894l93748l80993l75927l76939l43264l12268l51846
$$ 768348455 767968953 767607749 767229855 766836107 766455114 766079187 765702248 765358984 765046716 764694870
2529G64694870m08113l82126l31282l41714l60310l41713l40462l61502l55304l41475
$$ 764694870 764286757 763904631 763573349 763231635 762871325 762529612 762189150 761827648 761472344 761130869
2549.4G61130869l38554l37660l37720l24071l31938l78668l82364l37422l29316l52859
$$ 761130869 760792315 760454655 760116935 759792864 759460926 759082258 758699894 758362472 758033156 757680297
2569.8G57680297l66330l92437m15623m13835m25339m36604m39167m55261m60088m63068
$$ 757680297 757313967 756921530 756505907 756092072 755666733 755230129 754790962 754335701 753875613 753412545
2590.2G53412545m90010n25594n45800n44607n41747n54144n79357n99742o16730o56664
$$ 753412545 752922535 752396941 751851141 751306534 750764787 750210643 749631286 749031544 748414814 747758150
2610.6G47758150o82652o72161o76454p06493p39992p73549q11100q27134q11577q17239
$$ 747758150 747075498 746403337 745726883 745020390 744280398 743506849 742695749 741868615 741057038 740239799
2631G40239799q38697q31306q40902q96096r52960r53257r01758r11951r75788r57906
$$ 740239799 739401102 738569796 737728894 736832798 735879838 734926581 734024823 733112872 732137084 731179178
2651.4G31179178r07362r36508r78410r53376r07004q80063q66592q67665q77261q71420
$$ 731179178 730271816 729335308 728356898 727403522 726496518 725616455 724749863 723882198 723004937 722133517
2671.8G22133517q40664q09967p95424p90477p88093p83026p81953p61926p12574o91950
$$ 722133517 721292853 720482886 719687462 718896985 718108892 717325866 716543913 715781987 715069413 714377463
2692.2G14377463p12991p19607o90579o81937p18892p02798o32226o25015o51419o45161
$$ 714377463 713664472 712944865 712254286 711572349 710853457 710150659 709518433 708893418 708241999 707596838
2712.6G07596838o48498o73652o79910o43253o12378o42300o69360o50406o29723o20008
$$ 707596838 706948340 706274688 705594778 704951525 704339147 703696847 703027487 702377081 701747358 701127350
2733G01127350n93841n46455n41687n85914n90384n69224n94795o44028o60002o45876
$$ 701127350 700533509 699987054 699445367 698859453 698269069 697699845 697105050 696461022 695801020 695155144
2753.4F95155144o46711o80327p24018p41481p38860p61449q09908q46803q49128q48353
$$ 695155144 694508433 693828106 693104088 692362607 691623747 690862298 690052390 689205587 688356459 687508106
2773.8F87508106r03308r69172r72807r61125r93788j032114j025617j035691j126051
$$ 687508106 686604798 685635626 684662819 683701694 682707906 681675792 680650175 679614484 678488433
2792.2F78488433j208484j210570j218140j293898j354635j360595j373231j411021
$$ 678488433 677279949 676069379 674851239 673557341 672202706 670842111 669468880 668057859
2808.5F68057859j482964j583218j643181j655757j694561j791417j893163j954079
$$ 668057859 666574895 664991677 663348496 661692739 659998178 658206761 656313598 654359519
2824.8F54359519k014994k093971k154469k203882k240539k232909k217233k224624
$$ 654359519 652344525 650250554 648096085 645892203 643651664 641418755 639201522 636976898
2841.1F36976898k216280k223015k250433k249538k245665k244592k265096k342939
$$ 636976898 634760618 632537603 630287170 628037632 625791967 623547375 621282279 618939340
2857.4F18939340k446592k536297k613246k681375k690970k602697k464712k365827
$$ 618939340 616492748 613956451 611343205 608661830 605970860 603368163 600903451 598537624
2873.7E98537624k297223k139747j899183j705467j581610j462936j334131j226067
$$ 598537624 596240401 594100654 592201471 590496004 588914394 587451458 586117327 584891260
2890.1E84891260j125157j002372r27507r51291r56952q97586q78394r24528r75787
$$ 584891260 583766103 582763731 581836224 580884933 579927981 579030395 578152001 577227473 576251686
2908.4E76251686r86219r90331j064897j141786j120210j036763q84771o60897m24385
$$ 576251686 575265467 574275136 573210239 572068453 570948243 569911480 569026709 568365812 567941427
2926.8E67941427k28524j01984Q2434M04000P71999J158834J576304J934111K193988
$$ 567941427 567712903 567610919 567693353 568097353 568869352 570028186 571604490 573538601 575732589
2945.1E75732589K436161K678513K888441K989233K991855L027320L052473K978444
$$ 575732589 578168750 580847263 583735704 586724937 589716792 592744112 595796585 598775029
2961.4E98775029K840996K663791K462566K280772K170503K074659J922369J863360
$$ 598775029 601616025 604279816 606742382 609023154 611193657 613268316 615190685 617054045
2977.8F17054045J902044J793504J583695J480997J438796J355112J194000R41932
$$ 617054045 618956089 620749593 622333288 623814285 625253081 626608193 627802193 628744125
2994.1F28744125O98746M62949K15590P6175l0041k25842l62098l60132m74274q01980
$$ 628744125 629442871 629905820 630121410 630197585 630167544 629941702 629579604 629219472 628745198 627943218
3014.5F27943218j067162j151860j214444j282692j312256j377702j447081j426041
$$ 627943218 626876056 625724196 624509752 623227060 621914804 620537102 619090021 617663980
3030.8F17663980j376570j484573j692712j666903j503230j568377j790583j859247
$$ 617663980 616287410 614802837 613110125 611443222 609939992 608371615 606581032 604721785
3047.1F04721785j738489j724005j852572j851558j823307j898527j875519j736761
$$ 604721785 602983296 601259291 599406719 597555161 595731854 593833327 591957808 590221047
3063.4E90221047j674771j805842j980960j975894j866639j741946j615285j675010
$$ 590221047 588546276 586740434 584759474 582783580 580916941 579174995 577559710 575884700
3079.7E75884700j902223k023637k002835j921475j878500j970411k018094j905203
$$ 575884700 573982477 571958840 569956005 568034530 566156030 564185619 562167525 560262322
3096E60262322j786232j797974j902401j919568j812219j721025j761138j796007j668513
$$ 560262322 558476090 556678116 554775715 552856147 551043928 549322903 547561765 545765758 544097245
3114.4E44097245j565397j674354j944065k119243k014041j820267j755237j775444
$$ 544097245 542531848 540857494 538913429 536794186 534780145 532959878 531204641 529429197
3130.7E29429197j785338j753985j652062j590312j732767j887977j832008j681864
$$ 529429197 527643859 525889874 524237812 522647500 520914733 519026756 517194748 515512884
3147E15512884j545608j492620j621663j794041j808822j722574j648009j604378j610518
$$ 515512884 513967276 512474656 510852993 509058952 507250130 505527556 503879547 502275169 500664651
3165.4E00664651j634448j599580j555354j562089j554876j531482j526326j524627
$$ 500664651 499030203 497430623 495875269 494313180 492758304 491226822 489700496 488175869
3181.7D88175869j518875j491875j469940j493573j501858j460910j447737j468390
$$ 488175869 486656994 485165119 483695179 482201606 480699748 479238838 477791101 476322711
3198D76322711j449049j383781j339585j354575j382262j359850j313954j298160j292765
$$ 476322711 474873662 473489881 472150296 470795721 469413459 468053609 466739655 465441495 464148730
3216.4D64148730j279026j265496j262903j265675j250148j185268j062423r99064
$$ 464148730 462869704 461604208 460341305 459075630 457825482 456640214 455577791 454578727
3232.7D54578727j113504j229018j174360j077742j026570r84192r91255j046866j029969
$$ 454578727 453465223 452236205 451061845 449984103 448957533 447973341 446982086 445935220 444905251
3251.1D44905251r44108q89450q80867q94398r08315q91447q35210p32064o22332o86646
$$ 444905251 443961143 443071693 442190826 441296428 440388113 439496666 438661456 437929392 437307060 436620414
3271.4D36620414q62807r16928r02176q69602q11398q02010q08030p66755o91503o79105
$$ 436620414 435757607 434840679 433938503 433068901 432257503 431455493 430647463 429880708 429189205 428510100
3291.8D28510100p78556q86560r65237r66311q02517o20156o83368r56714j149535
$$ 428510100 427731544 426844984 425879747 424913436 424110919 423490763 422807395 421850681 420701146
3310.2D20701146j152784j073122j017898r91493r76086r55194r54598j053274j159728
$$ 420701146 419548362 418475240 417457342 416465849 415489763 414534569 413579971 412526697 411366969
3328.6D11366969j165002j113475j004606q91477r83387j197726j249790j220494j179159
$$ 411366969 410201967 409088492 408083886 407192409 406209022 405011296 403761506 402541012 401361853
3346.9D01361853j039356j045197j268268j345396j201749j066595j078546j099855
$$ 401361853 400322497 399277300 398009032 396663636 395461887 394395292 393316746 392216891
3363.2C92216891r50098q50886j024127j280576j298934j099706r57996r16391r25184
$$ 392216891 391266793 390415907 389391780 388111204 386812270 385712564 384754568 383838177 382912993
3381.6C82912993r39518q61764o60121m50075n18083q36283q84056n34207l27110n96553
$$ 382912993 381973475 381111711 380451590 380001515 379483432 378647149 377763093 377228886 376901776 376305223
3402C76305223r16273q14706n53429m55469m67807n31882n52744m44054l55989l50267
$$ 376305223 375388950 374574244 374020815 373565346 373097539 372565657 372012913 371568859 371212870 370862603
3422.4C70862603k79218j19418K385m5687n4360P2420q524k44945k53946m1693J57654
$$ 370862603 370583385 370463967 370466352 370420665 370366305 370438725 370430201 370185256 369931310 369889617 370047271
3444.8C70047271J92404J09673J33007K31415K86788L80337M94808M53115L97682N99325
$$ 370047271 370239675 370349348 370482355 370713770 371000558 371380895 371875703 372328818 372726500 373325825
3465.2C73325825P72625N41151J92046J84953M10169O37740O98865N19454M86910O97941
$$ 373325825 374098450 374639601 374831647 375016600 375426769 376064509 376763374 377282828 377769738 378467679
3485.6C78467679O98119N51880O27667P91162Q38548P80433P83444Q48233P15822N69672
$$ 378467679 379165798 379717678 380345345 381136507 381975055 382755488 383538932 384387165 385102987 385672659
3506C85672659P27534R57161J048178R92536Q74669Q64028J001031J219690J196652
$$ 385672659 386400193 387357354 388405532 389398068 390272737 391136765 392137796 393357486 394554138
3524.4C94554138R66460R64552J116633J225531J358331J363963J228868J333178J602292
$$ 394554138 395520598 396485150 397601783 398827314 400185645 401549608 402778476 404111654 405713946
3542.7D05713946J641124J348823J154215J341849J549035J552850J574666J710951
$$ 405713946 407355070 408703893 409858108 411199957 412748992 414301842 415876508 417587459
3559D17587459J776099J686454J826495K283990K219469J774102J732707J994491K237558
$$ 417587459 419363558 421050012 422876507 425160497 427379966 429154068 430886775 432881266 435118824
3577.4D35118824K404303K416670K353609K522736K754659K529889K304584K567649
$$ 435118824 437523127 439939797 442293406 444816142 447570801 450100690 452405274 454972923
3593.7D54972923K807706K861679K973825K889186K589792K662718L167302L303885
$$ 454972923 457780629 460642308 463616133 466505319 469095111 471757829 474925131 478229016
3610D78229016L164083L096998K949833L398270L804087K998949K219975K552658M227281
$$ 478229016 481393099 484490097 487439930 490838200 494642287 497641236 499861211 502413869 506641150
3628.4E06641150M565536L039718K771378L052115L135145L198266K975464K717197
$$ 506641150 511206686 514246404 517017782 520069897 523205042 526403308 529378772 532095969
3644.7E32095969L391385M948437M489183K338827K295852L493190L233969K553224
$$ 532095969 535487354 540435791 544924974 547263801 549559653 553052843 556286812 558840036
3661E58840036K442480K236366K298415L283798L233731K212167L179788L192485J642465
$$ 558840036 561282516 563518882 565817297 569101095 572334826 574546993 577726781 580919266 582561731
3679.4E82561731J384497J440167J527131K552986L341854K065122Q87215Q90732J132190
$$ 582561731 583946228 585386395 586913526 589466512 592808366 594873488 595760703 596651435 597783625
3697.7E97783625J533151K055526J597166P60078R02772J877427K451062J325250K90096
$$ 597783625 599316776 601372302 602969468 603729546 604632318 606509745 608960807 610286057 610576153
3716.1F10576153M51743R33469J137137J153171J029313M84645L61383J255989K170325
$$ 610576153 611027896 611961365 613098502 614251673 615280986 615765631 616127014 617383003 619553328
3734.4F19553328J923382M16100p68781K03848K239168J244187K76446J754463J499534
$$ 619553328 621476710 621892810 621124029 621327877 623567045 624811232 625087678 626842141 628341675
3752.8F28341675j15335j02759Q45790Q42452K62022N01693Q30471J008332R00745
$$ 628341675 628226340 628123581 628969371 629811823 630073845 630575538 631406009 632414341 633315086
3771.1F33315086K03014r716N92470J154006O96719J94072M21107N00083M05669L24369
$$ 633315086 633518100 633508384 634100854 635254860 635951579 636145651 636566758 637066841 637472510 637796879
3791.5F37796879L09706O05166M47750N38766J367331N75482J85669Q50260M5419o99222
$$ 637796879 638106585 638711751 639159501 639698267 641065598 641641080 641826749 642677009 642722428 642023206
3811.9F42023206O9678J221716P48098P11024J211583O318l85880n7459M4406L05652
$$ 642023206 642092884 643314600 644062698 644773722 645985305 645991623 645605743 645548284 645592690 645898342
3832.3F45898342L96371Q05259J269638O17624O6399K1756m45128j012265n48721K048791
$$ 645898342 646294713 647099972 648369610 648987234 649053633 649075389 648630261 647617996 647069275 649118066
3852.7F49118066K930045j13428j248002n10990N07652O57201o5744L99530J045764
$$ 649118066 652048111 651934683 650686681 650175691 650683343 651340544 651274800 651674330 652720094
3871.1F52720094L61204k03490n18859P9632O63638K52605N36680J79708l65138M66048
$$ 652720094 653081298 652877808 652358949 652438581 653102219 653354824 653891504 654071212 653706074 654172122
3891.5F54172122L66807o14941l69727N47409R44674Q89659K93016m94599n33641k45094
$$ 654172122 654538929 653923988 653554261 654101670 655046344 655936003 656229019 655734420 655200779 654955685
3911.9F54955685j07646L07441O43015K57075j30415P3611J41085j30058Q7023M83811
$$ 654955685 654848039 655155480 655798495 656055570 655925155 655998766 656139851 656009793 656096816 656580627
3932.3F56580627J94609k44975k59638K921L03149J65820m0173J90973K51532k2591
$$ 656580627 656775236 656530261 656270623 656273544 656576693 656742513 656702340 656893313 657144845 657122254
3952.7F57122254j47223n8711M8936J23739J02401L457j1623L7551P7128J08004J08659
$$ 657122254 656975031 656916320 656965256 657088995 657191396 657194853 657183230 657220781 657297909 657405913 657514572
3975.1F57514572L1352k9206O4015J43647L8207m5657n365J5200L4272P5758N2869
$$ 657514572 657545924 657516718 657580733 657724380 657762587 657716930 657711565 657726765 657761037 657836795 657889664
3997.5F57889664
$$ 657889664
##END=$$ End of the data block
