##TITLE=DI - 15- 0973580-2 $$ Begin of the data block
##JCAMP-DX=5.00 $$ ACD/SpecManager v 10.08
##SPECTROMETER/DATA SYSTEM=Alpha
##DATE=22 Jun 2015 10:49:50
##DATA TYPE=INFRARED SPECTRUM
##DATA CLASS=XYDATA
##ORIGIN=
##OWNER=
##NPOINTS=1765
##FIRSTX=399.76428223
##LASTX=3997.64306641
##MAXX=3997.64306641
##MINX=399.76428223
##MAXY=0.77256036
##MINY=0.52525979
##XFACTOR=1.0000000000
##YFACTOR=1.000000000000000e-9
##FIRSTY=0.74145269
##DELTAX=2.03961372
##XUNITS=1/CM
##YUNITS=ARBITRARY UNITS
##XYDATA=(X++(Y..Y))
399.8G41452694p27534j72139o12258j10031J56939o03497k14040P02381M947j117110
420.2G38760352p67171o43909o02961K7955l44753q95143J0431J86860r40919o22451
440.6G34168291K51293m32372q05974k04444m72724q67784j35362j5736r74536r08256
461G29602396n64098q64446m88281K7299m29690p53403m89831o98984r50992n64515
481.3G23825455n75006j088918r81688p24733j068354j203954j060009j305818j282335
499.7G14534640q69155r01103r83059o25789n46336p94471n01036m6432j61946j10030
520.1G08995283L03685L03388J61827K90691L03805K41876L38793K57432J31846L92019
540.5G11720645M94123J88827J80126K78771K622m1663K08437P0930j32263M1365L5763
$$ y = [741452694, 740725160, 740553021, 739940763, 739830732, 739987671, 739384174, 739170134, 739872515, 739877462, 738760352, 737993181, 737349272, 736746311, 736774266, 736429513, 735534370, 735544801, 735731661, 734790742, 734168291, 734419584, 733987212, 733181238, 732976794, 732504070, 731636286, 731500924, 731485188, 730510652, 729602396, 729038298, 728173852, 727685571, 727712870, 727283180, 726529777, 726039946, 725340962, 724389970, 723825455, 723250449, 722161531, 721179843, 720455110, 719386756, 718182802, 717122793, 715816975, 714534640, 713665485, 712764382, 711781323, 711155534, 710609198, 709814727, 709313691, 709267259, 709105313, 708995283, 709298968, 709602356, 709764183, 710054874, 710358679, 710600555, 710939348, 711196780, 711328626, 711720645, 712214768, 712403595, 712583721, 712862492, 712865114, 712823451, 713031888, 713102818, 712970555, 713011920, 713047683]
562.9G13047683j36971K9981J11699o8128M9472J01149j29879P9811K90811j6510j0074
585.4G13349044L64781K76148J08302L96907M24326J08122J53542K45690K9207Q1658
605.8G15537727K24233n5135j04964J94729M4882M470O32346Q52049O60896R54091
626.2G18945324J106918O71864P08759J053691P42852N80430R80556Q75771N50926
644.5G26217091Q35538Q96573N26547P80821J109720O97910O42777J089513Q54612
662.9G33651102L50535N83469J081705Q59082J049876J186073O18100N87285J005530
681.2G40972757O38724L96549R17316Q26836K96533N77926P28846J73569L35753Q80122
701.6G46744931M83393J99080O14226L11196l33906n9783m4346q60333q48413j99795
$$ y = [713047683, 712910712, 712940693, 713052392, 712984264, 713033736, 713134885, 713005006, 713084817, 713375628, 713359118, 713349044, 713713825, 713989973, 714098275, 714495182, 714919508, 715027630, 715181172, 715426862, 715456069, 715537727, 715761960, 715706825, 715601861, 715796590, 715841472, 715845942, 716478288, 717330337, 717991233, 718945324, 720052242, 720724106, 721432865, 722486556, 723229408, 723809838, 724790394, 725666165, 726217091, 727052629, 727949202, 728475749, 729256570, 730366290, 731064200, 731706977, 732796490, 733651102, 734001637, 734585106, 735666811, 736525893, 737575769, 738761842, 739379942, 739967227, 740972757, 741611481, 742008030, 742925346, 743752182, 744048715, 744626641, 745355487, 745529056, 745864809, 746744931, 747228324, 747427404, 748041630, 748352826, 748018920, 747959137, 747914791, 747054458, 746206045, 746006250]
722G46006250l80933m36306J49846m5538n54800j35064l8385p65920o74129k09033
742.4G42915988o87659q51571k68996m47273q68440l96788k26796p71463n39124j6629
762.8G37841249m81725o38664L7670q1360n77212j15394J45733l58403j36911L90052
783.2G36025035j06036l88086J13249j36316o74725k79903j30534o75738m48883J07289
803.6G33405352k37584k35498O23285O86169L53336J013339J471758J075923J302660
822G39458740J749754J115143P07209J242399J095295M98891Q22604R88245L00348
840.3G47978628K90215P61270L15666N0664O88255O79910K18034O30558Q35061J46568
860.7G52594829J43587O18637Q3089l86596M6134j85669q92639n21481j42693o65784
$$ y = [746006250, 745625317, 745189011, 745338857, 745293319, 744738519, 744603455, 744565070, 743799150, 743125021, 742915988, 742228329, 741376758, 741107762, 740660489, 739792049, 739395261, 739168465, 738397002, 737857878, 737841249, 737359524, 736720860, 736758530, 736677170, 736099958, 735984564, 736130297, 735771894, 735634983, 736025035, 735918999, 735530913, 735644162, 735507846, 734833121, 734553218, 734422684, 733746946, 733298063, 733405352, 733167768, 732932270, 733555555, 734241724, 734595060, 735608399, 737080157, 738156080, 739458740, 741208494, 742323637, 743030846, 744273245, 745368540, 745867431, 746690035, 747678280, 747978628, 748268843, 749030113, 749345779, 749396443, 750084698, 750764608, 750982642, 751613200, 752448261, 752594829, 752738416, 753357053, 753440142, 753053546, 753099680, 752914011, 752021372, 751499891, 751357198, 750691414]
881.1G50691414n90444j2338l22580n90444n0366p1287n24461j34528P5698n85556
901.5G47885108n64039j6987m30465q21948l09348l10302q14676m91142j87874o93441
921.9G43244886o65664j74403n38826q87454l99530l88145q70586n19395j30892n71846
942.3G38098145o14942j94072m95196p72953k15769o7770m92334k08915J61589l29078
962.7G34868705n14388r8944l27467o93977l15190k76029p82847o09279k58863o11722
983.1G30379999o62804j74463k95579n98371k35439j59442o19173m92990k09749o52253
1003.5G26279736q67546n10812o71923j019776p04348n45680q74222p50720m87387
1021.8G19847322q32975r86994o27160p23779j028597p55608o12379q58843n90920
$$ y = [750691414, 750100970, 750088632, 749766052, 749175608, 749125242, 749053955, 748529494, 748394966, 748470664, 747885108, 747321069, 747304082, 746873617, 746051669, 745742321, 745432019, 744617343, 744126201, 743938327, 743244886, 742579222, 742404819, 741865993, 740978539, 740579009, 740190864, 739320278, 738800883, 738669991, 738098145, 737483203, 737289131, 736793935, 736020982, 735805213, 735737443, 735245109, 735036194, 735197783, 734868705, 734354317, 734255373, 733927906, 733233929, 732918739, 732642710, 731859863, 731250584, 730991721, 730379999, 729717195, 729542732, 729247153, 728648782, 728413343, 728253901, 727634728, 727141738, 726931989, 726279736, 725412190, 724901378, 724229455, 723209679, 722505331, 721959651, 721085429, 720334709, 719847322, 719014347, 718027353, 717400193, 716676414, 715647817, 714892209, 714279830, 713420987, 712830067]
1040.2G12830067j51277l48091m54962o8069n5492l08394r0838j371m31418n29647
1060.6G10390508l47972n66959o95348m43697n28991q27670o78301n43535p96795p93397
1081G04167843n90742q23140j020729p62582o93143q74877p32422n42104o65784o30200
1101.4F96832120l98814m46022m58002j35481r835j00791J65939N63681O65188Q22902
1121.8F97500885J123070J053214P79271P69139O16908Q4877k95818n30124r86933
1140.1G00114489j358569j458764j686454j979291k003849k015650k191961k212346
1156.5F85207605k043545j930892j722217j282155r09567o13511j75476J74701K76745
1174.8F76981688M27305O87957P80284P80404Q70466Q08478N60820M86731N08607L51786
$$ y = [712830067, 712678790, 712330699, 711875737, 711807668, 711752176, 711443782, 711352944, 711351573, 710920155, 710390508, 710042536, 709475577, 708780229, 708336532, 707807541, 706979871, 706301570, 705758035, 704961240, 704167843, 703577101, 702753961, 701733232, 700970650, 700277507, 699402630, 698670208, 698128104, 697462320, 696832120, 696433306, 695987284, 695529282, 695393801, 695383966, 695283175, 695449114, 696012795, 696677983, 697500885, 698623955, 699677169, 700456440, 701225579, 701842487, 701927364, 701631546, 701101422, 700114489, 698755920, 697297156, 695610702, 693631411, 691627562, 689611912, 687419951, 685207605, 683164060, 681233168, 679510951, 678228796, 677319229, 676705718, 676530242, 676704943, 676981688, 677408993, 678096950, 678877234, 679657638, 680528104, 681336582, 681897402, 682384133, 682892740, 683244526]
1195.2F83244526K43247L29375L22402J91867J85967J88469O795j47521j82510l21388
1215.6F84061229m89592m80175n05329o75439o97911o09517o65188o64055m67122l52085
1236F78454816l29375j71721k1636l2068N8830K82705L51727L83139N51283N91934
1256.4F80119634M85480N26785N72563M12285L18825M08709M19319L90947N29825O22154
1276.8F84806526N52118O21438P79986P47025P08878P74622O56903M53949M86016N19037
1297.2F91106498L95000M35412N73814N02884M28617N19097M63486K68698K76625L21031
1317.6F95291162J74820J88053M14133M53829M00305M57406L97981K55286K96772K71737
1338F98601484r9122m04179l96848l91960l50058q7798J34409K24471L47137L79682
$$ y = [683244526, 683487773, 683817148, 684139550, 684331417, 684517384, 684705853, 684712648, 684565127, 684382617, 684061229, 683571637, 683091462, 682586133, 681910694, 681212783, 680603266, 679938078, 679274023, 678806901, 678454816, 678125441, 677953720, 677932084, 677900016, 677958846, 678241551, 678593278, 678976417, 679527700, 680119634, 680605114, 681131899, 681704462, 682116747, 682435572, 682844281, 683263600, 683654547, 684184372, 684806526, 685358644, 685980082, 686760068, 687507093, 688215971, 688990593, 689647496, 690101445, 690587461, 691106498, 691501498, 691936910, 692510724, 693013608, 693442225, 693961322, 694424808, 694693506, 694970131, 695291162, 695465982, 695654035, 696068168, 696521997, 696922302, 697379708, 697777689, 698032975, 698329747, 698601484, 698502362, 698098183, 697701335, 697309375, 696959317, 696871519, 697005928, 697230399, 697577536, 697957218]
1358.4F97957218J72913k02835n96165p59066q04662j030505j591623k409339k612889
1376.7F88123047k070129j854777j867413j206160p27057j476169k221227k434909
1393.1F74265206k740979k749622k414584j968205j149536l41117M4346L90410Q15511
1411.4F64151430J069188J292348J609445J292646L04460j42097l96192q30829j313806
1429.8F67036593j688063j605571j648724k355635k634108k358317k034307j679420
1446.1F51032448j578391j517892j014113j013J305043J676500J262844J992941L292083
1464.5F56450450L893614M385591N768001O667852N035341L083825K549112K537012
1480.8F90370798K443135K425849K667904K622426J869201J223088J407385J509130
$$ y = [697957218, 698130131, 697927296, 697331131, 696572065, 695767403, 694736898, 693145275, 690735936, 688123047, 686052918, 684198141, 682330728, 681124568, 680397511, 678921342, 676700115, 674265206, 671524227, 668774605, 666360021, 664391816, 663242280, 662901163, 662945509, 663335919, 664151430, 665220618, 666512966, 668122411, 669415057, 669719517, 669577420, 669181228, 668350399, 667036593, 665348530, 663742959, 662094235, 659738600, 657104492, 654746175, 652711868, 651032448, 649454057, 647936165, 646922052, 646921039, 648226082, 649902582, 651165426, 653158367, 656450450, 660344064, 664729655, 670497656, 677165508, 682200849, 685284674, 687833786, 690370798, 692813933, 695239782, 697907686, 700530112, 702399313, 703622401, 705029786, 706538916]
1497.1G06538916O81519j1563K73943J090288K76089j930774k291858j774549j528025
1515.4G01323986j722634j943350k510368l239692l281414l327012l151059k570153
1531.8F79578304k566874k570986j633645j235067k291859k679109k104879j348316
1548.1F63147569p46727j98424M57644J207233J899302P34627m93228L31342J409590
1566.4F67748928J976311J808167J409650J934886K204299J219987Q79348J054406
1582.8F80235982R35495P80105N32747J23501j44363l72767p76410j006127j018226
1601.1F79289937j214862j443267j431167j525640j776994j586675j191497j488745
1617.4F67631090j625240r67026q14855j290739j431882j453102j142382j83940L6895
$$ y = [706538916, 707220435, 707208872, 707482815, 708573103, 708849192, 706918418, 704626560, 702852011, 701323986, 699601352, 697658002, 695147634, 691907942, 688626528, 685299516, 682148457, 679578304, 677011430, 674440444, 672806799, 671571732, 669279873, 666600764, 664495885, 663147569, 662400842, 662202418, 662660062, 663867295, 665766597, 666501224, 666007996, 666339338, 667748928, 669725239, 671533406, 672943056, 674877942, 677082241, 678302228, 679181576, 680235982, 681171477, 681951582, 682484329, 682607830, 682463467, 682090700, 681314290, 680308163, 679289937, 678075075, 676631808, 675200641, 673675001, 671898007, 670311332, 669119835, 667631090, 666005850, 665038824, 664223969, 662933230, 661501348, 660048246, 658905864, 658721924, 658758819]
1635.8F58758819j233876j614630r33170k17974J51455k53081l53813N20110J93655
1654.1F55017495j081645o34194N08547J241267J026094Q90314J540661J523614Q07345
1672.5F60839498Q45015P51078K84195M99726J066446N32567q98003j055539p59065
1690.9F62105918n57184j71781j34468l71933q83639j287460j081765j052499r95993
1709.2F55569196o03318j74284K40922K19821n90741p48038j1981N80072R75073J564383
1729.6F57021105K284646L030122K747357K459406L345073L877341L994227M349351
1745.9F83108628M623532M834592M433454L602802L488601L474950L057003K714694
1762.2G13338256K220154K053320K175748K180577J957416J130820P24971J081586
$$ y = [658758819, 657524943, 655910313, 654977143, 654759169, 654910624, 654657543, 654303730, 654823840, 655017495, 653935850, 653301656, 653810203, 655051470, 656077564, 656967878, 658508539, 660032153, 660839498, 661684513, 662435591, 662719786, 663219512, 664285958, 664818525, 663920522, 662864983, 662105918, 661548734, 661376953, 661242485, 660870552, 659986913, 658699453, 657617688, 656565189, 655569196, 654965878, 654791594, 655032516, 655252337, 654661596, 653913558, 653901577, 654481649, 655456722, 657021105, 659305751, 662335873, 665083230, 667542636, 670887709, 674765050, 678759277, 683108628, 687732160, 692566752, 697000206, 700603008, 704091609, 707566559, 710623562, 713338256, 715558410, 717611730, 719787478, 721968055, 723925471, 725056291, 725781262, 726862848]
1778.6G26862848J236439J030206R94742R55880R32276J247287J201332N14984L82125
1796.9G35358119P60496P47680M10200L71038N49317O07014N37335L91663L13222L63827
1817.3G40409911M17053M23789N08845N69761M67479L27051M7624q8215N1439J70708
1837.7G43305445K68399M56334N21242J22726k31087j92404j6808J08838Q9168N4717
1858.1G44486570Q4281O7354J01387L22580L66986p1823l47138j64628k4676R53M4525
1880.5G44866371J4842j8895Q6308J71244j908j24395k6404l4035q9883l0458l934
1903G44808853j133O2168M6134p6056r1195O1929J51515K7776m5895m9472j42098r8526
1927.5G44654000N424j6272j0193K9803M828M0590J65761Q3685q9884m3809L6120J7405
$$ y = [726862848, 728099287, 729129493, 730124235, 731080115, 732012391, 733259678, 734461010, 734975994, 735358119, 736118615, 736866295, 737276495, 737647533, 738196850, 738803864, 739341199, 739732862, 740046084, 740409911, 740826964, 741250753, 741759598, 742329359, 742796838, 743123889, 743171513, 743083298, 743134737, 743305445, 743573844, 744030178, 744551420, 744674146, 744443059, 744250655, 744233847, 744342685, 744431853, 744486570, 744570851, 744638205, 744739592, 745062172, 745429158, 745357335, 745010197, 744845569, 744820893, 744821846, 744866371, 744881213, 744862318, 744948626, 745119870, 745117962, 744993567, 744967163, 744933128, 744843245, 744812787, 744808853, 744807720, 744869888, 744916022, 744839966, 744748771, 744810700, 744962215, 744989991, 744944096, 744894624, 744752526, 744654000, 744659424, 744643152, 744632959, 744662762, 744667590, 744708180, 744873941, 744957626, 744867742, 744823933, 744860053, 744877458]
1951.9G44877458K5749M4107J6451N6148J42812J50741J15752R6679O1392K8670Q1599
1974.4G45697558J63495J50562J22309J56819J54436J43409K25484K84553J63257M7087
1994.8G47308969R6620J41561J56700K10345J97053J28865J52290K02656J84119K04563
2015.2G48983741K11894K325k31445l26216k06649L57091Q17120O51777L25441K39253
2035.6G50824332K93732K70486K09689K41578K41160J62244J87278K59995K19822J98901
2056G53109217K53439K30133J84596K43067K49029J64270J94669K78830K30372J89782
2076.4G55327404K63750K61784J79767K14100K81155K24352J98126K52962K16961J69098
2096.8G57589459K46704K74599J86860J91748K37882J70827J65522K79487K48491J32323
$$ y = [744877458, 744903207, 744947314, 744963765, 745019913, 745162725, 745313466, 745429218, 745525897, 745587289, 745615959, 745697558, 745861053, 746011615, 746133924, 746290743, 746445179, 746588588, 746814072, 747098625, 747261882, 747308969, 747405589, 747547150, 747703850, 747914195, 748111248, 748240113, 748392403, 748595059, 748779178, 748983741, 749195635, 749197960, 748966515, 748640299, 748433650, 748790741, 749607861, 750259638, 750585079, 750824332, 751118064, 751388550, 751598239, 751839817, 752080977, 752243221, 752430499, 752690494, 752910316, 753109217, 753362656, 753592789, 753777385, 754020452, 754269481, 754433751, 754628420, 754907250, 755137622, 755327404, 755591154, 755852938, 756032705, 756246805, 756527960, 756752312, 756950438, 757203400, 757420361, 757589459, 757836163, 758110762, 758297622, 758489370, 758727252, 758898079, 759063601, 759343088, 759591579, 759723902]
2117.1G59723902J75953K16543J50502J80423K45631J72317J38581K29657K16960J40787
2137.5G61591256J93834K14159J13190J23799K18808J73330J25111K15709K17855J15990
2157.9G63303041J54138K15232J29402R5308J52349J54436J79887K51710K08617J01149
2178.3G64945269J47581K22623J44005J12951J87695J50084Q0228J52230J63555M5360
2198.7G66351581O3419J65403J11222O2704J34409R9718P749P1049J13010J3947K0206
2221.2G67214417J03653L8028k1816M9711L7014n3048K503P1049k2828o7652K444m1842
2245.6G67311633j09077l2544j6689j19090j19627n2333q9824j08898m1544q8215j86026
2268.1G66347766j18435n7697j39713j40786p2539j43945k18690j57594j58668k41160
$$ y = [759723902, 759899855, 760116398, 760266900, 760447323, 760692954, 760865271, 761003852, 761233509, 761450469, 761591256, 761785090, 761999249, 762112439, 762236238, 762455046, 762628376, 762753487, 762969196, 763187051, 763303041, 763457179, 763672411, 763801813, 763897121, 764049470, 764203906, 764383793, 764635503, 764844120, 764945269, 765092850, 765315473, 765459478, 765572429, 765760124, 765910208, 765990436, 766142666, 766306221, 766351581, 766415000, 766580403, 766691625, 766754329, 766888738, 766988456, 766996205, 767067254, 767180264, 767194211, 767214417, 767318070, 767356098, 767334282, 767383993, 767421007, 767367959, 767370462, 767441511, 767418683, 767351031, 767353475, 767311633, 767202556, 767170012, 767153323, 767034233, 766914606, 766862273, 766772449, 766663551, 766622007, 766533792, 766347766, 766229331, 766171634, 766031921, 765891135, 765818596, 765674651, 765455961, 765298367, 765139699, 764898539]
2288.5G64898539k08974j91689k87652k77579k11596k97964l67939k98620l16262m27007
2308.9G62013257l97206l26156m15504n00560m56214m44114m75467m39465m18543m13120
2329.3G57726908l19600k90633m27484m97162m05074k86400K980M00126L3975q03650
2349.7G55133986j143574q71778n67853m41790k48611q0108J668J51694K17796J15394
2370.1G52266824J07944J71423J10626M352n0009j39773k61008k83063k60293l27528
2390.4G51339495l73363l23475l25381l61145l14176k97606l68178l85046l40223l35932
2410.8G47914970l47853l15249l17335l88741l85046l16859l35335l48628k87533l04401
2431.2G44567990l64005l34323l02195l43144l32654k75373l17991l72946l15964k70725
$$ y = [764898539, 764689565, 764497876, 764210224, 763932645, 763721049, 763423085, 763055146, 762756526, 762440264, 762013257, 761616051, 761289895, 760874391, 760373831, 759917617, 759473503, 758998036, 758558571, 758140028, 757726908, 757407308, 757116675, 756689191, 756192029, 755786955, 755500555, 755503535, 755903661, 755937636, 755133986, 753990412, 753118634, 752550781, 752108991, 751860380, 751780272, 751781940, 751933634, 752151430, 752266824, 752374768, 752546191, 752656817, 752661169, 752611160, 752471387, 752210379, 751927316, 751667023, 751339495, 750966132, 750642657, 750317276, 749956131, 749641955, 749344349, 748976171, 748591125, 748250902, 747914970, 747567117, 747251868, 746934533, 746545792, 746160746, 745843887, 745508552, 745159924, 744872391, 744567990, 744203985, 743869662, 743567467, 743224323, 742891669, 742616296, 742298305, 741925359, 741609395, 741338670]
2451.6G41338670l12090l07560k61962l02255l42369k96533k90752l31163k93672k61486
2472G38338828l16083l25799k69354k76863l19243k93612k74301l22282l04699k30372
2492.4G35406220k51889k77818k32875k38776k80082k43903k12669k58446k41220j60634
2512.8G33007908j75238k13325j53601j35005j95801j79708j40965j74761j63257j01804
2533.2G31374443j21236j53959j03533r5606j69456j61946j04725j38283j40846o8962
2553.6G30115891j09196j86086j21653o9737j30058j37329r0659j31666j79053j32501
2574G28827953j11937j44124j09375o5207j06931j34170j17838j34766j43588j00434
2594.4G27659583j16169j97232j76430j02877j22488j48058j09732j29938k03073j68324
$$ y = [741338670, 741026580, 740719020, 740457058, 740154803, 739812434, 739515901, 739225149, 738893986, 738600314, 738338828, 738022745, 737696946, 737427592, 737150729, 736831486, 736537874, 736263573, 735941291, 735636592, 735406220, 735154331, 734876513, 734643638, 734404862, 734124780, 733880877, 733668208, 733409762, 733168542, 733007908, 732832670, 732619345, 732465744, 732330739, 732134938, 731955230, 731814265, 731639504, 731476247, 731374443, 731253207, 731099248, 730995715, 730900109, 730730653, 730568707, 730463982, 730325699, 730184853, 730115891, 730006695, 729820609, 729698956, 729629219, 729499161, 729361832, 729271173, 729139507, 728960454, 728827953, 728716016, 728571892, 728462517, 728397310, 728290379, 728156209, 728038371, 727903605, 727760017, 727659583, 727543414, 727346182, 727169752, 727066875, 726944387, 726796329, 726686597, 726556659, 726353586, 726185262]
2614.8G26185262j00136j44183j89126j53363j55150j76549j34826j34230j90377j71304
2635.2G24636018j42932k13444k44796j76370j59502j99974j97768j86622k02358j90914
2655.6G22721338j73390k13325k30372j79290k00093k62678k16067j65641k07424k06471
2676G20666587j73330k39849k92122k43485k36869k71380k35379k27332l14534l34501
2696.4G18097806k67267k70009l14415l00526l12746l67284l52144l31998l84033m05013
2716.8G14792371l70205l64065l54171k99215l26693m24504m04477l25680l35276l50476
2737.2G11237609l18229l23891l51727l16561k92420l64840m13656l80040l71575l80099
2757.6G07724571l59595l89397m49240m27961l80993m13001m39822l93928m16278n05031
$$ y = [726185262, 726085126, 725940943, 725751817, 725598454, 725443304, 725266755, 725131929, 724997699, 724807322, 724636018, 724493086, 724279642, 724034846, 723858476, 723698974, 723499000, 723301232, 723114610, 722912252, 722721338, 722547948, 722334623, 722104251, 721924961, 721724868, 721462190, 721246123, 721080482, 720873058, 720666587, 720493257, 720253408, 719961286, 719717801, 719480932, 719209552, 718974173, 718746841, 718432307, 718097806, 717830539, 717560530, 717246115, 716945589, 716632843, 716265559, 715913415, 715581417, 715197384, 714792371, 714422166, 714058101, 713703930, 713404715, 713078022, 712653518, 712249041, 711923361, 711588085, 711237609, 710919380, 710595489, 710243762, 709927201, 709634781, 709269941, 708856285, 708476245, 708104670, 707724571, 707364976, 706975579, 706526339, 706098378, 705717385, 705304384, 704864562, 704470634, 704054356, 703549325]
2778G03549325n14030m96089n16952m85479m27962m80711n55337n38706n19038n48422
2798.4F98466599n88357o12081o08146n73277n53668o16967p26343p73608p61628p56026
2818.8F91896498p82251q62420r96828j152217j355291j635968j950622k350211k950966
2837.1F77859724l766478m696488n623817o494403p178366p340491o426156m128933
2853.4F32204592j022637J782358L460228L819585L194154K092778J032412N17726
2869.7F47081196P28309J271070J614332J549065J085222L68535l85582j049221j566887
2888.1F50696039j943767k199292k348363k481699k665461k844154l018439l275871
2904.4F29918993l652990m160345m809737n612254o536365p259369p234692o208480
$$ y = [703549325, 703035295, 702539206, 702022254, 701536775, 701108813, 700628102, 700072765, 699534059, 699015021, 698466599, 697878242, 697266161, 696658015, 696084738, 695531070, 694914103, 694187760, 693414152, 692652524, 691896498, 691114247, 690251827, 689254999, 688102782, 686747491, 685111523, 683160901, 680810690, 677859724, 674093246, 669396758, 663772941, 657278538, 650100172, 642759681, 636333525, 632204592, 631181955, 632964313, 636424541, 640244126, 643438280, 645531058, 646563470, 647081196, 647809505, 649080575, 650694907, 652243972, 653329194, 653697729, 653312147, 652262926, 650696039, 648752272, 646552980, 644204617, 641722918, 639057457, 636213303, 633194864, 629918993, 626266003, 622105658, 617295921, 611683667, 605147302, 597887933, 590653241, 584444761]
2920.7E84444761m276991j749038R47117L346324N023599N988836O454587O446481
2937F06625676N998314N161643L960788K491772R83477k56658r37819r41396l50654
2955.4F22735143O49273J804888K903462L786206M388988M741848M794240M521906
2971.7F50325954M036128L440738K845049K343238J873373J417995J111567R45091
2988F68339133P83265N66721L30567J73271K4199j35541j48117j35303j50621m947
3008.4F69642627K25187K82347J63197Q5116P8380O4671Q1897N1677n7757m2677N7280
3030.9F70631945M2796o9558j67549j47641n7578m4942j56641k47299j79291j09971
3051.3F69494271j53303j85072j84715k05815j78218q5592l6776j11222k15829k15173
$$ y = [584444761, 580167770, 578418732, 579365849, 582712173, 587735772, 593724608, 600179195, 606625676, 612623990, 617785633, 621746421, 624238193, 625221670, 624965012, 624027193, 623085797, 622735143, 623384416, 625189304, 628092766, 631878972, 636267960, 641009808, 645804048, 650325954, 654362082, 657802820, 660647869, 662991107, 664864480, 666282475, 667394042, 668339133, 669122398, 669689119, 670019686, 670192957, 670217156, 670081615, 669933498, 669798195, 669647574, 669642627, 669867814, 670150161, 670313358, 670398474, 670476854, 670541525, 670623422, 670675099, 670617342, 670574665, 670631945, 670674741, 670605183, 670437634, 670289993, 670232415, 670187473, 670030832, 669783533, 669604242, 669494271, 669340968, 669155896, 668971181, 668765366, 668587148, 668501556, 668464780, 668353558, 668137729, 667922556]
3071.7F67922556j41859k5153N6207m8399j99675k07007j84178j89245j59741j46389
3092.1F66677117j74105j59919q9049j18018k36690k23159j03295q9646j72794j64628
3112.4F65145814p8499p3552j54078l12090m76718m41730l12090l11017l55124l59297
3132.8F62271619l63469l52741l53813m78983o10828n72860n04792m98295m68075n28336
3153.2F57539427p12692p89524p19249o64949o99461p38561p29203p50601p99716p94053
3173.6F50141418p80702q11875q08239q04662q56161q58784q01683q04483q59142q57055
3194F41898632q26597q37922q15928p51615p42853p24554o55829o55652o94274o58095
3214.4F34535313o09339o25312o36041o10471o03080n97417n44667m58777m26769n46515
$$ y = [667922556, 667780697, 667755544, 667811751, 667763352, 667563677, 667356670, 667172492, 666983247, 666823506, 666677117, 666503012, 666343093, 666254044, 666136026, 665899336, 665676177, 665572882, 665483236, 665310442, 665145814, 665067315, 664993763, 664839685, 664527595, 664050877, 663609147, 663297057, 662986040, 662630916, 662271619, 661908150, 661555409, 661201596, 660722613, 660111785, 659538925, 659034133, 658535838, 658067763, 657539427, 656826735, 656037211, 655317962, 654653013, 653953552, 653214991, 652485788, 651735187, 650935471, 650141418, 649360716, 648548841, 647740602, 646935940, 646079779, 645220995, 644419312, 643614829, 642755687, 641898632, 641072035, 640234113, 639418185, 638666570, 637923717, 637199163, 636543334, 635887682, 635193408, 634535313, 633925974, 633300662, 632664621, 632054150, 631451070, 630853653, 630308986, 629850209, 629423440, 628876925]
3234.8F28876925o80566o40095n16235m34637m12822m22180m47094m46499l45290k38955
3255.2F24292552k83598l47913k75433k18391k30253j51753k5511o7592k13206k65240
3275.6F22213662k88964l09527k67684k39134k78413k94089j99914j66953l22461m77374
3296F19369149n68568o11961n08428l92079n18680q03530r59337j002848j036465j030386
3316.4F11936867j072705j189589j216590j199246j356542j537144j557946j559318
3332.7F01247787j564800j560033j695454j890838j933813j941025j983881j950801
3349E86727142j992583k195477k300799k231419k184689k242744k290845k195359k095401
3367.4E66997826k213001k428472k448499k264262k073824j952589j903891j858056
$$ y = [628876925, 628196359, 627556264, 627040029, 626605392, 626192570, 625770390, 625323296, 624876797, 624531507, 624292552, 624008954, 623661041, 623385608, 623167217, 622936964, 622785211, 622759700, 622692108, 622478902, 622213662, 621924698, 621615171, 621347487, 621108353, 620829940, 620535851, 620335937, 620168984, 619846523, 619369149, 618800581, 618188620, 617680192, 617288113, 616769433, 615965903, 615006566, 614003718, 612967253, 611936867, 610864162, 609674573, 608457983, 607258737, 605902195, 604365051, 602807105, 601247787, 599682987, 598122954, 596427500, 594536662, 592602849, 590661824, 588677943, 586727142, 584734559, 582539082, 580238283, 578006864, 575822175, 573579431, 571288586, 569093227, 566997826, 564784825, 562356353, 559907854, 557643592, 555569768, 553617179, 551713288, 549855232]
3383.7E49855232j735925j561642j375854j335442j511276j564026j312673j104534
3400E38353860j237630j461745j394629j184285j098871j073122j018703r55045q48830
3418.4E28081000p40111o76394n63442l83556k18451j58489q0764Q7082J16825N8294
3438.8E25521994J85370M09544N89728P37429P47382P20740Q28147R77098J108408
3457.1E31825840J227022J246333J227438J354218J512050J413584J173556J177192
3473.4E42157233J364827J520097J610577J556814J436591J479805J584291J559019
3489.8E54269254J536072J605331J681567J690745J707554J780569J673639J487792
3506.1E67432523J596868J775086J785159J763284J727760J702726J812041K020120
$$ y = [549855232, 548119307, 546557665, 545181811, 543846369, 542335093, 540771067, 539458394, 538353860, 537116230, 535654485, 534259856, 533075571, 531976700, 530903578, 529884875, 528929830, 528081000, 527340889, 526664495, 526101053, 525717497, 525499046, 525340557, 525259793, 525346875, 525463700, 525521994, 525707364, 526116908, 526706636, 527444065, 528191447, 528912187, 529740334, 530717432, 531825840, 533052862, 534299195, 535526633, 536880851, 538392901, 539806485, 540980041, 542157233, 543522060, 545042157, 546652734, 548209548, 549646139, 551125944, 552710235, 554269254, 555805326, 557410657, 559092224, 560782969, 562490523, 564271092, 565944731, 567432523, 569029391, 570804477, 572589636, 574352920, 576080680, 577783406, 579595447, 581615567]
3522.4E81615567J995862J784026J748443J809239J848519J957238J985252J865446
3538.7E96609592J924336K182126K306879K078056J777828J869440K081633K034843
3555F12864733K012372K178907K283633K282917K531529K822757K412498J946866K167702
3573.4F33503914K526164K625704K698183K787947K890885L197074L327430K754271
3589.7F56311572K368927K760887L058672K942860K914667K892137K752959K928972
3606F78931653L367901L315688K945899K696276K551913K896250K986312K219915J804054
3624.4G03715861K422333L630042L133118J593828J532376J908004J981139K007842
3640.7G21924543J905024J925767K537012L186584K155542N42641P39574J584351J293778
$$ y = [581615567, 583611429, 585395455, 587143898, 588953137, 590801656, 592758894, 594744146, 596609592, 598533928, 600716054, 603022933, 605100989, 606878817, 608748257, 610829890, 612864733, 614877105, 617056012, 619339645, 621622562, 624154091, 626976848, 629389346, 631336212, 633503914, 636030078, 638655782, 641353965, 644141912, 647032797, 650229871, 653557301, 656311572, 658680499, 661441386, 664500058, 667442918, 670357585, 673249722, 676002681, 678931653, 682299554, 685615242, 688561141, 691257417, 693809330, 696705580, 699691892, 701911807, 703715861, 706138194, 709768236, 712901354, 714495182, 716027558, 717935562, 719916701, 721924543, 723829567, 725755334, 728292346, 731478930, 733634472, 734177113, 734916687, 736501038, 737794816]
3659G37794816Q98898R97722J109600J427472J985312J596987R03368J292884Q09848
3677.4G48816907j19388J15156N35369R55820J828254J988172O88255q9049J32561
3695.8G54852057M84108P88689R38058N59986K51293O23762J195014J052022L5405
3714.1G60780394m17113r716M25399M93526L21746J54614J550K86758J017630J235545
3734.5G64290333N74946l47018o56188L00229J378655N04256J2576P05600J60694o55591
3754.9G66268492l37005J86741L3141j70052J60813L66807L47614R6083l01600j73449
3775.3G66477585L48091N62370J38342j52647j4305P689M410O1453J74403M04119L50714
3797.7G68362224M93884P77364K3961k47836L7670m05073m94897K18689P99298M22478
$$ y = [737794816, 738693714, 739691436, 740801036, 742228508, 744213820, 745810807, 746714175, 748007059, 748816907, 748697519, 748812675, 749348044, 750303864, 752132118, 754120290, 754808545, 754719496, 754852057, 755336165, 756124854, 757062912, 757622898, 757874191, 758497953, 759692967, 760744989, 760780394, 760363281, 760353565, 760778964, 761272490, 761594236, 761748850, 761750400, 762037158, 763054788, 764290333, 764865279, 764518261, 763862073, 764162302, 765540957, 766045213, 766057789, 766763389, 766924083, 766268492, 765931487, 766118228, 766151369, 765981317, 766142130, 766508937, 766856551, 766952634, 766651034, 766477585, 766825676, 767388046, 767526388, 767373741, 767359436, 767367125, 767371535, 767432988, 767607391, 768011510, 768362224, 768856108, 769633472, 769657433, 769409597, 769447267, 769042194, 768547297, 768765986, 769565284, 769987762]
3818.1G69987762L15189K95222m72784n08606j16527J19865L45528L41177N14984N99563
3838.5G71421373o1989n14150m54008m10676k58684L86417J490235R61840q79466j060546
3858.9G70620346k65181L40998L32296K6405K64525L18468j81794l62396l10004J42693
3879.3G70926356L12388k9564J18673m6968k20120J90377l6955m10497P3850O37412
3899.7G71514952N69165J78456l11494o49035m79757r9123J27912K76148K66790L5465
3920.1G71429479j01805j2993j0133j19150J8537K04206K4676k08020j35184R4116
3940.5G71183729K00868M6015k0147R5666j2279j75774r4533K8908M9889N8711L9220
3962.9G71400273k1994Q523R4772N2154n5492n0664J9908M8279M4227L9578j1623m7207
$$ y = [769987762, 770302951, 770598173, 770125389, 769616783, 769500256, 769620121, 769965649, 770306826, 770821810, 771421373, 771359384, 770845234, 770391226, 769980550, 769721866, 770108283, 771598518, 772560358, 771680892, 770620346, 770355165, 770696163, 771028459, 771054864, 771319389, 771637857, 771456063, 771093667, 770783663, 770926356, 771238744, 771209180, 771327853, 771280885, 771060765, 771251142, 771214187, 770803690, 770877540, 771514952, 772084117, 772262573, 771951079, 771302044, 770822287, 770723164, 770851076, 771127224, 771394014, 771429479, 771327674, 771314681, 771304548, 771185398, 771203935, 771408141, 771432817, 771224797, 771089613, 771183729, 771384597, 771430612, 771410465, 771506131, 771493852, 771318078, 771223545, 771252453, 771302342, 771361053, 771400273, 771378279, 771386802, 771481574, 771533728, 771478236, 771427572, 771447480, 771495759, 771539986, 771579564, 771567941, 771520734]
3987.4G71520734K7358O2049K0683L3676L8564
3997.6G71703064
$$ y = [771520734, 771548092, 771610141, 771630824, 771664500, 771703064]
##END=$$ End of the data block
