##TITLE=$$ Begin of the data block
##JCAMP-DX=5.00 $$ ACD/SpecManager v 10.08
##SPECTROMETER/DATA SYSTEM=Varian
##DATE=07 Jan 2013 17:15:38
##DATA TYPE=INFRARED SPECTRUM
##DATA CLASS=XYDATA
##ORIGIN=
##OWNER=
##NPOINTS=3735
##FIRSTX=399.26403809
##LASTX=4000.35498047
##MAXX=4000.35498047
##MINX=399.26403809
##MAXY=74.54682159
##MINY=35.92926407
##XFACTOR=1.0000000000
##YFACTOR=0.000000100000000
##FIRSTY=53.39399719
##DELTAX=0.96440572
##XUNITS=1/CM
##YUNITS=TRANSMITTANCE
##XYDATA=(X++(Y..Y))
399.3 533939972 533734856 533487740 533344803 535305176 534818420 529474564 536650772 533270035 519994278
407.9 519994278 522208786 527714577 527377396 523578987 528891068 532142715 529307518 531315918 527452965
416.6 527452965 526287384 535603943 548900833 542109032 533617172 535498810 532501144 532945290
424.3 532945290 539092522 535320396 527896118 523503571 521417503 520791855 524481850 525315475 523640289
433 523640289 526123734 527200012 523559723 521831970 525712509 526017418 525986137 530323143 533239555
441.7 533239555 532733994 527813873 524282722 526858406 528541527 523972321 520951920 521996078 523455162
450.4 523455162 527648468 533920860 534326630 530523567 528473549 526720848 530525093 533059349 522576790
459.1 522576790 517091103 517576408 523905869 528160286 527888145 529670639 525377922 519022522 520372276
467.7 520372276 520934639 517706985 519625854 526866455 528503914 522112427 520965385 522012596 519459419
476.4 519459419 517775230 518367920 516107140 515554657 516782494 517480240 520686302 521934776 519033012
485.1 519033012 515035744 514029350 515913658 514992905 516522522 519090652 516422844 516487656 520157585
493.8 520157585 519393387 518378487 519653397 516799850 513494682 512764740 513002930 514544258 513886642
502.5 513886642 512340279 511363716 512526932 514427376 512590752 510967407 509464302 509414253 511189384
511.1 511189384 510460205 508692093 507323380 507365189 509411697 510794907 509304581 508098793 506589165
519.8 506589165 504967918 504356232 503051491 503247948 504915009 506597557 505465851 503208160 503288879
528.5 503288879 502333984 500309753 499356003 500083923 501036301 501282654 502284012 502035027 500437164
537.2 500437164 500951309 502345695 501235161 500104942 501368256 502283783 501983757 501019096 499349213
545.9 499349213 498321762 499549751 500076752 498455505 497882423 496978645 494505272 494666443 497685280
554.5 497685280 497539253 496517601 497300949 496405067 495781631 495145950 493583374 492781448 492873306 493331528
564.2 493331528 493770218 495538635 496527328 495992165 496763916 497030144 494869576 493579330 495584259
572.9 495584259 495786552 493746490 493454819 493935204 494069519 494848442 495941620 495778999 496452026
581.5 496452026 496888466 494989281 494224396 493982811 493656845 493846970 493408356 493948441 495663223
590.2 495663223 496178017 495600319 496662560 498223038 498032227 496865311 496680145 497459755 497438278
598.9 497438278 497794266 499073753 499786606 499795952 499155464 498459053 497541618 495878067 494229889 494856224
608.5 494856224 496318092 495514717 493785820 493052330 494141235 495031052 494015465 493308716 493188171
617.2 493188171 492632179 492995567 494763412 495818481 496313744 497065353 496505890 496477165 497897682
625.9 497897682 499534874 501056786 501191559 500930672 501534119 502465515 503468056 504795189 506038780
634.6 506038780 506667480 507816429 509790535 511258736 512237320 513111343 513951073 515115967 514840889
643.3 514840889 514089394 515119400 516265221 516587868 517033615 518122330 518773842 519117165 520261650
651.9 520261650 521383629 520882072 519892883 520624123 521107941 520421181 520513954 521434593 520881691 520330925
661.6 520330925 521624718 522158279 522113266 522256088 522980690 522564125 515487328 518613472 520853348
670.3 520853348 522307320 523693047 524276848 525265465 525774612 527008667 528065910 526908836 526503792
678.9 526503792 528684959 530561180 530736771 532218399 534469643 535275688 536085243 537196503 536976471
687.6 536976471 536821594 536921501 535895576 536003723 537510834 539255409 540807533 541446114 542276306
696.3 542276306 543305817 542955513 541651306 540774727 540513115 540820312 541391411 542450485 544093208
705 544093208 546144447 547290421 546699867 547631378 548863487 547850609 546978722 546893044 547675858 549131088
714.6 549131088 549919205 550543938 552289963 553633232 553898582 554456100 553993988 552619896 552696915
723.3 552696915 554142990 554767342 555341911 556216888 557215042 559527359 561120644 561295242 560950737
732 560950737 560736809 560240746 559678650 560119820 560760269 562412949 563381729 563654480 564401398 564613571
741.6 564613571 565270844 565047226 564701233 565148811 565329056 565435143 566099396 567530251 568447876 569516754
751.3 569516754 570300331 569732437 569156227 570253296 571916351 572458954 573049469 574392776 576087379
760 576087379 576178932 576077957 576238022 576105995 577547913 578035774 578305092 579044113 579759140 580944519
769.6 580944519 581358032 581828613 581545639 580735435 579492531 578649864 579428596 579724007 579290085 579477501
779.2 579477501 580786858 581415939 581447182 581812782 581964340 582011299 582188873 582085495 581192932 581757698
788.9 581757698 583063889 583722191 584143181 583915634 583306923 583010902 583448715 581811905 580163231
797.6 580163231 580155334 579664650 580032730 580221939 579696655 579268150 579505501 578970604 576339569 573927422
807.2 573927422 572165604 570545502 569739685 569759064 569945030 570235634 569236565 568011971 567354469
815.9 567354469 565751381 564697838 563362312 562417412 562666283 563848839 565777359 567342682 570234566
824.6 570234566 571886787 572453957 573272400 573151207 574710083 576645050 578364677 580486794 582695160
833.3 582695160 585646515 588629112 590859070 592701073 593948746 593575745 593513031 593899536 595229187
841.9 595229187 596483002 596879883 598894691 601123848 603161659 604187012 604954224 604917831 603994255
850.6 603994255 604362717 603791275 604339752 606380997 608754425 611009521 612693863 615055351 616531944
859.3 616531944 617373352 617055016 616001053 615578918 616007996 616452141 617213211 618417282 618294678
868 618294678 618912849 618383026 616776428 615058289 612231216 610029945 607942924 607724457 608210411
876.7 608210411 608256950 608544350 608846207 608975410 607875671 607422943 606886978 605963058 604434967 603202438
886.3 603202438 603528442 603642769 603694954 603266907 603860321 604348640 603914719 603677292 602755966 602507057
895.9 602507057 602669258 603232269 603170547 603118286 603997688 604106636 604026413 604542618 605593491 605017815
905.6 605017815 604970398 606937866 608604507 609166107 608516121 609391479 610698967 611007385 610386086
914.3 610386086 608805733 607374840 605294304 603401909 602374573 600886917 598391418 596426353
922 596426353 594779091 592962875 591101990 588728752 586585274 583903999 581382103 579003525 576175117
930.7 576175117 573800163 572214813 571985474 571799622 571342506 571007195 570303497 569399414 568965416
939.3 568965416 569059792 568140068 566755638 566359634 566463890 565803909 565282478 565324783 564878082 564426079
949 564426079 564197311 564442024 563417702 561896439 561702576 561056290 560494308 559697037 558085175 556383629
958.6 556383629 554819145 553114395 551021500 549232559 547295761 545388489 544120903 543127937 541454544
967.3 541454544 539424477 538098145 537057457 535888138 534355011 532442131 529833641 527214241
975 527214241 525049858 522539597 519772339 516945648 514068069 510850525 507661133 504500809 501036682
983.7 501036682 497445946 494087029 491084557 488067245 485037270 481875610 478930092 476340141
991.4 476340141 473862038 471084137 468151627 465936813 464270592 461844063 458835869 456329689
999.1 456329689 453705177 452062378 450818291 448871078 447272911 445620537 444246216 442500153
1006.8 442500153 440870018 439919548 438874435 437728958 436202240 435282631 434573936 433088608 430814247
1015.5 430814247 428661423 427550507 426428566 424097557 421323814 419561310 418277740 416787682
1023.2 416787682 414621925 413161888 412307091 411043587 409748611 408265381 408782043 409185410 408149223
1031.9 408149223 406990814 406460571 407266121 407204666 407586327 408798256 410083237 410839043 411891518
1040.6 411891518 413748894 414007378 414079933 414178200 414363899 414128609 413741188 414296837 413719330 412187309
1050.2 412187309 410656166 410382195 410018692 408936729 407767067 406551628 405947037 405543747 406689339
1058.9 406689339 407548409 408454857 409584618 410852470 413369408 414799385 416314011 417786369 419061699
1067.6 419061699 419719963 420507851 422122269 423263817 424743347 424433327 423792953 424414711 425580711
1076.3 425580711 426101341 425445747 425439720 425575142 426891518 427673798 428224068 428959007 428727608 430247078
1085.9 430247078 432067986 433204460 434085045 435433350 436375465 436981888 438843765 440082092 440377388
1094.6 440377388 440605354 442402916 444361572 445955200 447696266 448121300 449216042 450633659 451414528
1103.3 451414528 452512283 453998070 454904022 455379257 456200294 457122841 458533516 459021111 458717003
1112 458717003 459073257 459958878 460882378 461801224 462259178 461855125 462096825 462396164 462842674 462776451
1121.6 462776451 462065773 462716713 463583946 464758720 465268707 465568047 466132507 465898743 467113495
1130.3 467113495 469273567 471026649 472321243 474014053 475927773 477580605 479810829 481927223
1138 481927223 483289452 483684769 484116592 485222969 486703453 488243141 489341660 490188828 490650558
1146.7 490650558 490523911 490139427 490522766 491275368 491476212 491154404 490229530 489742851 489892387 490233994
1156.3 490233994 490619545 490693665 490474968 490061607 489276161 487848091 487003403 486815987 486648979 487446098
1166 487446098 489396210 491661034 493514442 495359879 497057648 498764076 500336037 501678581 503280411
1174.6 503280411 505356674 507835999 509522247 511309013 513883743 515989304 517630196 519290848
1182.4 519290848 520521240 520888557 521095238 522047005 523235092 523766212 524194450 524965057 525742912
1191 525742912 526140289 526229210 525895309 525055962 524032898 522960129 522122231 521222458 520601425 520054970
1200.7 520054970 519352760 519296761 519288559 518726692 517576752 516241646 515186882 514267464 513549881 513122902
1210.3 513122902 513004379 513207207 513518562 513836784 514023361 513842316 513378906 512429810 511032715
1219 511032715 510099907 509829025 509872017 509661522 509322510 509402161 509601784 509449692 508675346 507753677
1228.6 507753677 506763725 505591240 504740372 503848381 503000679 503058662 503407707 503249779 503437424 504087715
1238.3 504087715 504042397 503567200 502929649 501906662 501036034 500481644 500333290 500446091 500638695 500866547
1247.9 500866547 500780106 500783958 500705719 500131874 499437637 498936272 498662796 498511467 498538055 498516426 498784866
1258.5 498784866 499164429 499108353 499396782 500107269 500405807 500126076 499960136 499935646 500240555 501102676
1268.2 501102676 502130623 503501778 504623375 505410538 506113472 506467896 506917572 507240181 507412720
1276.9 507412720 508404083 509566536 510523338 511754265 512827454 514005394 515356407 516573372 517087746
1285.5 517087746 517335701 518398361 519640427 520799599 521911163 523074951 524233284 525277405
1293.3 525277405 525989265 526415672 527034912 527255402 527285118 527328987 527522774 527891426 528571701 529210701
1302.9 529210701 529397125 529957314 530091286 529973297 529562416 528990135 528971863 528449440 527983856 527925949
1312.5 527925949 527953720 527597694 527059898 526887741 526890259 527109604 527084656 527178917 527560349 528459930
1322.2 528459930 529562721 530219154 530793610 531169243 531556473 531506615 531535683 531561432 531108475 530449753
1331.8 530449753 529495926 529459610 529877357 530013008 530260773 530635414 530819511 530920982 530949020 530338478
1341.5 530338478 530615044 531101112 531413918 532273941 533073502 533730240 534061241 534244843 533713989 533599358
1351.1 533599358 533571014 532774124 532556419 532510681 532559433 532340012 532384644 532616386 532757339 532554054
1360.8 532554054 531538315 531236839 529736137 529252853 529578362 529251976 529514999 529605522 529482460
1369.4 529482460 529087486 528561554 528424950 528606300 528042412 526823921 526780128 526883430 527141228 527133751
1379.1 527133751 527414513 527562141 526659126 525828133 524797134 523940048 523219452 522635880 521093063
1387.8 521093063 519899864 519579773 518524590 517513885 516761513 516592751 514795418 511264572 509945679
1396.4 509945679 508769341 507797165 505349045 503602257 502898483 501583443 500609169 499538765 497575645
1405.1 497575645 495586166 494839516 493820419 491777954 490181732 489170227 488387642 487602806 487164841
1413.8 487164841 486793556 486276283 485554924 484732552 485028610 482453232 481416855 482401886 482883606
1422.5 482883606 483651695 483501892 484343605 485303383 485306854 485751381 485982056 486083794 486168823 487336922
1432.1 487336922 488654213 489835625 491921883 493926353 494046669 493891106 495592613 496418915 496986504
1440.8 496986504 497831345 498421021 499583778 500358543 501388702 502333450 503340340 503198166 503840561
1449.5 503840561 505609779 506164551 506781349 507208633 508827171 510737000 511535759 511368713 511244583
1458.2 511244583 514609451 515580177 517138519 518203201 519160652 521025925 520490685 522343788 524340248
1466.8 524340248 526255417 528145752 530596848 534085770 536246262 537395821 537606964 540161018
1474.6 540161018 542926445 544162903 546124763 548392792 550276451 552152634 554193878 555209274
1482.3 555209274 556401901 557431183 557621078 558738213 559751320 560355148 561874237 561413727 560377159
1491 560377159 561178169 561774139 561187668 560675545 560860176 556782990 556576958 556294823 553899155 554103279
1500.6 554103279 553984337 553419838 552685852 553246498 554120827 551048775 547320290 546314468 547129669
1509.3 547129669 546610451 546922035 546598129 545259399 545119476 544754486 544895592 543326340 540818596
1518 540818596 542085495 543541832 542579308 541013603 541175766 542303848 544172554 543257332 543435593
1526.6 543435593 544776306 544362564 544268684 544683304 545361786 546429787 547015152 545636978 546976433
1535.3 546976433 548207169 549222641 551481171 549587440 545172958 548090744 548780670 548528633 550498695
1544 550498695 551556435 550870056 552501030 553198624 554113998 554241829 552752724 553630371 554698868
1552.7 554698868 556412239 554596100 554442406 557392235 559275436 554028130 550416336 552276268
1560.4 552276268 552262268 552538261 551522865 550904007 549116859 547410698 547226105 546772690 547306595
1569.1 547306595 541040001 538957329 537641029 534988022 533312569 532048149 531380005 520585442
1576.8 520585442 519816399 518414230 515677109 513140144 509448318 506763115 502024803 499046936
1584.5 499046936 494915390 491465111 488642654 484924088 482501717 478253593 476115570 472379379
1592.2 472379379 469887581 466612206 462065277 459429893 455323219 453657494 450145607 448150902
1599.9 448150902 445662727 443207207 441672020 438275795 436741219 433568573 432329788 429282570
1607.6 429282570 427793694 426800194 424297256 424320259 422085571 422336044 421053047 421488190 421889763
1616.3 421889763 415405464 416688499 415940399 416603584 415654335 417253418 417959137 415264664 416014328
1625 416014328 415674057 417720146 416491280 416378593 416805382 417493439 418575401 418369141 420761147
1633.7 420761147 421993446 421568565 420342216 423180847 423970757 424884415 427321701 427623634 429723625
1642.4 429723625 429926414 432014771 434796944 435528450 437003937 434567528 436820450 438240204 441610146
1651 441610146 445756149 447686005 439188919 439566422 443445930 444299660 445893860 446765785 447788773
1659.7 447788773 449343262 451080971 453984299 453691940 456100426 457799950 460065079 463178139
1667.4 463178139 466107903 467523193 467710152 471690407 473581429 477186394 480841179 482429314
1675.1 482429314 483133774 485910339 489815216 492293663 495643463 497545776 501477547 507289734
1682.9 507289734 510762901 511203232 511741295 516855049 520610275 523392601 526743507 529638634 533318825
1691.5 533318825 536698380 540757027 545485535 550755310 551124077 554170380 559106293 564627800
1699.3 564627800 568772430 563901825 569916954 574882545 579358597 582536926 584745827 586289597
1707 586289597 587645187 590848045 592997322 593917618 595553970 597921219 600880241 601715927 602869034
1715.6 602869034 606994591 609868889 605513306 606813889 609395447 610642281 611844826 612745209
1723.4 612745209 613299179 614637146 616037979 617381630 619326134 621733475 621649551 621139297 624327049
1732 624327049 627825508 626237259 620735054 624300308 628243332 630678673 634044571 635601692 633976784
1740.7 633976784 636793671 639026642 638839111 640047073 643335495 646234207 648837433 651602707
1748.4 651602707 653193359 657241516 658988647 659085617 662753525 664816437 666851807 669754944 670108185
1757.1 670108185 671448975 674171753 676891708 680809326 681677856 681629333 684323273 685472565 686128693
1765.8 686128693 687540054 689196625 687575684 689097137 693476715 695831299 695425797 693446503
1773.5 693446503 696636887 698436508 697122345 698247070 698821030 700348206 701121674 700643921 701826935
1782.2 701826935 703941650 706015244 705761719 705851593 706925583 707249832 707218475 708083420 708648224
1790.9 708648224 709737930 709502258 708925705 712212677 713926239 713685074 714101868 715353546 715397034
1799.5 715397034 713438263 714583054 714153900 714524307 717005844 718473892 719631195 720754623 721233978
1808.2 721233978 721332932 722066193 720438766 719921188 720620422 720782623 722246780 723235931 724790344
1816.9 724790344 725315857 725677490 726340561 725868988 726227951 725647583 726213303 727220840 725903854
1825.6 725903854 726150055 728115463 730840530 731935501 728947449 728659744 730333710 730253372 730010529
1834.3 730010529 729908142 730181808 731029739 730888901 731934509 732719574 733541107 734032898 735167389
1842.9 735167389 735505829 729777222 731394882 733705063 733979568 733713455 734184036 735604782 735879440
1851.6 735879440 736463623 736478271 736570435 736253510 735711670 735972137 735482483 735754929 736264420 737314301
1861.3 737314301 737935791 738575363 739158249 738753967 738987885 738686676 739249191 737795639 736166458
1869.9 736166458 737943039 739234161 739779587 739591599 740171661 740560379 740487289 740088882 739666061
1878.6 739666061 739858246 739633942 739853897 739919281 740865784 741634979 741335754 741254883 741197281 742229843
1888.3 742229843 742126999 740501099 740482483 741321182 741616821 742019730 742685776 742211456 742269287 742036362
1897.9 742036362 741919327 741951370 741915817 742125473 742031097 742649994 742627487 742610703 743009033 743449707
1907.6 743449707 743409958 742926025 742723770 742136002 742914658 743130188 743287811 743936539 744213715 745312881
1917.2 745312881 743777847 742891693 743589783 743784637 743984146 742865448 742312393 742984161 743712387
1925.9 743712387 743721085 743888779 743867798 743807678 743817520 743424988 743758240 743414383 743315659 743269730 743227005
1936.5 743227005 743710098 743706360 744204636 744577103 745468216 745073853 742904968 742622681 742698059 742887726
1946.1 742887726 742861176 743106918 743332291 743687057 743938675 743701401 743740387 743531494 743445358 743029556
1955.8 743029556 742796707 742497025 742217102 742702866 743041763 743751068 743979187 743768234 743332062 743032761
1965.4 743032761 743200836 742654800 742129898 741891403 742036133 742351990 742837448 743392715 743558578 743486481
1975.1 743486481 743171310 742872772 742432022 742160950 741526031 741182861 741736908 742373581 742801971 742652283
1984.7 742652283 742961426 743194504 743076935 742273865 741077805 741216354 741291046 740594177 740328827 741026535
1994.3 741026535 741625214 742032700 742318192 742082748 741831360 741005936 740629959 740090027 739632263 739915848
2004 739915848 739913712 740363693 740765762 741250687 741332855 740824738 739970169 739127426 738975983 738584366
2013.6 738584366 738544617 738690872 739079132 739372711 739774704 740447998 740188065 740218811 739590225 738550034
2023.3 738550034 737867050 737233200 737027512 737071381 737873306 738690491 739367523 739333954 739047241 738709030
2032.9 738709030 737687836 736989212 736004333 735544205 735711060 736139603 736886444 737482986 738048172
2041.6 738048172 738180847 738151016 737281189 736493225 735874557 735023651 734772491 734879990 735518036 735802460
2051.2 735802460 736362381 737055740 737090073 736696625 735977631 735613785 734769669 734176483 734189987 734432831
2060.9 734432831 734949646 735558472 736046219 735996475 735988388 735609741 735460663 734934616 733955612 733536682
2070.5 733536682 733039474 733395081 734280014 735382996 735849686 735653610 735667191 735168152 734439545 733475571
2080.2 733475571 732975693 732572403 732629089 733256912 733688736 734338760 734331360 734419861 734324265 734026871
2089.8 734026871 733601990 732499313 731934662 731691208 731839066 732391891 733286743 733728104 733674469 733583527
2099.5 733583527 733058090 732695618 731853027 731355209 731338654 731227951 731303711 731502457 731994934 732131195
2109.1 732131195 732342834 732052841 731529999 731331177 731078339 730613861 729794693 730011749 730341873 730711975
2118.7 730711975 731120987 731082077 731270752 731204681 731119308 730369797 729766846 729586258 729318314 729482117
2128.4 729482117 729993515 730770950 730843430 730906067 730794907 730389938 730015717 729579849 729411240 728906860
2138 728906860 729190903 729532394 729767227 730373764 730711746 730944366 730227814 729632874 729240265 728774490
2147.7 728774490 728646088 728887711 729610901 730172729 730818329 731008835 730979462 730911789 730478668 729858932
2157.3 729858932 729336319 729203873 729060059 729365234 729612503 729816055 729961624 730306625 730879288 730485306
2167 730485306 730000458 729427948 729479980 729519882 729119339 729682159 730362778 731007919 731109161 731053162
2176.6 731053162 730754395 730102539 729820404 729830475 730144043 729653625 729472427 730251312 731101303 731118393
2186.3 731118393 730943985 731310043 730890884 730820847 730502777 730026855 730052261 729996033 730291443 730380249
2195.9 730380249 731139069 731585388 731453171 731438675 731096420 730706711 730190735 730353165 730362396 730337906
2205.5 730337906 730591888 730838928 731217804 731157227 731253967 731080170 730812531 730497513 730216904 730154877
2215.2 730154877 730090332 730358582 730462570 731028137 731427536 731626663 731859970 731463623 730868607 730172272
2224.8 730172272 730107193 729917984 729892502 730405502 730755997 731136780 731287460 731641388 731522141 730843277
2234.5 730843277 730165253 729935455 730093536 730022964 730157166 730412827 731023483 731403580 731493607 731405029
2244.1 731405029 731006622 730709839 730030060 729690857 729710541 729755936 729906998 730477982 730858841 730547333
2253.8 730547333 730664291 730691147 730780869 730500488 729749374 729252167 729207611 729791107 729787140 730026169
2263.4 730026169 730453720 730378723 730267792 730206680 730128708 729781189 729769287 729591904 729388504 728938980
2273 728938980 728870621 729487000 729607391 729957275 729876404 729860916 729725342 729397659 729294510 728640213
2282.7 728640213 728556595 728436279 728605499 728880768 729033890 729412460 729147415 728974380 728647842 728741302
2292.3 728741302 728750153 728317642 728016129 728149567 728776245 728119659 727620163 727481766 727557220 727938004
2302 727938004 727649231 727660370 727494202 727350845 727007294 727237549 727775345 727276382 727053223 727103577
2311.6 727103577 727398987 727027588 726912766 727046280 726685867 727083130 727283554 727094421 726381302 726141129
2321.3 726141129 726149902 726354752 726901321 726592484 726711273 726552658 726421890 726035461 725756149 725674286
2330.9 725674286 725307617 725613632 725018845 725828018 726786575 725462036 723972473 724019318 724898376
2339.6 724898376 723861237 723210678 724087906 724548187 723916626 723308334 722972946 722852707 723277512
2348.3 723277512 723944168 724945831 724899979 725170059 725265274 724151611 724511795 723747635 722961502 722231140
2357.9 722231140 721275864 721331711 721885834 722973175 722680206 722229691 722114563 722901917 723559723 723124237
2367.6 723124237 721939926 720978775 721241760 721774979 721582947 720151749 719794922 719986496 720091476
2376.2 720091476 719824600 718664780 718596573 718631973 718742218 718735657 718030624 717907028 717909622 717711716
2385.9 717711716 717674179 717860031 717694168 717540894 717357483 716826553 716388092 715722580 715740280 715991058
2395.5 715991058 715886154 715773087 715850983 716315536 716200485 715579300 714748459 714380722 713902893 713087006
2405.2 713087006 713273315 713808212 714193344 714177094 714049149 713985596 713752594 713008499 712021561 711797104
2414.8 711797104 711512146 710936356 710535583 710853958 711274109 711363297 711494064 711001282 710537720 709946213
2424.5 709946213 709572372 709359970 708797226 708492661 708193436 708387604 708369598 708289185 708359985 708148422
2434.1 708148422 708104858 707812271 707237930 705912323 705093613 705121918 705027313 705206451 705314941 705552368
2443.7 705552368 705644455 705598831 705278091 704452057 703580093 702978973 702921448 702749329 702718735 702907867
2453.4 702907867 703119736 703084717 702666702 702386169 701732864 700884018 700327225 699926834 699332657 699181824
2463 699181824 699425659 699392471 699681396 699812622 699699936 699267654 698530273 697745895 696883163 696443024
2472.7 696443024 696250458 696110229 695741425 695987549 696431885 696166458 696150970 695719833 694813919 694196854
2482.3 694196854 693630295 692739944 692258072 692261200 692222214 692675171 692790604 692393799 691999130 691625519
2492 691625519 690879517 689966583 689714508 689337769 688891983 688649673 688643494 688746643 688790741 688849335 688427582
2502.6 688427582 687754745 686934204 686420822 685729599 684765472 684373016 684495926 685060501 685087204 684899597
2512.2 684899597 684595108 684231110 684204330 683752365 683115463 682430573 682133713 681957169 681583557 681216583
2521.9 681216583 681115036 681334457 681022720 680783920 680492020 680065231 679571609 678769455 678338547 678223877
2531.5 678223877 678246613 678032379 678005524 677775574 677279358 677044601 676436996 675770416 675292435 675443115
2541.1 675443115 675188293 674490280 674433899 674576950 674954605 674653625 674011078 673615570 673324966 672896805
2550.8 672896805 672176971 671881485 671576309 671406631 671461105 671581268 671223297 670480499 670251617 669970169
2560.4 669970169 669775162 669352264 668758698 668315659 668079071 668293762 668412399 668407822 668154144 667888336
2570.1 667888336 667345428 667029724 666915054 666022949 665587006 665574875 665417252 664986725 664580307 664348068
2579.7 664348068 663883896 663633804 663666992 663744202 663219452 662760773 662406769 661845703 661793823 661693268
2589.4 661693268 661774597 661745529 661423264 661144104 660644608 660219040 659852142 659247742 658756561 658655777
2599 658655777 657953644 657647171 658213959 658264923 657798080 656944351 656412430 656114044 655857544 655444870
2608.6 655444870 655115509 655264740 654985428 654668045 654251633 653902130 653471298 652778397 652430038 651999664
2618.3 651999664 651827469 651624756 651245041 650922165 650746994 650410919 649839478 649634552 649251022 649038162
2627.9 649038162 648580627 648194885 648272705 647877045 647441483 646817474 646602707 646629868 646432343 645869598
2637.6 645869598 644870529 644354706 644021835 644122849 643968277 643419418 643095856 642678528 642596970 642320786
2647.2 642320786 641842041 641354294 641078186 640854340 640373001 640213776 639690704 638997116 639082947 639433022
2656.9 639433022 639160118 638661003 638197021 637778511 637731819 637477760 637040977 636473312 635926971 635528564
2666.5 635528564 635430565 635550232 635516052 635793495 635412674 634717979 634513359 634204979 633991241 633756218
2676.1 633756218 633657494 633463478 633145866 633078575 633007851 632658081 632319183 632065544 631486397 631080475
2685.8 631080475 630668373 630445862 630432129 630077209 629732094 629546585 629715652 629507790 629091988 628766899
2695.4 628766899 628283424 627858734 627350197 627286072 627243195 627179604 627219315 627132530 626994972 626537933
2705.1 626537933 626155624 625685043 625466499 625378456 625169106 625045700 624691010 624505806 624223785 623992043
2714.7 623992043 623687096 623210716 622939072 622558670 622225151 622060432 622381744 622430916 622082787 622112465
2724.4 622112465 622330360 622368164 621720963 621214828 620948334 620519753 620298958 620154648 619908676 619700470
2734 619700470 619804916 619656830 619484138 619447899 619137535 618829155 618598747 618463936 618169289 617933197
2743.7 617933197 617685165 617768669 618400688 618265190 617663574 617434578 617326126 616956215 616547852 616356621
2753.3 616356621 616086464 615784988 615513954 615499840 615698166 615686188 615566711 615564232 615468254 614976158
2762.9 614976158 614310684 614149475 614183388 613666153 613170090 612927551 613049088 612948303 612183571 612138939
2772.6 612138939 612356796 612322502 612227135 611758423 611391640 610870743 610076065 609736176 609952545 609760704
2782.2 609760704 609162674 608880806 608588600 608203278 607880592 607758980 607589302 607179489 606715584 606137199
2791.9 606137199 605814323 605759697 605478554 605162964 605171967 605130348 604664268 603838348 603095970 602670097
2801.5 602670097 602344666 602012177 601430893 600837402 600363197 599939308 599649887 599451256 599186096 598387794
2811.2 598387794 597609596 597178268 596557999 595834389 595419731 595144348 594800987 594401321 593502312 592877388
2820.8 592877388 592524490 591885872 591375046 590809364 590521278 590110703 589542389 588992348 588131866 587497749
2830.4 587497749 587124252 586828117 586006699 585126114 584677391 584042091 583084297 581932297 581094475
2839.1 581094475 580105896 578824196 577735023 576853752 575476532 573735466 572881050 571883812 570063629
2847.8 570063629 568067856 566675797 565742569 564600029 563715363 562745247 562127686 562068367 562075043 562258987
2857.4 562258987 562492294 562353210 561821060 562011833 562183647 561829185 561229477 560367088 559955254 559549713
2867.1 559549713 559081306 558189354 557371826 557467003 557210579 556567688 556129150 555501938 554788780 554653397
2876.7 554653397 554468384 554063492 553583183 552725182 552289467 552069244 551486588 550444145 549459305
2885.4 549459305 548765106 548602104 548852615 547905045 546704025 545836906 545155602 545092697 544696083 544063072
2895.1 544063072 543334465 542771988 542279396 541630478 540918388 539862556 539273109 539183464 539058914 538463707
2904.7 538463707 537735519 537342377 536679687 536100540 535498543 534529228 533665314 532977905 532124176 530821915
2914.3 530821915 529512062 528764725 528179131 527529984 526716766 525112686 523639793 522614479 521626854
2923 521626854 521204567 520871620 520729675 520755501 520647964 521008987 521575356 521718826 521612320 521541862
2932.7 521541862 521212959 521161575 522000999 522786255 522951279 523542137 524464684 524934959 525529251 525871735
2942.3 525871735 526093864 526735725 527158127 527435608 527816811 528458290 529252510 529731064 530089874 530818672
2952 530818672 531300621 531368484 531428032 531467133 532027550 532575493 532940636 533269844 533558807 533904991
2961.6 533904991 533885460 534424667 535466080 536371307 536723938 536701317 536906738 537214050 538281937 539336014
2971.2 539336014 540071983 540581245 540819092 541528702 541900978 542025108 542284431 542641487 542997360 543389168
2980.9 543389168 543565636 543382759 543672562 543753548 544109230 544753761 544741669 544436607 544224396 544682465
2990.5 544682465 545016403 545365982 545398865 544752388 544596214 544509926 544530067 544477196 544220009 544069328
3000.2 544069328 544112244 544005280 543241692 542574959 541988716 541555634 541329842 541149139 541138687 541012650
3009.8 541012650 540883751 540775909 540618134 539874496 539044418 538726959 538073082 537037201 536726303
3018.5 536726303 537126770 536802330 536323776 535983505 535286903 534805450 534213486 533710365 533112259 532128601
3028.1 532128601 531831055 532276840 532029724 530951500 530490799 530306435 529714127 528785629 527548561
3036.8 527548561 526854439 526716080 526234550 525835648 525562820 525078239 524677696 524004745 523497086 523034897
3046.5 523034897 522331314 521798706 521009712 520746231 520496826 519166107 518070259 517979546 518006210 517518845
3056.1 517518845 516707191 515656586 515275383 515442848 514960670 514163666 513436089 512682304 512154579
3064.8 512154579 512029495 511732903 511165276 510373116 509897003 509680176 508699684 508091278 507984238 507739372
3074.4 507739372 507275772 506708679 506660957 506378059 505684280 504744530 504224968 504300079 504005699 503478470
3084.1 503478470 502863579 502241516 501501846 501025963 500677719 500408478 500203400 499338531 498656387 497926331
3093.7 497926331 497237892 496962700 496625938 496517944 496142197 495515099 494883003 494303246 493712921 493250656
3103.4 493250656 492944908 492478065 491947365 491157188 490589371 490038757 489764938 489558716 488582153 488130608
3113 488130608 488048172 487808456 487219276 486615372 486479263 485932961 484974403 484069901 483676491 483052216
3122.6 483052216 482127647 481609344 481266518 481139259 480531960 479692078 479133530 478671951 478117294 477684059
3132.3 477684059 477222214 476316948 475808067 475204239 474777069 474754906 474116364 473063812 471902161
3141 471902161 471324234 470779266 470059891 469626617 469295540 469177933 468514900 467752686 467512627 467006111
3150.6 467006111 466091194 465666008 465389557 464592476 463979034 463095818 462198410 461657257 461090736 460672913
3160.3 460672913 459970627 459357643 458974648 458396301 457520103 456793213 456469460 455748138 454883919 454229813
3169.9 454229813 453701935 453170929 452525215 452059288 451658936 451358337 450864639 450037537 449419518 448730888
3179.5 448730888 447790260 447130852 446696777 446236305 445783768 445242729 444417038 443353119 442802925
3188.2 442802925 442659760 442019958 440979500 440188141 439924774 439742050 439458008 439139519 438893356
3196.9 438893356 438242912 437028275 436444511 436012154 435347748 434901924 434389458 433880424 433282776
3205.6 433282776 432990189 433027306 432768593 432064056 431003914 430390396 430383606 430168114 429202652 428337669
3215.2 428337669 428362160 428343124 428070374 427759857 426760178 425630035 425229721 424913406 424158249 423755112
3224.9 423755112 423881874 423412323 422454758 422083702 422098427 421839447 421782417 421888618 420939674 419776077
3234.5 419776077 418963623 418132477 418049049 417724762 416994324 416639519 416072884 415647507 415739937 415867424
3244.2 415867424 415358238 414882355 414811172 414021378 413058662 412743492 412616310 412091522 411274185 410888596
3253.8 410888596 411137314 411107292 410136909 409178810 408817482 408676529 408636017 408428993 407886353 407250214
3263.4 407250214 406793747 406485214 406283684 406053276 405757713 405485497 405281677 404948273 404199791 403707771
3273.1 403707771 403631134 403633728 403486481 402814102 402355423 402220917 401887932 401476326 401336670 401369705
3282.7 401369705 401024170 400520477 399796867 399300880 399464264 399298363 398917770 398624840 398415108 398181496
3292.4 398181496 397572327 397193871 397125931 397026978 396739311 396269302 395791321 395430489 395367203 395219612
3302 395219612 395064087 394929352 394707527 394477577 394221115 394405632 394161491 393449593 392967796 392358665
3311.7 392358665 391965027 391241837 390505142 390148544 389763412 389864883 389943008 389428902 388251839 387565689
3321.3 387565689 387835312 387705841 387188911 386751976 386662331 385900345 384440155 383788490 383667221 383542709
3330.9 383542709 382832298 382335358 382247391 381467781 380792694 380495720 380426865 380000305 378948097 378139191
3340.6 378139191 377783279 377506256 376903877 376464729 376036720 375569153 375218468 374905701 375054626 374431992
3350.2 374431992 373547401 373408813 373019905 372688866 372503357 372071419 371301308 370736732 370800438 371130104
3359.9 371130104 371024742 370005035 369429588 369222603 368753891 368549957 368106041 367867088 367849045 367400665
3369.5 367400665 366717491 366301422 366402321 366171722 365696716 365372925 365127220 364911575 364163017 363835945
3379.2 363835945 364253654 363908386 363334236 363377495 363423347 363331604 363041801 362657700 362329903 361973839
3388.8 361973839 361964569 362274055 362698555 362614403 361734924 361192818 361051788 361128311 361269112 360905838
3398.4 360905838 360586815 360682983 360656128 360394363 360388145 360561752 360407295 360064163 359977150 359757462
3408.1 359757462 359292641 359521294 359961662 359925499 359924583 359960136 359973907 360148773 360353165 360404205 360368614
3418.7 360368614 360186081 360170555 360319557 359888611 359526901 360105133 361296082 361786575 361527481 361517677
3428.3 361517677 361584091 361989326 362312546 362608948 363215981 363135948 362914696 362981377 363421516 364001961
3438 364001961 364233208 364432945 364727554 365149498 365040703 365111084 365845642 366683426 367405586 367204247
3447.6 367204247 367532120 368468361 368699722 368719673 369135170 370009384 370696564 371040039 371323509 371854897
3457.3 371854897 372380753 372832832 373778610 374697723 375149574 375046997 375582962 376841011 377404022
3466 377404022 377969360 378695107 379192734 379782143 380415573 380811882 380930214 381667252 382834930 383501282
3475.6 383501282 384251900 384840622 384712791 385273056 386500854 387526169 387979317 388043442 389017143
3484.3 389017143 389756508 390357246 391689911 392213402 392342567 393169594 393952484 394143982 394992104
3493 394992104 396242943 397121201 398319435 399090118 399639969 400200386 400648689 401470909 402429848 402978859
3502.6 402978859 403019066 403664284 404807091 405775833 406204948 407219124 408524513 408629608 409640160
3511.3 409640160 410750427 411154785 411715851 412592468 413970947 414951897 415718727 416409302 417196693
3520 417196693 418142128 419203339 420088081 420357399 421556435 423115692 424223595 424600945 424942513
3528.6 424942513 425749207 426447563 427618713 428888779 430273933 431527901 432587662 433132668 433682785
3537.3 433682785 435297775 436235886 436964951 438354034 439997253 441052971 441960754 442667084 443034439
3546 443034439 444774857 445361748 446515923 448043900 449733925 451851082 450812340 451768646 453279762
3554.7 453279762 454478264 456568413 456989975 458607521 460779572 461838303 461725121 463161507 464897614
3563.4 464897614 466286163 470929794 471919632 470448456 469702187 469864426 473537903 475303268 476980553
3572 476980553 478514366 479816017 481015129 482104568 484200134 484791489 486908455 488893051 489609909
3580.7 489609909 491248207 493184700 494865265 495636177 499359360 501865616 500967827 501935959 501308556
3589.4 501308556 503702011 506542130 509586296 511305389 511712303 514515533 514375229 516566353 519590759
3598.1 519590759 520143471 523312874 524540825 524500618 526385880 528129120 530115585 533420868 536337547
3606.8 536337547 535804825 538134842 537694206 537648048 545194206 547358856 544838600 547822571 547699127
3615.4 547699127 551569176 556133995 556693382 557944756 556946716 558161659 561218033 563999290 566553078
3624.1 566553078 569205170 572065964 575139503 581308784 580385475 570827980 575189247 580199852
3631.8 580199852 585563126 587617722 586619873 588476753 591500587 594056091 595141602 597582779
3639.5 597582779 600324707 602744865 604093018 604494629 607141953 611139755 616541862 615829353 613621597
3648.2 613621597 619122047 618754807 616157303 616089783 621416435 626167107 630604362 635629997 628215485
3656.9 628215485 628846359 633442726 635346489 637651596 638832016 640976257 641590347 642811356 644665756
3665.6 644665756 645747910 650479584 653756638 654107742 652732849 646884766 650977249 659407959
3673.3 659407959 667766800 666401596 649326248 651018677 658288498 662938156 661214142 661865311
3681 661865311 664526215 665677261 666295776 667092590 668328171 672322388 677951508 668557510 667025223
3689.7 667025223 676034851 670172958 668992920 673841248 675094757 675966110 675162811 675306244 677241745
3698.4 677241745 678125610 680701675 683611069 679330444 676917343 680353012 681608810 681902237 682565536
3707 682565536 685825348 689880905 683765335 686500015 689544907 677448044 680274200 684297485
3714.8 684297485 685161285 686243744 688372116 689184418 686589050 687973633 692499237 688560562 685920258
3723.4 685920258 691659546 692991714 692421494 689088211 688887558 692481537 693020782 698022919 695947800
3732.1 695947800 690093079 699275513 699472733 688868790 689533615 691698761 691005096 693181686 696576996
3740.8 696576996 693417587 696353912 707653580 698432007 682824020 692291794 697567215 703036118
3748.5 703036118 699443359 690000534 700557022 694356842 687974167 693930817 697662659 700474854
3756.2 700474854 695367813 696843109 701857910 695325775 694337387 698020859 698897095 699529800 702857285
3764.9 702857285 700277786 695497055 698200760 703126602 703584976 694908905 696096802 699048157
3772.6 699048157 699709015 700831146 700115814 700485992 701487808 704825516 705516891 698486176 699740448
3781.3 699740448 701199951 702023163 704509048 702359085 700757523 701310883 701927338 702619247 702741623
3790 702741623 703027725 702428970 702264404 702171783 703673782 707626495 704730148 700915909 703153839
3798.7 703153839 706781540 711985779 706033554 697366562 700197830 702050247 707109833 711448669
3806.4 711448669 700588837 698354034 703436890 704556351 704291916 704818039 705027390 706331635 711068268
3815.1 711068268 708394775 696309814 702132339 708675995 712336273 710019073 694710770 698723907
3822.8 698723907 703535614 704785233 706703339 706526489 703826447 704288864 705893250 709008331 710223694
3831.4 710223694 702626190 705710526 713200150 706953659 704986267 712271729 704895020 701702499
3839.2 701702499 707937088 701350861 701616821 708529739 705986862 702304459 704786911 706525421
3846.9 706525421 707316666 708616486 707750473 710613327 715981674 710463638 710430832 694853363 695741730
3855.6 695741730 705087509 704357605 703417816 705973511 708216705 710339813 705694580 705776291 711522751
3864.2 711522751 705419922 700232620 704593506 709739456 715188599 707990417 699523392 702795639
3871.9 702795639 708012390 710945892 702477798 702809906 705672607 705679703 708466339 711807175 705882568
3880.6 705882568 699421921 705023041 707220459 709277039 712981720 700191727 701415863 705284271
3888.3 705284271 706309891 709979477 707853699 702448654 704099579 706011276 704964066 706130905
3896.1 706130905 707321243 709271317 710099640 701538544 705786514 707129288 702810211 707979126
3903.8 707979126 705511322 703665466 703675461 703718338 705590057 705658264 705514679 704736023 704973679 705500412
3913.4 705500412 705684814 707475510 709238358 705903320 702392654 705969696 705480652 702072906 704693832
3922.1 704693832 706493149 707450027 705121765 701920700 703623581 705080338 705755234 704457932 704008713
3930.8 704008713 705985794 703813019 702696533 704269791 704585571 704942169 704958725 704810638 704464340
3939.5 704464340 703950729 705777435 706577835 702429428 701448059 702957230 704693069 706175079 704185638
3948.1 704185638 704897003 705938644 703745728 704453888 704522247 703881226 703659668 702825089 703004532
3956.8 703004532 703282700 703716812 704020386 704776230 705248566 704145050 704162674 704839783 704541092 704426727
3966.5 704426727 704671249 704099808 703421097 703152695 703759995 704850235 705475922 705518799 704459915
3975.1 704459915 704079971 704053650 704007645 703891754 703208389 703549423 703694229 703743362 703395767 702481995
3984.8 702481995 702362366 702442245 702975998 703717651 704626465 704133530 703167648 703815765 704391708 704888763
3994.4 704888763 704372101 703751068 703925171 704137878 705160980 705303497
4000.2 705303497
##END=$$ End of the data block
